mesos-builds mailing list archives

Site index · List index
Message view « Date » · « Thread »
Top « Date » · « Thread »
From Apache Jenkins Server <jenk...@builds.apache.org>
Subject Build failed in Jenkins: Mesos » gcc,--verbose --enable-libevent --enable-ssl,ubuntu:14.04,docker||Hadoop #874
Date Mon, 28 Sep 2015 02:21:21 GMT
See <https://builds.apache.org/job/Mesos/COMPILER=gcc,CONFIGURATION=--verbose%20--enable-libevent%20--enable-ssl,OS=ubuntu%3A14.04,label_exp=docker%7C%7CHadoop/874/changes>

Changes:

[joris.van.remoortere] Fixed compiler warning in values tests.

------------------------------------------
[...truncated 17796 lines...]
I0928 02:17:47.483403 27002 process.cpp:3065] Handling HTTP event for process 'testprocess'
with path: '/testprocess/handler3/nested'
[       OK ] ProcessTest.FirewallDisablePaths (9 ms)
[ RUN      ] ProcessTest.FirewallUninstall
I0928 02:17:47.484760 27014 process.cpp:2305] Returning '403 Forbidden' for '/testprocess/handler1'
(firewall rule forbids request)
I0928 02:17:47.485831 27014 process.cpp:2305] Returning '403 Forbidden' for '/testprocess/handler2'
(firewall rule forbids request)
I0928 02:17:47.486914 27003 process.cpp:3065] Handling HTTP event for process 'testprocess'
with path: '/testprocess/handler1'
I0928 02:17:47.488131 27001 process.cpp:3065] Handling HTTP event for process 'testprocess'
with path: '/testprocess/handler2'
[       OK ] ProcessTest.FirewallUninstall (5 ms)
[----------] 43 tests from ProcessTest (98 ms total)

[----------] 3 tests from QueueTest
[ RUN      ] QueueTest.Block
[       OK ] QueueTest.Block (0 ms)
[ RUN      ] QueueTest.Noblock
[       OK ] QueueTest.Noblock (0 ms)
[ RUN      ] QueueTest.Queue
[       OK ] QueueTest.Queue (0 ms)
[----------] 3 tests from QueueTest (0 ms total)

[----------] 3 tests from ReapTest
[ RUN      ] ReapTest.NonChildProcess
[       OK ] ReapTest.NonChildProcess (42 ms)
[ RUN      ] ReapTest.ChildProcess
[       OK ] ReapTest.ChildProcess (31 ms)
[ RUN      ] ReapTest.TerminatedChildProcess
[       OK ] ReapTest.TerminatedChildProcess (23 ms)
[----------] 3 tests from ReapTest (96 ms total)

[----------] 4 tests from SequenceTest
[ RUN      ] SequenceTest.Serialize
[       OK ] SequenceTest.Serialize (11 ms)
[ RUN      ] SequenceTest.DiscardOne
[       OK ] SequenceTest.DiscardOne (10 ms)
[ RUN      ] SequenceTest.DiscardAll
[       OK ] SequenceTest.DiscardAll (11 ms)
[ RUN      ] SequenceTest.Random
[       OK ] SequenceTest.Random (12 ms)
[----------] 4 tests from SequenceTest (44 ms total)

[----------] 4 tests from SharedTest
[ RUN      ] SharedTest.ConstAccess
[       OK ] SharedTest.ConstAccess (0 ms)
[ RUN      ] SharedTest.Null
[       OK ] SharedTest.Null (0 ms)
[ RUN      ] SharedTest.Reset
[       OK ] SharedTest.Reset (0 ms)
[ RUN      ] SharedTest.Own
[       OK ] SharedTest.Own (0 ms)
[----------] 4 tests from SharedTest (0 ms total)

[----------] 3 tests from StatisticsTest
[ RUN      ] StatisticsTest.Empty
[       OK ] StatisticsTest.Empty (0 ms)
[ RUN      ] StatisticsTest.Single
[       OK ] StatisticsTest.Single (0 ms)
[ RUN      ] StatisticsTest.Statistics
[       OK ] StatisticsTest.Statistics (0 ms)
[----------] 3 tests from StatisticsTest (0 ms total)

[----------] 16 tests from SubprocessTest
[ RUN      ] SubprocessTest.Status
[       OK ] SubprocessTest.Status (84 ms)
[ RUN      ] SubprocessTest.PipeOutput
[       OK ] SubprocessTest.PipeOutput (25 ms)
[ RUN      ] SubprocessTest.PipeInput
[       OK ] SubprocessTest.PipeInput (13 ms)
[ RUN      ] SubprocessTest.PipeRedirect
[       OK ] SubprocessTest.PipeRedirect (13 ms)
[ RUN      ] SubprocessTest.PathOutput
[       OK ] SubprocessTest.PathOutput (43 ms)
[ RUN      ] SubprocessTest.PathInput
[       OK ] SubprocessTest.PathInput (13 ms)
[ RUN      ] SubprocessTest.FdOutput
[       OK ] SubprocessTest.FdOutput (42 ms)
[ RUN      ] SubprocessTest.FdInput
[       OK ] SubprocessTest.FdInput (13 ms)
[ RUN      ] SubprocessTest.Default
hello world
[       OK ] SubprocessTest.Default (21 ms)
[ RUN      ] SubprocessTest.Flags
[       OK ] SubprocessTest.Flags (22 ms)
[ RUN      ] SubprocessTest.Environment
[       OK ] SubprocessTest.Environment (25 ms)
[ RUN      ] SubprocessTest.EnvironmentWithSpaces
[       OK ] SubprocessTest.EnvironmentWithSpaces (12 ms)
[ RUN      ] SubprocessTest.EnvironmentWithSpacesAndQuotes
[       OK ] SubprocessTest.EnvironmentWithSpacesAndQuotes (13 ms)
[ RUN      ] SubprocessTest.EnvironmentOverride
[       OK ] SubprocessTest.EnvironmentOverride (13 ms)
[ RUN      ] SubprocessTest.Setup
[       OK ] SubprocessTest.Setup (21 ms)
[ RUN      ] SubprocessTest.SetupStatus
[       OK ] SubprocessTest.SetupStatus (43 ms)
[----------] 16 tests from SubprocessTest (417 ms total)

[----------] 3 tests from TimeSeriesTest
[ RUN      ] TimeSeriesTest.Set
[       OK ] TimeSeriesTest.Set (0 ms)
[ RUN      ] TimeSeriesTest.Sparsify
[       OK ] TimeSeriesTest.Sparsify (0 ms)
[ RUN      ] TimeSeriesTest.Truncate
[       OK ] TimeSeriesTest.Truncate (1 ms)
[----------] 3 tests from TimeSeriesTest (1 ms total)

[----------] 5 tests from TimeTest
[ RUN      ] TimeTest.Arithmetic
[       OK ] TimeTest.Arithmetic (0 ms)
[ RUN      ] TimeTest.Now
[       OK ] TimeTest.Now (0 ms)
[ RUN      ] TimeTest.RFC1123Output
[       OK ] TimeTest.RFC1123Output (0 ms)
[ RUN      ] TimeTest.RFC3339Output
[       OK ] TimeTest.RFC3339Output (0 ms)
[ RUN      ] TimeTest.Output
[       OK ] TimeTest.Output (0 ms)
[----------] 5 tests from TimeTest (0 ms total)

[----------] 1 test from SSL
[ RUN      ] SSL.Disabled
[       OK ] SSL.Disabled (0 ms)
[----------] 1 test from SSL (0 ms total)

[----------] 16 tests from SSLTest
[ RUN      ] SSLTest.BasicSameProcess
[       OK ] SSLTest.BasicSameProcess (17 ms)
[ RUN      ] SSLTest.SSLSocket
[       OK ] SSLTest.SSLSocket (50 ms)
[ RUN      ] SSLTest.NonSSLSocket
I0928 02:17:48.361328 27014 libevent_ssl_socket.cpp:1022] Socket error: error:140760FC:SSL
routines:SSL23_GET_CLIENT_HELLO:unknown protocol
[       OK ] SSLTest.NonSSLSocket (101 ms)
[ RUN      ] SSLTest.NoVerifyBadCA
[       OK ] SSLTest.NoVerifyBadCA (101 ms)
[ RUN      ] SSLTest.RequireBadCA
W0928 02:17:48.569761 27014 openssl.cpp:252] Error with certificate at depth: 0
Issuer: /C=US/O=Test/CN=43915eaececf
Subject: /C=US/O=Test/CN=43915eaececf
Error (18): self signed certificate
I0928 02:17:48.569854 27014 libevent_ssl_socket.cpp:1022] Socket error: error:140890B2:SSL
routines:SSL3_GET_CLIENT_CERTIFICATE:no certificate returned
[       OK ] SSLTest.RequireBadCA (101 ms)
[ RUN      ] SSLTest.VerifyBadCA
W0928 02:17:48.668118 27014 openssl.cpp:252] Error with certificate at depth: 0
Issuer: /C=US/O=Test/CN=43915eaececf
Subject: /C=US/O=Test/CN=43915eaececf
Error (18): self signed certificate
I0928 02:17:48.668186 27014 libevent_ssl_socket.cpp:1022] Socket error: error:140890B2:SSL
routines:SSL3_GET_CLIENT_CERTIFICATE:no certificate returned
[       OK ] SSLTest.VerifyBadCA (101 ms)
[ RUN      ] SSLTest.VerifyCertificate
[       OK ] SSLTest.VerifyCertificate (101 ms)
[ RUN      ] SSLTest.RequireCertificate
[       OK ] SSLTest.RequireCertificate (101 ms)
[ RUN      ] SSLTest.ProtocolMismatch
I0928 02:17:48.955382 26997 ssl_tests.cpp:383] Testing server protocol 'SSL_ENABLE_SSL_V3'
with client protocol 'SSL_ENABLE_SSL_V3'
I0928 02:17:49.056191 26997 ssl_tests.cpp:383] Testing server protocol 'SSL_ENABLE_SSL_V3'
with client protocol 'SSL_ENABLE_TLS_V1_0'
I0928 02:17:49.069605 27014 libevent_ssl_socket.cpp:1022] Socket error: Connection reset by
peer
I0928 02:17:49.157438 26997 ssl_tests.cpp:383] Testing server protocol 'SSL_ENABLE_SSL_V3'
with client protocol 'SSL_ENABLE_TLS_V1_1'
I0928 02:17:49.168526 27014 libevent_ssl_socket.cpp:1022] Socket error: Connection reset by
peer
I0928 02:17:49.258352 26997 ssl_tests.cpp:383] Testing server protocol 'SSL_ENABLE_SSL_V3'
with client protocol 'SSL_ENABLE_TLS_V1_2'
I0928 02:17:49.271724 27014 libevent_ssl_socket.cpp:1022] Socket error: Connection reset by
peer
I0928 02:17:49.359645 26997 ssl_tests.cpp:383] Testing server protocol 'SSL_ENABLE_TLS_V1_0'
with client protocol 'SSL_ENABLE_SSL_V3'
I0928 02:17:49.372056 27014 libevent_ssl_socket.cpp:1022] Socket error: error:1408A10B:SSL
routines:SSL3_GET_CLIENT_HELLO:wrong version number
I0928 02:17:49.460996 26997 ssl_tests.cpp:383] Testing server protocol 'SSL_ENABLE_TLS_V1_0'
with client protocol 'SSL_ENABLE_TLS_V1_0'
I0928 02:17:49.561329 26997 ssl_tests.cpp:383] Testing server protocol 'SSL_ENABLE_TLS_V1_0'
with client protocol 'SSL_ENABLE_TLS_V1_1'
I0928 02:17:49.575135 27014 libevent_ssl_socket.cpp:1022] Socket error: Connection reset by
peer
I0928 02:17:49.661968 26997 ssl_tests.cpp:383] Testing server protocol 'SSL_ENABLE_TLS_V1_0'
with client protocol 'SSL_ENABLE_TLS_V1_2'
I0928 02:17:49.676643 27014 libevent_ssl_socket.cpp:1022] Socket error: Connection reset by
peer
I0928 02:17:49.762358 26997 ssl_tests.cpp:383] Testing server protocol 'SSL_ENABLE_TLS_V1_1'
with client protocol 'SSL_ENABLE_SSL_V3'
I0928 02:17:49.774400 27014 libevent_ssl_socket.cpp:1022] Socket error: error:140760FC:SSL
routines:SSL23_GET_CLIENT_HELLO:unknown protocol
I0928 02:17:49.863068 26997 ssl_tests.cpp:383] Testing server protocol 'SSL_ENABLE_TLS_V1_1'
with client protocol 'SSL_ENABLE_TLS_V1_0'
I0928 02:17:49.874795 27014 libevent_ssl_socket.cpp:1022] Socket error: error:140760FC:SSL
routines:SSL23_GET_CLIENT_HELLO:unknown protocol
I0928 02:17:49.963544 26997 ssl_tests.cpp:383] Testing server protocol 'SSL_ENABLE_TLS_V1_1'
with client protocol 'SSL_ENABLE_TLS_V1_1'
I0928 02:17:50.064750 26997 ssl_tests.cpp:383] Testing server protocol 'SSL_ENABLE_TLS_V1_1'
with client protocol 'SSL_ENABLE_TLS_V1_2'
I0928 02:17:50.076814 27014 libevent_ssl_socket.cpp:1022] Socket error: Connection reset by
peer
I0928 02:17:50.165457 26997 ssl_tests.cpp:383] Testing server protocol 'SSL_ENABLE_TLS_V1_2'
with client protocol 'SSL_ENABLE_SSL_V3'
I0928 02:17:50.176797 27014 libevent_ssl_socket.cpp:1022] Socket error: error:140760FC:SSL
routines:SSL23_GET_CLIENT_HELLO:unknown protocol
I0928 02:17:50.266772 26997 ssl_tests.cpp:383] Testing server protocol 'SSL_ENABLE_TLS_V1_2'
with client protocol 'SSL_ENABLE_TLS_V1_0'
I0928 02:17:50.277273 27014 libevent_ssl_socket.cpp:1022] Socket error: error:140760FC:SSL
routines:SSL23_GET_CLIENT_HELLO:unknown protocol
I0928 02:17:50.366991 26997 ssl_tests.cpp:383] Testing server protocol 'SSL_ENABLE_TLS_V1_2'
with client protocol 'SSL_ENABLE_TLS_V1_1'
I0928 02:17:50.377372 27014 libevent_ssl_socket.cpp:1022] Socket error: error:140760FC:SSL
routines:SSL23_GET_CLIENT_HELLO:unknown protocol
I0928 02:17:50.468255 26997 ssl_tests.cpp:383] Testing server protocol 'SSL_ENABLE_TLS_V1_2'
with client protocol 'SSL_ENABLE_TLS_V1_2'
[       OK ] SSLTest.ProtocolMismatch (1613 ms)
[ RUN      ] SSLTest.ValidDowngrade
W0928 02:17:50.569167 26997 openssl.cpp:360] Failed SSL connections will be downgraded to
a non-SSL socket
[       OK ] SSLTest.ValidDowngrade (102 ms)
[ RUN      ] SSLTest.NoValidDowngrade
I0928 02:17:50.679338 27014 libevent_ssl_socket.cpp:1022] Socket error: error:140760FC:SSL
routines:SSL23_GET_CLIENT_HELLO:unknown protocol
[       OK ] SSLTest.NoValidDowngrade (101 ms)
[ RUN      ] SSLTest.ValidDowngradeEachProtocol
I0928 02:17:50.771194 26997 ssl_tests.cpp:502] Testing server protocol 'SSL_ENABLE_SSL_V3'
W0928 02:17:50.771613 26997 openssl.cpp:360] Failed SSL connections will be downgraded to
a non-SSL socket
I0928 02:17:50.872370 26997 ssl_tests.cpp:502] Testing server protocol 'SSL_ENABLE_TLS_V1_0'
W0928 02:17:50.872743 26997 openssl.cpp:360] Failed SSL connections will be downgraded to
a non-SSL socket
I0928 02:17:50.973419 26997 ssl_tests.cpp:502] Testing server protocol 'SSL_ENABLE_TLS_V1_1'
W0928 02:17:50.973867 26997 openssl.cpp:360] Failed SSL connections will be downgraded to
a non-SSL socket
I0928 02:17:51.074230 26997 ssl_tests.cpp:502] Testing server protocol 'SSL_ENABLE_TLS_V1_2'
W0928 02:17:51.074617 26997 openssl.cpp:360] Failed SSL connections will be downgraded to
a non-SSL socket
[       OK ] SSLTest.ValidDowngradeEachProtocol (403 ms)
[ RUN      ] SSLTest.NoValidDowngradeEachProtocol
I0928 02:17:51.174875 26997 ssl_tests.cpp:549] Testing server protocol 'SSL_ENABLE_SSL_V3'
I0928 02:17:51.183194 27014 libevent_ssl_socket.cpp:1022] Socket error: error:140760FC:SSL
routines:SSL23_GET_CLIENT_HELLO:unknown protocol
I0928 02:17:51.276126 26997 ssl_tests.cpp:549] Testing server protocol 'SSL_ENABLE_TLS_V1_0'
I0928 02:17:51.283752 27014 libevent_ssl_socket.cpp:1022] Socket error: error:140760FC:SSL
routines:SSL23_GET_CLIENT_HELLO:unknown protocol
I0928 02:17:51.376461 26997 ssl_tests.cpp:549] Testing server protocol 'SSL_ENABLE_TLS_V1_1'
I0928 02:17:51.385974 27014 libevent_ssl_socket.cpp:1022] Socket error: error:140760FC:SSL
routines:SSL23_GET_CLIENT_HELLO:unknown protocol
I0928 02:17:51.477970 26997 ssl_tests.cpp:549] Testing server protocol 'SSL_ENABLE_TLS_V1_2'
I0928 02:17:51.485002 27014 libevent_ssl_socket.cpp:1022] Socket error: error:140760FC:SSL
routines:SSL23_GET_CLIENT_HELLO:unknown protocol
[       OK ] SSLTest.NoValidDowngradeEachProtocol (405 ms)
[ RUN      ] SSLTest.PeerAddress
[       OK ] SSLTest.PeerAddress (11 ms)
[ RUN      ] SSLTest.HTTPSGet
[       OK ] SSLTest.HTTPSGet (9 ms)
[ RUN      ] SSLTest.HTTPSPost
[       OK ] SSLTest.HTTPSPost (12 ms)
[----------] 16 tests from SSLTest (3331 ms total)

[----------] Global test environment tear-down
[==========] 158 tests from 23 test cases ran. (4734 ms total)
[  PASSED  ] 158 tests.

  YOU HAVE 3 DISABLED TESTS

make[6]: *** [check-local] Broken pipe
make[6]: Leaving directory `/mesos/mesos-0.26.0/_build/3rdparty/libprocess'
make[5]: *** [check-am] Error 2
make[5]: Leaving directory `/mesos/mesos-0.26.0/_build/3rdparty/libprocess'
make[4]: *** [check-recursive] Error 1
make[4]: Leaving directory `/mesos/mesos-0.26.0/_build/3rdparty/libprocess'
make[3]: *** [check-recursive] Error 1
make[3]: Leaving directory `/mesos/mesos-0.26.0/_build/3rdparty'
make[2]: *** [check] Error 2
make[2]: Leaving directory `/mesos/mesos-0.26.0/_build/3rdparty'
make[1]: *** [check-recursive] Error 1
make[1]: Leaving directory `/mesos/mesos-0.26.0/_build'
make: *** [distcheck] Error 1
+ docker rmi mesos-1443405784-9996
Untagged: mesos-1443405784-9996:latest
Deleted: 9b136ff74902581e06dcf20b6bcd078e885b6ed4147f9d01276bccc61cf7535a
Deleted: f2235284a3b9ef12bc3417d7f53db71ac9c1fe92124ff80d13bb480f5c0ffa63
Deleted: 1d3bc9e50aae7591316a71a504fe3f2507984658bda4ab9fabe809216e671835
Deleted: 0dc892084ab2903d712bd0d7da4ce6573ad5387bc0f2ac7e9d7e3017c5a4a262
Deleted: 39569c9a07ea91d0ddf6fd000028013cd9495b3e210935e967ef43a63e137176
Deleted: aa65a0b6b19c46eb5166fc69547c0e1f6a64c3e872710b857e185f06c74ad853
Deleted: 51a5724d9e15af4a9ce13befb26baf0085d620dde4eaa315f557d54ac1b09ad3
Deleted: 8cac97b1ec8dafb5f162dbc23680c6ebad8f25ead310fbd85ae447cc60374052
Deleted: 46fed3867e0dbc5e6104fc3db84c80c7037e4df34063f61da285025121017e6c
Deleted: 715407beaa9892a4cdb8721eb80e0255a93a6769e132ae72762193b684218a22
Deleted: 5b68dce145b8644068254c53a8618b1cbd22012aeb3847329711c5d5a6591732
Deleted: 9eafffc192220fe59d7f247b009a7f198ed34b959562819587d610a4b137e0ec
Deleted: fc1657648774299ebafa08df8e115b96bd94f270d56a4ed90568707b15b70e9e
Build step 'Execute shell' marked build as failure

Mime
View raw message