mesos-builds mailing list archives

Site index · List index
Message view « Date » · « Thread »
Top « Date » · « Thread »
From Apache Jenkins Server <jenk...@builds.apache.org>
Subject Build failed in Jenkins: Mesos » gcc,--verbose --enable-libevent --enable-ssl,centos:7,docker||Hadoop #879
Date Tue, 29 Sep 2015 00:39:54 GMT
See <https://builds.apache.org/job/Mesos/COMPILER=gcc,CONFIGURATION=--verbose%20--enable-libevent%20--enable-ssl,OS=centos%3A7,label_exp=docker%7C%7CHadoop/879/changes>

Changes:

[benjamin.mahler] Added a SIGPIPE handler for the libprocess tests.

------------------------------------------
[...truncated 16534 lines...]
[       OK ] QueueTest.Queue (0 ms)
[----------] 3 tests from QueueTest (0 ms total)

[----------] 3 tests from ReapTest
[ RUN      ] ReapTest.NonChildProcess
[       OK ] ReapTest.NonChildProcess (44 ms)
[ RUN      ] ReapTest.ChildProcess
[       OK ] ReapTest.ChildProcess (31 ms)
[ RUN      ] ReapTest.TerminatedChildProcess
[       OK ] ReapTest.TerminatedChildProcess (24 ms)
[----------] 3 tests from ReapTest (101 ms total)

[----------] 4 tests from SequenceTest
[ RUN      ] SequenceTest.Serialize
[       OK ] SequenceTest.Serialize (18 ms)
[ RUN      ] SequenceTest.DiscardOne
[       OK ] SequenceTest.DiscardOne (13 ms)
[ RUN      ] SequenceTest.DiscardAll
[       OK ] SequenceTest.DiscardAll (11 ms)
[ RUN      ] SequenceTest.Random
[       OK ] SequenceTest.Random (11 ms)
[----------] 4 tests from SequenceTest (54 ms total)

[----------] 4 tests from SharedTest
[ RUN      ] SharedTest.ConstAccess
[       OK ] SharedTest.ConstAccess (0 ms)
[ RUN      ] SharedTest.Null
[       OK ] SharedTest.Null (0 ms)
[ RUN      ] SharedTest.Reset
[       OK ] SharedTest.Reset (0 ms)
[ RUN      ] SharedTest.Own
[       OK ] SharedTest.Own (0 ms)
[----------] 4 tests from SharedTest (1 ms total)

[----------] 3 tests from StatisticsTest
[ RUN      ] StatisticsTest.Empty
[       OK ] StatisticsTest.Empty (0 ms)
[ RUN      ] StatisticsTest.Single
[       OK ] StatisticsTest.Single (0 ms)
[ RUN      ] StatisticsTest.Statistics
[       OK ] StatisticsTest.Statistics (0 ms)
[----------] 3 tests from StatisticsTest (0 ms total)

[----------] 16 tests from SubprocessTest
[ RUN      ] SubprocessTest.Status
[       OK ] SubprocessTest.Status (86 ms)
[ RUN      ] SubprocessTest.PipeOutput
[       OK ] SubprocessTest.PipeOutput (27 ms)
[ RUN      ] SubprocessTest.PipeInput
[       OK ] SubprocessTest.PipeInput (15 ms)
[ RUN      ] SubprocessTest.PipeRedirect
[       OK ] SubprocessTest.PipeRedirect (15 ms)
[ RUN      ] SubprocessTest.PathOutput
[       OK ] SubprocessTest.PathOutput (43 ms)
[ RUN      ] SubprocessTest.PathInput
[       OK ] SubprocessTest.PathInput (14 ms)
[ RUN      ] SubprocessTest.FdOutput
[       OK ] SubprocessTest.FdOutput (43 ms)
[ RUN      ] SubprocessTest.FdInput
[       OK ] SubprocessTest.FdInput (14 ms)
[ RUN      ] SubprocessTest.Default
hello world
[       OK ] SubprocessTest.Default (21 ms)
[ RUN      ] SubprocessTest.Flags
[       OK ] SubprocessTest.Flags (23 ms)
[ RUN      ] SubprocessTest.Environment
[       OK ] SubprocessTest.Environment (31 ms)
[ RUN      ] SubprocessTest.EnvironmentWithSpaces
[       OK ] SubprocessTest.EnvironmentWithSpaces (17 ms)
[ RUN      ] SubprocessTest.EnvironmentWithSpacesAndQuotes
[       OK ] SubprocessTest.EnvironmentWithSpacesAndQuotes (14 ms)
[ RUN      ] SubprocessTest.EnvironmentOverride
[       OK ] SubprocessTest.EnvironmentOverride (14 ms)
[ RUN      ] SubprocessTest.Setup
[       OK ] SubprocessTest.Setup (22 ms)
[ RUN      ] SubprocessTest.SetupStatus
[       OK ] SubprocessTest.SetupStatus (44 ms)
[----------] 16 tests from SubprocessTest (445 ms total)

[----------] 3 tests from TimeSeriesTest
[ RUN      ] TimeSeriesTest.Set
[       OK ] TimeSeriesTest.Set (0 ms)
[ RUN      ] TimeSeriesTest.Sparsify
[       OK ] TimeSeriesTest.Sparsify (0 ms)
[ RUN      ] TimeSeriesTest.Truncate
[       OK ] TimeSeriesTest.Truncate (1 ms)
[----------] 3 tests from TimeSeriesTest (1 ms total)

[----------] 5 tests from TimeTest
[ RUN      ] TimeTest.Arithmetic
[       OK ] TimeTest.Arithmetic (0 ms)
[ RUN      ] TimeTest.Now
[       OK ] TimeTest.Now (0 ms)
[ RUN      ] TimeTest.RFC1123Output
[       OK ] TimeTest.RFC1123Output (0 ms)
[ RUN      ] TimeTest.RFC3339Output
[       OK ] TimeTest.RFC3339Output (0 ms)
[ RUN      ] TimeTest.Output
[       OK ] TimeTest.Output (0 ms)
[----------] 5 tests from TimeTest (0 ms total)

[----------] 1 test from SSL
[ RUN      ] SSL.Disabled
[       OK ] SSL.Disabled (0 ms)
[----------] 1 test from SSL (0 ms total)

[----------] 16 tests from SSLTest
[ RUN      ] SSLTest.BasicSameProcess
[       OK ] SSLTest.BasicSameProcess (49 ms)
[ RUN      ] SSLTest.SSLSocket
[       OK ] SSLTest.SSLSocket (62 ms)
[ RUN      ] SSLTest.NonSSLSocket
I0929 00:39:35.623829 27645 libevent_ssl_socket.cpp:1025] Socket error: error:140760FC:SSL
routines:SSL23_GET_CLIENT_HELLO:unknown protocol
[       OK ] SSLTest.NonSSLSocket (101 ms)
[ RUN      ] SSLTest.NoVerifyBadCA
[       OK ] SSLTest.NoVerifyBadCA (101 ms)
[ RUN      ] SSLTest.RequireBadCA
W0929 00:39:35.828570 27645 openssl.cpp:252] Error with certificate at depth: 0
Issuer: /C=US/O=Test/CN=c5b522c89baa
Subject: /C=US/O=Test/CN=c5b522c89baa
Error (18): self signed certificate
I0929 00:39:35.828656 27645 libevent_ssl_socket.cpp:1025] Socket error: error:140890B2:SSL
routines:SSL3_GET_CLIENT_CERTIFICATE:no certificate returned
[       OK ] SSLTest.RequireBadCA (101 ms)
[ RUN      ] SSLTest.VerifyBadCA
W0929 00:39:35.928457 27645 openssl.cpp:252] Error with certificate at depth: 0
Issuer: /C=US/O=Test/CN=c5b522c89baa
Subject: /C=US/O=Test/CN=c5b522c89baa
Error (18): self signed certificate
I0929 00:39:35.928553 27645 libevent_ssl_socket.cpp:1025] Socket error: error:140890B2:SSL
routines:SSL3_GET_CLIENT_CERTIFICATE:no certificate returned
[       OK ] SSLTest.VerifyBadCA (101 ms)
[ RUN      ] SSLTest.VerifyCertificate
[       OK ] SSLTest.VerifyCertificate (100 ms)
[ RUN      ] SSLTest.RequireCertificate
[       OK ] SSLTest.RequireCertificate (100 ms)
[ RUN      ] SSLTest.ProtocolMismatch
I0929 00:39:36.211902 27628 ssl_tests.cpp:383] Testing server protocol 'SSL_ENABLE_SSL_V3'
with client protocol 'SSL_ENABLE_SSL_V3'
I0929 00:39:36.311913 27628 ssl_tests.cpp:383] Testing server protocol 'SSL_ENABLE_SSL_V3'
with client protocol 'SSL_ENABLE_TLS_V1_0'
I0929 00:39:36.329828 27645 libevent_ssl_socket.cpp:1025] Socket error: Connection reset by
peer
I0929 00:39:36.412606 27628 ssl_tests.cpp:383] Testing server protocol 'SSL_ENABLE_SSL_V3'
with client protocol 'SSL_ENABLE_TLS_V1_1'
I0929 00:39:36.429491 27645 libevent_ssl_socket.cpp:1025] Socket error: Connection reset by
peer
I0929 00:39:36.513278 27628 ssl_tests.cpp:383] Testing server protocol 'SSL_ENABLE_SSL_V3'
with client protocol 'SSL_ENABLE_TLS_V1_2'
I0929 00:39:36.531148 27645 libevent_ssl_socket.cpp:1025] Socket error: Connection reset by
peer
I0929 00:39:36.614145 27628 ssl_tests.cpp:383] Testing server protocol 'SSL_ENABLE_TLS_V1_0'
with client protocol 'SSL_ENABLE_SSL_V3'
I0929 00:39:36.631155 27645 libevent_ssl_socket.cpp:1025] Socket error: error:1408A10B:SSL
routines:SSL3_GET_CLIENT_HELLO:wrong version number
I0929 00:39:36.715489 27628 ssl_tests.cpp:383] Testing server protocol 'SSL_ENABLE_TLS_V1_0'
with client protocol 'SSL_ENABLE_TLS_V1_0'
I0929 00:39:36.815809 27628 ssl_tests.cpp:383] Testing server protocol 'SSL_ENABLE_TLS_V1_0'
with client protocol 'SSL_ENABLE_TLS_V1_1'
I0929 00:39:36.832765 27645 libevent_ssl_socket.cpp:1025] Socket error: Connection reset by
peer
I0929 00:39:36.916467 27628 ssl_tests.cpp:383] Testing server protocol 'SSL_ENABLE_TLS_V1_0'
with client protocol 'SSL_ENABLE_TLS_V1_2'
I0929 00:39:36.934625 27645 libevent_ssl_socket.cpp:1025] Socket error: Connection reset by
peer
I0929 00:39:37.017508 27628 ssl_tests.cpp:383] Testing server protocol 'SSL_ENABLE_TLS_V1_1'
with client protocol 'SSL_ENABLE_SSL_V3'
I0929 00:39:37.034008 27645 libevent_ssl_socket.cpp:1025] Socket error: error:140760FC:SSL
routines:SSL23_GET_CLIENT_HELLO:unknown protocol
I0929 00:39:37.118777 27628 ssl_tests.cpp:383] Testing server protocol 'SSL_ENABLE_TLS_V1_1'
with client protocol 'SSL_ENABLE_TLS_V1_0'
I0929 00:39:37.135766 27645 libevent_ssl_socket.cpp:1025] Socket error: error:140760FC:SSL
routines:SSL23_GET_CLIENT_HELLO:unknown protocol
I0929 00:39:37.219574 27628 ssl_tests.cpp:383] Testing server protocol 'SSL_ENABLE_TLS_V1_1'
with client protocol 'SSL_ENABLE_TLS_V1_1'
I0929 00:39:37.320731 27628 ssl_tests.cpp:383] Testing server protocol 'SSL_ENABLE_TLS_V1_1'
with client protocol 'SSL_ENABLE_TLS_V1_2'
I0929 00:39:37.342759 27645 libevent_ssl_socket.cpp:1025] Socket error: Connection reset by
peer
I0929 00:39:37.421509 27628 ssl_tests.cpp:383] Testing server protocol 'SSL_ENABLE_TLS_V1_2'
with client protocol 'SSL_ENABLE_SSL_V3'
I0929 00:39:37.437350 27645 libevent_ssl_socket.cpp:1025] Socket error: error:140760FC:SSL
routines:SSL23_GET_CLIENT_HELLO:unknown protocol
I0929 00:39:37.522142 27628 ssl_tests.cpp:383] Testing server protocol 'SSL_ENABLE_TLS_V1_2'
with client protocol 'SSL_ENABLE_TLS_V1_0'
I0929 00:39:37.537034 27645 libevent_ssl_socket.cpp:1025] Socket error: error:140760FC:SSL
routines:SSL23_GET_CLIENT_HELLO:unknown protocol
I0929 00:39:37.622726 27628 ssl_tests.cpp:383] Testing server protocol 'SSL_ENABLE_TLS_V1_2'
with client protocol 'SSL_ENABLE_TLS_V1_1'
I0929 00:39:37.637473 27645 libevent_ssl_socket.cpp:1025] Socket error: error:140760FC:SSL
routines:SSL23_GET_CLIENT_HELLO:unknown protocol
I0929 00:39:37.723294 27628 ssl_tests.cpp:383] Testing server protocol 'SSL_ENABLE_TLS_V1_2'
with client protocol 'SSL_ENABLE_TLS_V1_2'
[       OK ] SSLTest.ProtocolMismatch (1613 ms)
[ RUN      ] SSLTest.ValidDowngrade
W0929 00:39:37.824542 27628 openssl.cpp:360] Failed SSL connections will be downgraded to
a non-SSL socket
[       OK ] SSLTest.ValidDowngrade (101 ms)
[ RUN      ] SSLTest.NoValidDowngrade
I0929 00:39:37.939409 27645 libevent_ssl_socket.cpp:1025] Socket error: error:140760FC:SSL
routines:SSL23_GET_CLIENT_HELLO:unknown protocol
[       OK ] SSLTest.NoValidDowngrade (101 ms)
[ RUN      ] SSLTest.ValidDowngradeEachProtocol
I0929 00:39:38.026502 27628 ssl_tests.cpp:502] Testing server protocol 'SSL_ENABLE_SSL_V3'
W0929 00:39:38.026947 27628 openssl.cpp:360] Failed SSL connections will be downgraded to
a non-SSL socket
I0929 00:39:38.127331 27628 ssl_tests.cpp:502] Testing server protocol 'SSL_ENABLE_TLS_V1_0'
W0929 00:39:38.127749 27628 openssl.cpp:360] Failed SSL connections will be downgraded to
a non-SSL socket
I0929 00:39:38.228521 27628 ssl_tests.cpp:502] Testing server protocol 'SSL_ENABLE_TLS_V1_1'
W0929 00:39:38.228866 27628 openssl.cpp:360] Failed SSL connections will be downgraded to
a non-SSL socket
I0929 00:39:38.329188 27628 ssl_tests.cpp:502] Testing server protocol 'SSL_ENABLE_TLS_V1_2'
W0929 00:39:38.329515 27628 openssl.cpp:360] Failed SSL connections will be downgraded to
a non-SSL socket
[       OK ] SSLTest.ValidDowngradeEachProtocol (404 ms)
[ RUN      ] SSLTest.NoValidDowngradeEachProtocol
I0929 00:39:38.430622 27628 ssl_tests.cpp:549] Testing server protocol 'SSL_ENABLE_SSL_V3'
I0929 00:39:38.442689 27645 libevent_ssl_socket.cpp:1025] Socket error: error:140760FC:SSL
routines:SSL23_GET_CLIENT_HELLO:unknown protocol
I0929 00:39:38.531522 27628 ssl_tests.cpp:549] Testing server protocol 'SSL_ENABLE_TLS_V1_0'
I0929 00:39:38.545312 27645 libevent_ssl_socket.cpp:1025] Socket error: error:140760FC:SSL
routines:SSL23_GET_CLIENT_HELLO:unknown protocol
I0929 00:39:38.632208 27628 ssl_tests.cpp:549] Testing server protocol 'SSL_ENABLE_TLS_V1_1'
I0929 00:39:38.644543 27645 libevent_ssl_socket.cpp:1025] Socket error: error:140760FC:SSL
routines:SSL23_GET_CLIENT_HELLO:unknown protocol
I0929 00:39:38.733554 27628 ssl_tests.cpp:549] Testing server protocol 'SSL_ENABLE_TLS_V1_2'
I0929 00:39:38.749934 27645 libevent_ssl_socket.cpp:1025] Socket error: error:140760FC:SSL
routines:SSL23_GET_CLIENT_HELLO:unknown protocol
[       OK ] SSLTest.NoValidDowngradeEachProtocol (404 ms)
[ RUN      ] SSLTest.PeerAddress
[       OK ] SSLTest.PeerAddress (10 ms)
[ RUN      ] SSLTest.HTTPSGet
[       OK ] SSLTest.HTTPSGet (9 ms)
[ RUN      ] SSLTest.HTTPSPost
[       OK ] SSLTest.HTTPSPost (9 ms)
[----------] 16 tests from SSLTest (3368 ms total)

[----------] Global test environment tear-down
[==========] 159 tests from 23 test cases ran. (4886 ms total)
[  PASSED  ] 159 tests.

  YOU HAVE 2 DISABLED TESTS

W0929 00:39:38.749934 27645 main.cpp:38] RAW: Received signal SIGPIPE; escalating to SIGABRT
*** Aborted at 1443487178 (unix time) try "date -d @1443487178" if you are using GNU date
***
PC: @     0x7f31fbab0ffb raise
*** SIGABRT (@0x3e800006bec) received by PID 27628 (TID 0x7f31ef0b2700) from PID 27628; stack
trace: ***
    @     0x7f31fbab1130 (unknown)
    @     0x7f31fbab0ffb raise
    @           0x4d3cf9 handler()
    @     0x7f31fbab1130 (unknown)
    @     0x7f31fbaae6fa pthread_sigmask
    @           0x6cca3b os::signals::unblock()
    @           0x795508 process::EventLoop::run()
    @           0x75775b _ZNSt12_Bind_simpleIFPFvvEvEE9_M_invokeIIEEEvSt12_Index_tupleIIXspT_EEE
    @           0x7576b5 std::_Bind_simple<>::operator()()
    @           0x75764e std::thread::_Impl<>::_M_run()
    @     0x7f31fb4441e0 (unknown)
    @     0x7f31fbaa9df5 start_thread
    @     0x7f31fabac1ad __clone
make[6]: *** [check-local] Aborted
make[6]: Leaving directory `/mesos/mesos-0.26.0/_build/3rdparty/libprocess'
make[5]: *** [check-am] Error 2
make[5]: Leaving directory `/mesos/mesos-0.26.0/_build/3rdparty/libprocess'
make[4]: *** [check-recursive] Error 1
make[4]: Leaving directory `/mesos/mesos-0.26.0/_build/3rdparty/libprocess'
make[3]: *** [check-recursive] Error 1
make[3]: Leaving directory `/mesos/mesos-0.26.0/_build/3rdparty'
make[2]: *** [check] Error 2
make[2]: Leaving directory `/mesos/mesos-0.26.0/_build/3rdparty'
make[1]: *** [check-recursive] Error 1
make[1]: Leaving directory `/mesos/mesos-0.26.0/_build'
make: *** [distcheck] Error 1
+ docker rmi mesos-1443486324-10338
Untagged: mesos-1443486324-10338:latest
Deleted: 7568d8853ef60809b6e10e5bcfc282172f32d9966a55f3e25f961edf1c6172b4
Deleted: b79512187bc72d948359397f8c625cf0476e200b433c16613bd1e68d558a0f46
Deleted: 3e15915d17c6174661fc8c074287fdf965c0a86a557c72a6b8c2171fe6ab0cb7
Deleted: 9055eefc70eab6e8ce868ca770ad883787d6bdb3cb1c5747f53c5b2dfdfc6e7d
Deleted: 1a770cb09e91f525b5a067e595ee4d838836f481b8355f8b133cd3c236396033
Deleted: 49a6f6c66b88f6341d4202203270d09cee5cfb378c45b0bf51b91064b3cd17b8
Deleted: e892d3e0aaae46db46bb5f934def9d956b0a79bd4fc74dc40b51344cda0df5b2
Deleted: eca429b84ff2036a6674532ba5fbbd3df031105005470da46991d36f646f0c81
Deleted: 8bdd07e2a69542ed2635072d8d3ea2eb89f99f99fa567fde0700179a6894b334
Deleted: 6d82d68992e54423e15a902f5992bc5fe38333d24c78d2b12dd21c48c1c4f0f2
Deleted: 2d46e364688548ecdea5fcf7e63638530572916db764d7d77627878b569c7b38
Deleted: 1fbd1d1265b4564bb751324924b7e8b856876df75e2ca36ebbf8afd0270a6aa5
Build step 'Execute shell' marked build as failure

Mime
View raw message