mesos-builds mailing list archives

Site index · List index
Message view « Date » · « Thread »
Top « Date » · « Thread »
From Vinod Kone <vinodk...@gmail.com>
Subject Re: Build failed in Jenkins: Mesos » clang,--verbose --enable-libevent,ubuntu:14.04,docker||Hadoop #632
Date Mon, 03 Aug 2015 17:54:40 GMT
+benh,joris

is this related to libevent? haven't seen this before with libev. mind
filing a ticket to track?

On Sat, Aug 1, 2015 at 4:32 PM, Apache Jenkins Server <
jenkins@builds.apache.org> wrote:

> See <
> https://builds.apache.org/job/Mesos/COMPILER=clang,CONFIGURATION=--verbose%20--enable-libevent,OS=ubuntu%3A14.04,label_exp=docker%7C%7CHadoop/632/changes
> >
>
> Changes:
>
> [benjamin.hindman] Fixed cgroups oom killer and memory pressure tests on
> Ubuntu 14.04.
>
> ------------------------------------------
> [...truncated 17498 lines...]
> [       OK ] ProcessTest.OnAny (0 ms)
> [ RUN      ] ProcessTest.Then
> [       OK ] ProcessTest.Then (0 ms)
> [ RUN      ] ProcessTest.Repair
> [       OK ] ProcessTest.Repair (1 ms)
> [ RUN      ] ProcessTest.After1
> [       OK ] ProcessTest.After1 (10 ms)
> [ RUN      ] ProcessTest.After2
> [       OK ] ProcessTest.After2 (10 ms)
> [ RUN      ] ProcessTest.Chain
> [       OK ] ProcessTest.Chain (1 ms)
> [ RUN      ] ProcessTest.Discard1
> [       OK ] ProcessTest.Discard1 (0 ms)
> [ RUN      ] ProcessTest.Discard2
> [       OK ] ProcessTest.Discard2 (1 ms)
> [ RUN      ] ProcessTest.Discard3
> [       OK ] ProcessTest.Discard3 (0 ms)
> [ RUN      ] ProcessTest.Spawn
> [       OK ] ProcessTest.Spawn (0 ms)
> [ RUN      ] ProcessTest.Dispatch
> [       OK ] ProcessTest.Dispatch (1 ms)
> [ RUN      ] ProcessTest.Defer1
> [       OK ] ProcessTest.Defer1 (2 ms)
> [ RUN      ] ProcessTest.Defer2
> [       OK ] ProcessTest.Defer2 (0 ms)
> [ RUN      ] ProcessTest.Defer3
> [       OK ] ProcessTest.Defer3 (0 ms)
> [ RUN      ] ProcessTest.Handlers
> [       OK ] ProcessTest.Handlers (1 ms)
> [ RUN      ] ProcessTest.Expect
> [       OK ] ProcessTest.Expect (1 ms)
> [ RUN      ] ProcessTest.Action
> [       OK ] ProcessTest.Action (0 ms)
> [ RUN      ] ProcessTest.Inheritance
> [       OK ] ProcessTest.Inheritance (1 ms)
> [ RUN      ] ProcessTest.Thunk
> [       OK ] ProcessTest.Thunk (0 ms)
> [ RUN      ] ProcessTest.Delegate
> I0801 23:32:42.899466 22152 process.cpp:2962] Delegating message 'func' to
> (24)@172.17.0.99:44356
> [       OK ] ProcessTest.Delegate (0 ms)
> [ RUN      ] ProcessTest.Delay
> [       OK ] ProcessTest.Delay (0 ms)
> [ RUN      ] ProcessTest.Order
> [       OK ] ProcessTest.Order (0 ms)
> [ RUN      ] ProcessTest.Donate
> [       OK ] ProcessTest.Donate (0 ms)
> [ RUN      ] ProcessTest.Exited
> [       OK ] ProcessTest.Exited (1 ms)
> [ RUN      ] ProcessTest.InjectExited
> [       OK ] ProcessTest.InjectExited (0 ms)
> [ RUN      ] ProcessTest.Select
> [       OK ] ProcessTest.Select (1 ms)
> [ RUN      ] ProcessTest.Collect
> [       OK ] ProcessTest.Collect (0 ms)
> [ RUN      ] ProcessTest.Await1
> [       OK ] ProcessTest.Await1 (1 ms)
> [ RUN      ] ProcessTest.Await2
> [       OK ] ProcessTest.Await2 (0 ms)
> [ RUN      ] ProcessTest.Await3
> [       OK ] ProcessTest.Await3 (1 ms)
> [ RUN      ] ProcessTest.Settle
> [       OK ] ProcessTest.Settle (40 ms)
> [ RUN      ] ProcessTest.Pid
> [       OK ] ProcessTest.Pid (0 ms)
> [ RUN      ] ProcessTest.Listener
> [       OK ] ProcessTest.Listener (1 ms)
> [ RUN      ] ProcessTest.Executor
> [       OK ] ProcessTest.Executor (0 ms)
> [ RUN      ] ProcessTest.Remote
> [       OK ] ProcessTest.Remote (2 ms)
> [ RUN      ] ProcessTest.Http1
> [       OK ] ProcessTest.Http1 (1 ms)
> [ RUN      ] ProcessTest.Http2
> [       OK ] ProcessTest.Http2 (2 ms)
> [ RUN      ] ProcessTest.Async
> [       OK ] ProcessTest.Async (2 ms)
> [ RUN      ] ProcessTest.Provide
> I0801 23:32:42.953037 22165 process.cpp:2979] Handling HTTP event for
> process '(46)' with path: '/(46)'
> I0801 23:32:42.953294 22154 process.cpp:1143] Sending file at
> '/tmp/UjxgXV/lorem.txt' with length 446
> [       OK ] ProcessTest.Provide (2 ms)
> [ RUN      ] ProcessTest.Defers
> [       OK ] ProcessTest.Defers (0 ms)
> [ RUN      ] ProcessTest.FromTry
> [       OK ] ProcessTest.FromTry (0 ms)
> [ RUN      ] ProcessTest.PercentEncodedURLs
> I0801 23:32:42.955958 22162 process.cpp:2979] Handling HTTP event for
> process 'id(42)' with path: '/id%2842%29/handler2'
> [       OK ] ProcessTest.PercentEncodedURLs (2 ms)
> [ RUN      ] ProcessTest.FirewallDisablePaths
> I0801 23:32:42.957538 22168 process.cpp:2230] Returning '403 Forbidden'
> for '/testprocess/handler1' (firewall rule forbids request)
> I0801 23:32:42.959039 22162 process.cpp:2979] Handling HTTP event for
> process 'testprocess' with path: '/testprocess/handler2'
> I0801 23:32:42.960542 22168 process.cpp:2230] Returning '403 Forbidden'
> for '/testprocess/handler2/nested' (firewall rule forbids request)
> I0801 23:32:42.962079 22153 process.cpp:2979] Handling HTTP event for
> process 'testprocess' with path: '/testprocess/handler2/nested/path'
> I0801 23:32:42.963629 22152 process.cpp:2979] Handling HTTP event for
> process 'testprocess' with path: '/testprocess/handler3'
> I0801 23:32:42.965394 22156 process.cpp:2979] Handling HTTP event for
> process 'testprocess' with path: '/testprocess/handler3/nested'
> [       OK ] ProcessTest.FirewallDisablePaths (10 ms)
> [ RUN      ] ProcessTest.FirewallUninstall
> I0801 23:32:42.967252 22168 process.cpp:2230] Returning '403 Forbidden'
> for '/testprocess/handler1' (firewall rule forbids request)
> I0801 23:32:42.968614 22168 process.cpp:2230] Returning '403 Forbidden'
> for '/testprocess/handler2' (firewall rule forbids request)
> I0801 23:32:42.970199 22153 process.cpp:2979] Handling HTTP event for
> process 'testprocess' with path: '/testprocess/handler1'
> I0801 23:32:42.971724 22160 process.cpp:2979] Handling HTTP event for
> process 'testprocess' with path: '/testprocess/handler2'
> [       OK ] ProcessTest.FirewallUninstall (6 ms)
> [----------] 47 tests from ProcessTest (102 ms total)
>
> [----------] 3 tests from QueueTest
> [ RUN      ] QueueTest.Block
> [       OK ] QueueTest.Block (0 ms)
> [ RUN      ] QueueTest.Noblock
> [       OK ] QueueTest.Noblock (0 ms)
> [ RUN      ] QueueTest.Queue
> [       OK ] QueueTest.Queue (0 ms)
> [----------] 3 tests from QueueTest (0 ms total)
>
> [----------] 3 tests from ReapTest
> [ RUN      ] ReapTest.NonChildProcess
> [       OK ] ReapTest.NonChildProcess (43 ms)
> [ RUN      ] ReapTest.ChildProcess
> [       OK ] ReapTest.ChildProcess (32 ms)
> [ RUN      ] ReapTest.TerminatedChildProcess
> [       OK ] ReapTest.TerminatedChildProcess (23 ms)
> [----------] 3 tests from ReapTest (98 ms total)
>
> [----------] 4 tests from SequenceTest
> [ RUN      ] SequenceTest.Serialize
> [       OK ] SequenceTest.Serialize (10 ms)
> [ RUN      ] SequenceTest.DiscardOne
> [       OK ] SequenceTest.DiscardOne (11 ms)
> [ RUN      ] SequenceTest.DiscardAll
> [       OK ] SequenceTest.DiscardAll (11 ms)
> [ RUN      ] SequenceTest.Random
> [       OK ] SequenceTest.Random (11 ms)
> [----------] 4 tests from SequenceTest (44 ms total)
>
> [----------] 4 tests from SharedTest
> [ RUN      ] SharedTest.ConstAccess
> [       OK ] SharedTest.ConstAccess (0 ms)
> [ RUN      ] SharedTest.Null
> [       OK ] SharedTest.Null (0 ms)
> [ RUN      ] SharedTest.Reset
> [       OK ] SharedTest.Reset (0 ms)
> [ RUN      ] SharedTest.Own
> [       OK ] SharedTest.Own (1 ms)
> [----------] 4 tests from SharedTest (1 ms total)
>
> [----------] 3 tests from StatisticsTest
> [ RUN      ] StatisticsTest.Empty
> [       OK ] StatisticsTest.Empty (0 ms)
> [ RUN      ] StatisticsTest.Single
> [       OK ] StatisticsTest.Single (0 ms)
> [ RUN      ] StatisticsTest.Statistics
> [       OK ] StatisticsTest.Statistics (0 ms)
> [----------] 3 tests from StatisticsTest (0 ms total)
>
> [----------] 16 tests from SubprocessTest
> [ RUN      ] SubprocessTest.Status
> [       OK ] SubprocessTest.Status (86 ms)
> [ RUN      ] SubprocessTest.PipeOutput
> [       OK ] SubprocessTest.PipeOutput (25 ms)
> [ RUN      ] SubprocessTest.PipeInput
> [       OK ] SubprocessTest.PipeInput (13 ms)
> [ RUN      ] SubprocessTest.PipeRedirect
> [       OK ] SubprocessTest.PipeRedirect (13 ms)
> [ RUN      ] SubprocessTest.PathOutput
> [       OK ] SubprocessTest.PathOutput (43 ms)
> [ RUN      ] SubprocessTest.PathInput
> [       OK ] SubprocessTest.PathInput (13 ms)
> [ RUN      ] SubprocessTest.FdOutput
> [       OK ] SubprocessTest.FdOutput (43 ms)
> [ RUN      ] SubprocessTest.FdInput
> [       OK ] SubprocessTest.FdInput (13 ms)
> [ RUN      ] SubprocessTest.Default
> hello world
> [       OK ] SubprocessTest.Default (21 ms)
> [ RUN      ] SubprocessTest.Flags
> [       OK ] SubprocessTest.Flags (23 ms)
> [ RUN      ] SubprocessTest.Environment
> [       OK ] SubprocessTest.Environment (25 ms)
> [ RUN      ] SubprocessTest.EnvironmentWithSpaces
> [       OK ] SubprocessTest.EnvironmentWithSpaces (13 ms)
> [ RUN      ] SubprocessTest.EnvironmentWithSpacesAndQuotes
> [       OK ] SubprocessTest.EnvironmentWithSpacesAndQuotes (14 ms)
> [ RUN      ] SubprocessTest.EnvironmentOverride
> [       OK ] SubprocessTest.EnvironmentOverride (13 ms)
> [ RUN      ] SubprocessTest.Setup
> [       OK ] SubprocessTest.Setup (21 ms)
> [ RUN      ] SubprocessTest.SetupStatus
> [       OK ] SubprocessTest.SetupStatus (43 ms)
> [----------] 16 tests from SubprocessTest (422 ms total)
>
> [----------] 3 tests from TimeSeriesTest
> [ RUN      ] TimeSeriesTest.Set
> [       OK ] TimeSeriesTest.Set (0 ms)
> [ RUN      ] TimeSeriesTest.Sparsify
> [       OK ] TimeSeriesTest.Sparsify (1 ms)
> [ RUN      ] TimeSeriesTest.Truncate
> [       OK ] TimeSeriesTest.Truncate (0 ms)
> [----------] 3 tests from TimeSeriesTest (1 ms total)
>
> [----------] 5 tests from TimeTest
> [ RUN      ] TimeTest.Arithmetic
> [       OK ] TimeTest.Arithmetic (0 ms)
> [ RUN      ] TimeTest.Now
> ../../../3rdparty/libprocess/src/tests/time_tests.cpp:50: Failure
> Expected: (Microseconds(10)) < (Clock::now() - t1), actual: 8-byte object
> <10-27 00-00 00-00 00-00> vs 0ns
> [  FAILED  ] TimeTest.Now (0 ms)
> [ RUN      ] TimeTest.RFC1123Output
> [       OK ] TimeTest.RFC1123Output (0 ms)
> [ RUN      ] TimeTest.RFC3339Output
> [       OK ] TimeTest.RFC3339Output (0 ms)
> [ RUN      ] TimeTest.Output
> [       OK ] TimeTest.Output (0 ms)
> [----------] 5 tests from TimeTest (0 ms total)
>
> [----------] Global test environment tear-down
> [==========] 133 tests from 18 test cases ran. (1165 ms total)
> [  PASSED  ] 132 tests.
> [  FAILED  ] 1 test, listed below:
> [  FAILED  ] TimeTest.Now
>
>  1 FAILED TEST
>   YOU HAVE 3 DISABLED TESTS
>
> make[6]: *** [check-local] Error 1
> make[6]: Leaving directory `/mesos/mesos-0.24.0/_build/3rdparty/libprocess'
> make[5]: *** [check-am] Error 2
> make[5]: Leaving directory `/mesos/mesos-0.24.0/_build/3rdparty/libprocess'
> make[4]: *** [check-recursive] Error 1
> make[4]: Leaving directory `/mesos/mesos-0.24.0/_build/3rdparty/libprocess'
> make[3]: *** [check-recursive] Error 1
> make[3]: Leaving directory `/mesos/mesos-0.24.0/_build/3rdparty'
> make[2]: *** [check] Error 2
> make[2]: Leaving directory `/mesos/mesos-0.24.0/_build/3rdparty'
> make[1]: *** [check-recursive] Error 1
> make[1]: Leaving directory `/mesos/mesos-0.24.0/_build'
> make: *** [distcheck] Error 1
> + docker rmi mesos-1438471297-30391
> Untagged: mesos-1438471297-30391:latest
> Deleted: 02f8191b29308a8785a9ba777e23518e30270ad042019925075f5aa9af0d4cce
> Deleted: 80d208b902d911799cf737762e0a14f45f43bf140b5bed9e52354b3e9cc4243c
> Deleted: 45c302f361bfbba43748e81ce7c3ea9405cd95a3e1ceca70778c3849121ba053
> Deleted: 955df80b85cb35e79edaa59f6e8b874b71ca17f5eaff976f9a320d19b9bb67c4
> Deleted: 2f664d2bc1a6e0932c7b08095e61a90c0212faf0b8f1a1f64491f47c700e56f6
> Deleted: b6ccc87e42d03004fc09bef12c1b80d2eaffefe77208e3724be49f47275e47be
> Deleted: 1a2fa911db4f851c7f529a2603d491430e1df3ed88c48bc2bce4687033dc6526
> Deleted: cf719842ea6c9da82dec944952b2e18132439c0c49041e791be4f6ba964849c4
> Deleted: 1d56ae74c1150ce40758fc3a258720d420ebd984ad6068bb9e5bdfbdfb9fcb23
> Deleted: 96ecbdcce91bc9a829a80dadc85b7a76fadebc4ff35e0aae9deaf80d4d0a2ffb
> Deleted: 8bb02ccdd35a148384c819652048ef9151352277bf1b5672278629f2000c9bbc
> Deleted: e9ca4c464f20225afb195159c64bf02cdd63a47f41e4e871c6a84a079a822a9e
> Build step 'Execute shell' marked build as failure
>

Mime
  • Unnamed multipart/alternative (inline, None, 0 bytes)
View raw message