mesos-builds mailing list archives

Site index · List index
Message view « Date » · « Thread »
Top « Date » · « Thread »
From Vinod Kone <vinodk...@apache.org>
Subject Re: Build failed in Jenkins: Mesos » gcc,--verbose --enable-libevent --enable-ssl,centos:7,docker||Hadoop #733
Date Wed, 26 Aug 2015 15:17:58 GMT
Joris do you want to disable this test while you investigate?

On Wed, Aug 26, 2015 at 1:25 AM, Apache Jenkins Server <
jenkins@builds.apache.org> wrote:

> See <
> https://builds.apache.org/job/Mesos/COMPILER=gcc,CONFIGURATION=--verbose%20--enable-libevent%20--enable-ssl,OS=centos%3A7,label_exp=docker%7C%7CHadoop/733/changes
> >
>
> Changes:
>
> [yan] Fixed provisioner_backend_tests.cpp which included a Linux-only
> header unconditionally.
>
> ------------------------------------------
> [...truncated 16422 lines...]
> I0826 08:26:22.493010 26535 process.cpp:2288] Returning '403 Forbidden'
> for '/testprocess/handler2' (firewall rule forbids request)
> I0826 08:26:22.494616 26532 process.cpp:3043] Handling HTTP event for
> process 'testprocess' with path: '/testprocess/handler1'
> I0826 08:26:22.495959 26530 process.cpp:3043] Handling HTTP event for
> process 'testprocess' with path: '/testprocess/handler2'
> [       OK ] ProcessTest.FirewallUninstall (6 ms)
> [----------] 47 tests from ProcessTest (101 ms total)
>
> [----------] 3 tests from QueueTest
> [ RUN      ] QueueTest.Block
> [       OK ] QueueTest.Block (0 ms)
> [ RUN      ] QueueTest.Noblock
> [       OK ] QueueTest.Noblock (0 ms)
> [ RUN      ] QueueTest.Queue
> [       OK ] QueueTest.Queue (0 ms)
> [----------] 3 tests from QueueTest (0 ms total)
>
> [----------] 3 tests from ReapTest
> [ RUN      ] ReapTest.NonChildProcess
> [       OK ] ReapTest.NonChildProcess (43 ms)
> [ RUN      ] ReapTest.ChildProcess
> [       OK ] ReapTest.ChildProcess (22 ms)
> [ RUN      ] ReapTest.TerminatedChildProcess
> [       OK ] ReapTest.TerminatedChildProcess (24 ms)
> [----------] 3 tests from ReapTest (89 ms total)
>
> [----------] 4 tests from SequenceTest
> [ RUN      ] SequenceTest.Serialize
> [       OK ] SequenceTest.Serialize (11 ms)
> [ RUN      ] SequenceTest.DiscardOne
> [       OK ] SequenceTest.DiscardOne (11 ms)
> [ RUN      ] SequenceTest.DiscardAll
> [       OK ] SequenceTest.DiscardAll (12 ms)
> [ RUN      ] SequenceTest.Random
> [       OK ] SequenceTest.Random (11 ms)
> [----------] 4 tests from SequenceTest (45 ms total)
>
> [----------] 4 tests from SharedTest
> [ RUN      ] SharedTest.ConstAccess
> [       OK ] SharedTest.ConstAccess (0 ms)
> [ RUN      ] SharedTest.Null
> [       OK ] SharedTest.Null (0 ms)
> [ RUN      ] SharedTest.Reset
> [       OK ] SharedTest.Reset (0 ms)
> [ RUN      ] SharedTest.Own
> [       OK ] SharedTest.Own (1 ms)
> [----------] 4 tests from SharedTest (1 ms total)
>
> [----------] 3 tests from StatisticsTest
> [ RUN      ] StatisticsTest.Empty
> [       OK ] StatisticsTest.Empty (0 ms)
> [ RUN      ] StatisticsTest.Single
> [       OK ] StatisticsTest.Single (0 ms)
> [ RUN      ] StatisticsTest.Statistics
> [       OK ] StatisticsTest.Statistics (0 ms)
> [----------] 3 tests from StatisticsTest (0 ms total)
>
> [----------] 16 tests from SubprocessTest
> [ RUN      ] SubprocessTest.Status
> [       OK ] SubprocessTest.Status (77 ms)
> [ RUN      ] SubprocessTest.PipeOutput
> [       OK ] SubprocessTest.PipeOutput (27 ms)
> [ RUN      ] SubprocessTest.PipeInput
> [       OK ] SubprocessTest.PipeInput (13 ms)
> [ RUN      ] SubprocessTest.PipeRedirect
> [       OK ] SubprocessTest.PipeRedirect (13 ms)
> [ RUN      ] SubprocessTest.PathOutput
> [       OK ] SubprocessTest.PathOutput (43 ms)
> [ RUN      ] SubprocessTest.PathInput
> [       OK ] SubprocessTest.PathInput (14 ms)
> [ RUN      ] SubprocessTest.FdOutput
> [       OK ] SubprocessTest.FdOutput (43 ms)
> [ RUN      ] SubprocessTest.FdInput
> [       OK ] SubprocessTest.FdInput (14 ms)
> [ RUN      ] SubprocessTest.Default
> hello world
> [       OK ] SubprocessTest.Default (21 ms)
> [ RUN      ] SubprocessTest.Flags
> [       OK ] SubprocessTest.Flags (33 ms)
> [ RUN      ] SubprocessTest.Environment
> [       OK ] SubprocessTest.Environment (28 ms)
> [ RUN      ] SubprocessTest.EnvironmentWithSpaces
> [       OK ] SubprocessTest.EnvironmentWithSpaces (14 ms)
> [ RUN      ] SubprocessTest.EnvironmentWithSpacesAndQuotes
> [       OK ] SubprocessTest.EnvironmentWithSpacesAndQuotes (14 ms)
> [ RUN      ] SubprocessTest.EnvironmentOverride
> [       OK ] SubprocessTest.EnvironmentOverride (14 ms)
> [ RUN      ] SubprocessTest.Setup
> [       OK ] SubprocessTest.Setup (21 ms)
> [ RUN      ] SubprocessTest.SetupStatus
> [       OK ] SubprocessTest.SetupStatus (43 ms)
> [----------] 16 tests from SubprocessTest (433 ms total)
>
> [----------] 3 tests from TimeSeriesTest
> [ RUN      ] TimeSeriesTest.Set
> [       OK ] TimeSeriesTest.Set (0 ms)
> [ RUN      ] TimeSeriesTest.Sparsify
> [       OK ] TimeSeriesTest.Sparsify (0 ms)
> [ RUN      ] TimeSeriesTest.Truncate
> [       OK ] TimeSeriesTest.Truncate (1 ms)
> [----------] 3 tests from TimeSeriesTest (1 ms total)
>
> [----------] 5 tests from TimeTest
> [ RUN      ] TimeTest.Arithmetic
> [       OK ] TimeTest.Arithmetic (0 ms)
> [ RUN      ] TimeTest.Now
> ../../../3rdparty/libprocess/src/tests/time_tests.cpp:50: Failure
> Expected: (Microseconds(10)) < (Clock::now() - t1), actual: 8-byte object
> <10-27 00-00 00-00 00-00> vs 0ns
> [  FAILED  ] TimeTest.Now (0 ms)
> [ RUN      ] TimeTest.RFC1123Output
> [       OK ] TimeTest.RFC1123Output (0 ms)
> [ RUN      ] TimeTest.RFC3339Output
> [       OK ] TimeTest.RFC3339Output (0 ms)
> [ RUN      ] TimeTest.Output
> [       OK ] TimeTest.Output (0 ms)
> [----------] 5 tests from TimeTest (0 ms total)
>
> [----------] 1 test from SSL
> [ RUN      ] SSL.Disabled
> [       OK ] SSL.Disabled (0 ms)
> [----------] 1 test from SSL (0 ms total)
>
> [----------] 16 tests from SSLTest
> [ RUN      ] SSLTest.BasicSameProcess
> [       OK ] SSLTest.BasicSameProcess (11 ms)
> [ RUN      ] SSLTest.SSLSocket
> [       OK ] SSLTest.SSLSocket (124 ms)
> [ RUN      ] SSLTest.NonSSLSocket
> I0826 08:26:23.685082 26535 libevent_ssl_socket.cpp:1022] Socket error:
> error:140760FC:SSL routines:SSL23_GET_CLIENT_HELLO:unknown protocol
> [       OK ] SSLTest.NonSSLSocket (100 ms)
> [ RUN      ] SSLTest.NoVerifyBadCA
> [       OK ] SSLTest.NoVerifyBadCA (102 ms)
> [ RUN      ] SSLTest.RequireBadCA
> W0826 08:26:23.893651 26535 openssl.cpp:252] Error with certificate at
> depth: 0
> Issuer: /C=US/O=Test/CN=5fee2b0f567e
> Subject: /C=US/O=Test/CN=5fee2b0f567e
> Error (18): self signed certificate
> I0826 08:26:23.894132 26535 libevent_ssl_socket.cpp:1022] Socket error:
> error:140890B2:SSL routines:SSL3_GET_CLIENT_CERTIFICATE:no certificate
> returned
> [       OK ] SSLTest.RequireBadCA (101 ms)
> [ RUN      ] SSLTest.VerifyBadCA
> W0826 08:26:23.989367 26535 openssl.cpp:252] Error with certificate at
> depth: 0
> Issuer: /C=US/O=Test/CN=5fee2b0f567e
> Subject: /C=US/O=Test/CN=5fee2b0f567e
> Error (18): self signed certificate
> I0826 08:26:23.989457 26535 libevent_ssl_socket.cpp:1022] Socket error:
> error:140890B2:SSL routines:SSL3_GET_CLIENT_CERTIFICATE:no certificate
> returned
> [       OK ] SSLTest.VerifyBadCA (101 ms)
> [ RUN      ] SSLTest.VerifyCertificate
> [       OK ] SSLTest.VerifyCertificate (101 ms)
> [ RUN      ] SSLTest.RequireCertificate
> [       OK ] SSLTest.RequireCertificate (101 ms)
> [ RUN      ] SSLTest.ProtocolMismatch
> I0826 08:26:24.275238 26518 ssl_tests.cpp:690] Testing server protocol
> 'SSL_ENABLE_SSL_V3' with client protocol 'SSL_ENABLE_SSL_V3'
> I0826 08:26:24.376176 26518 ssl_tests.cpp:690] Testing server protocol
> 'SSL_ENABLE_SSL_V3' with client protocol 'SSL_ENABLE_TLS_V1_0'
> I0826 08:26:24.393797 26535 libevent_ssl_socket.cpp:1022] Socket error:
> Connection reset by peer
> I0826 08:26:24.476616 26518 ssl_tests.cpp:690] Testing server protocol
> 'SSL_ENABLE_SSL_V3' with client protocol 'SSL_ENABLE_TLS_V1_1'
> I0826 08:26:24.493043 26535 libevent_ssl_socket.cpp:1022] Socket error:
> Connection reset by peer
> I0826 08:26:24.577790 26518 ssl_tests.cpp:690] Testing server protocol
> 'SSL_ENABLE_SSL_V3' with client protocol 'SSL_ENABLE_TLS_V1_2'
> I0826 08:26:24.593943 26535 libevent_ssl_socket.cpp:1022] Socket error:
> Connection reset by peer
> I0826 08:26:24.678741 26518 ssl_tests.cpp:690] Testing server protocol
> 'SSL_ENABLE_TLS_V1_0' with client protocol 'SSL_ENABLE_SSL_V3'
> I0826 08:26:24.694699 26535 libevent_ssl_socket.cpp:1022] Socket error:
> error:1408A10B:SSL routines:SSL3_GET_CLIENT_HELLO:wrong version number
> I0826 08:26:24.779474 26518 ssl_tests.cpp:690] Testing server protocol
> 'SSL_ENABLE_TLS_V1_0' with client protocol 'SSL_ENABLE_TLS_V1_0'
> I0826 08:26:24.880211 26518 ssl_tests.cpp:690] Testing server protocol
> 'SSL_ENABLE_TLS_V1_0' with client protocol 'SSL_ENABLE_TLS_V1_1'
> I0826 08:26:24.894925 26535 libevent_ssl_socket.cpp:1022] Socket error:
> Connection reset by peer
> I0826 08:26:24.980723 26518 ssl_tests.cpp:690] Testing server protocol
> 'SSL_ENABLE_TLS_V1_0' with client protocol 'SSL_ENABLE_TLS_V1_2'
> I0826 08:26:24.995939 26535 libevent_ssl_socket.cpp:1022] Socket error:
> Connection reset by peer
> I0826 08:26:25.081640 26518 ssl_tests.cpp:690] Testing server protocol
> 'SSL_ENABLE_TLS_V1_1' with client protocol 'SSL_ENABLE_SSL_V3'
> I0826 08:26:25.095443 26535 libevent_ssl_socket.cpp:1022] Socket error:
> error:140760FC:SSL routines:SSL23_GET_CLIENT_HELLO:unknown protocol
> I0826 08:26:25.182118 26518 ssl_tests.cpp:690] Testing server protocol
> 'SSL_ENABLE_TLS_V1_1' with client protocol 'SSL_ENABLE_TLS_V1_0'
> I0826 08:26:25.196049 26535 libevent_ssl_socket.cpp:1022] Socket error:
> error:140760FC:SSL routines:SSL23_GET_CLIENT_HELLO:unknown protocol
> I0826 08:26:25.282730 26518 ssl_tests.cpp:690] Testing server protocol
> 'SSL_ENABLE_TLS_V1_1' with client protocol 'SSL_ENABLE_TLS_V1_1'
> I0826 08:26:25.383704 26518 ssl_tests.cpp:690] Testing server protocol
> 'SSL_ENABLE_TLS_V1_1' with client protocol 'SSL_ENABLE_TLS_V1_2'
> I0826 08:26:25.398198 26535 libevent_ssl_socket.cpp:1022] Socket error:
> Connection reset by peer
> I0826 08:26:25.484884 26518 ssl_tests.cpp:690] Testing server protocol
> 'SSL_ENABLE_TLS_V1_2' with client protocol 'SSL_ENABLE_SSL_V3'
> I0826 08:26:25.498303 26535 libevent_ssl_socket.cpp:1022] Socket error:
> error:140760FC:SSL routines:SSL23_GET_CLIENT_HELLO:unknown protocol
> I0826 08:26:25.586078 26518 ssl_tests.cpp:690] Testing server protocol
> 'SSL_ENABLE_TLS_V1_2' with client protocol 'SSL_ENABLE_TLS_V1_0'
> I0826 08:26:25.601747 26535 libevent_ssl_socket.cpp:1022] Socket error:
> error:140760FC:SSL routines:SSL23_GET_CLIENT_HELLO:unknown protocol
> I0826 08:26:25.686859 26518 ssl_tests.cpp:690] Testing server protocol
> 'SSL_ENABLE_TLS_V1_2' with client protocol 'SSL_ENABLE_TLS_V1_1'
> I0826 08:26:25.700259 26535 libevent_ssl_socket.cpp:1022] Socket error:
> error:140760FC:SSL routines:SSL23_GET_CLIENT_HELLO:unknown protocol
> I0826 08:26:25.788058 26518 ssl_tests.cpp:690] Testing server protocol
> 'SSL_ENABLE_TLS_V1_2' with client protocol 'SSL_ENABLE_TLS_V1_2'
> [       OK ] SSLTest.ProtocolMismatch (1614 ms)
> [ RUN      ] SSLTest.ValidDowngrade
> W0826 08:26:25.889591 26518 openssl.cpp:360] Failed SSL connections will
> be downgraded to a non-SSL socket
> [       OK ] SSLTest.ValidDowngrade (101 ms)
> [ RUN      ] SSLTest.NoValidDowngrade
> I0826 08:26:26.001678 26535 libevent_ssl_socket.cpp:1022] Socket error:
> error:140760FC:SSL routines:SSL23_GET_CLIENT_HELLO:unknown protocol
> [       OK ] SSLTest.NoValidDowngrade (100 ms)
> [ RUN      ] SSLTest.ValidDowngradeEachProtocol
> I0826 08:26:26.090750 26518 ssl_tests.cpp:809] Testing server protocol
> 'SSL_ENABLE_SSL_V3'
> W0826 08:26:26.091168 26518 openssl.cpp:360] Failed SSL connections will
> be downgraded to a non-SSL socket
> I0826 08:26:26.191488 26518 ssl_tests.cpp:809] Testing server protocol
> 'SSL_ENABLE_TLS_V1_0'
> W0826 08:26:26.191953 26518 openssl.cpp:360] Failed SSL connections will
> be downgraded to a non-SSL socket
> I0826 08:26:26.292645 26518 ssl_tests.cpp:809] Testing server protocol
> 'SSL_ENABLE_TLS_V1_1'
> W0826 08:26:26.293087 26518 openssl.cpp:360] Failed SSL connections will
> be downgraded to a non-SSL socket
> I0826 08:26:26.393800 26518 ssl_tests.cpp:809] Testing server protocol
> 'SSL_ENABLE_TLS_V1_2'
> W0826 08:26:26.394213 26518 openssl.cpp:360] Failed SSL connections will
> be downgraded to a non-SSL socket
> [       OK ] SSLTest.ValidDowngradeEachProtocol (405 ms)
> [ RUN      ] SSLTest.NoValidDowngradeEachProtocol
> I0826 08:26:26.495241 26518 ssl_tests.cpp:856] Testing server protocol
> 'SSL_ENABLE_SSL_V3'
> I0826 08:26:26.506170 26535 libevent_ssl_socket.cpp:1022] Socket error:
> error:140760FC:SSL routines:SSL23_GET_CLIENT_HELLO:unknown protocol
> I0826 08:26:26.596010 26518 ssl_tests.cpp:856] Testing server protocol
> 'SSL_ENABLE_TLS_V1_0'
> I0826 08:26:26.607687 26535 libevent_ssl_socket.cpp:1022] Socket error:
> error:140760FC:SSL routines:SSL23_GET_CLIENT_HELLO:unknown protocol
> I0826 08:26:26.696451 26518 ssl_tests.cpp:856] Testing server protocol
> 'SSL_ENABLE_TLS_V1_1'
> I0826 08:26:26.708940 26535 libevent_ssl_socket.cpp:1022] Socket error:
> error:140760FC:SSL routines:SSL23_GET_CLIENT_HELLO:unknown protocol
> I0826 08:26:26.796860 26518 ssl_tests.cpp:856] Testing server protocol
> 'SSL_ENABLE_TLS_V1_2'
> I0826 08:26:26.809643 26535 libevent_ssl_socket.cpp:1022] Socket error:
> error:140760FC:SSL routines:SSL23_GET_CLIENT_HELLO:unknown protocol
> [       OK ] SSLTest.NoValidDowngradeEachProtocol (402 ms)
> [ RUN      ] SSLTest.PeerAddress
> [       OK ] SSLTest.PeerAddress (9 ms)
> [ RUN      ] SSLTest.HTTPSGet
> [       OK ] SSLTest.HTTPSGet (9 ms)
> [ RUN      ] SSLTest.HTTPSPost
> [       OK ] SSLTest.HTTPSPost (9 ms)
> [----------] 16 tests from SSLTest (3391 ms total)
>
> [----------] Global test environment tear-down
> [==========] 154 tests from 21 test cases ran. (5017 ms total)
> [  PASSED  ] 153 tests.
> [  FAILED  ] 1 test, listed below:
> [  FAILED  ] TimeTest.Now
>
>  1 FAILED TEST
>   YOU HAVE 3 DISABLED TESTS
>
> make[6]: *** [check-local] Error 1
> make[6]: Leaving directory `/mesos/mesos-0.25.0/_build/3rdparty/libprocess'
> make[5]: *** [check-am] Error 2
> make[5]: Leaving directory `/mesos/mesos-0.25.0/_build/3rdparty/libprocess'
> make[4]: *** [check-recursive] Error 1
> make[4]: Leaving directory `/mesos/mesos-0.25.0/_build/3rdparty/libprocess'
> make[3]: Leaving directory `/mesos/mesos-0.25.0/_build/3rdparty'
> make[3]: *** [check-recursive] Error 1
> make[2]: *** [check] Error 2
> make[2]: Leaving directory `/mesos/mesos-0.25.0/_build/3rdparty'
> make[1]: *** [check-recursive] Error 1
> make[1]: Leaving directory `/mesos/mesos-0.25.0/_build'
> make: *** [distcheck] Error 1
> + docker rmi mesos-1440576775-18608
> Untagged: mesos-1440576775-18608:latest
> Deleted: 099e8bc66846d5b9077c4bca8b04c2ed8fabc550a97e06e4ab8f5e12b06fbcb1
> Deleted: 8e3d25ce7403ad4b1339dc4899e6c2d005e6ba07ab1a08447a36fe80c4dd46f1
> Deleted: 6057aa24890f8581de751c933df3731f24338c43587541cc42690bf5ca34967c
> Deleted: 70ff9204bf273d3126f27904af78544eb779d8afffd891d425650bc1fde378f4
> Deleted: abefad0eb5b43a7b82df7bead6f2eb0f9f3afbd23ad6dab68f89c3b3ffd65d2a
> Deleted: d18f5ea7bcfe021f64f2324388e3ce2f858fff6985eaacecbe0f8dc3bace5358
> Deleted: 0e0d6f2109ec2a10dc23bd6ac932baf6c599c09db0663d5a13fc07ca28b83c9b
> Deleted: 7f488bd0b033f1bee178c155256c76c94ace42731b3a808dabc549bf47bd6210
> Deleted: 57976e5f3ec401b5ab00904b6c132089b3d0906dd12b5a83bf17456cd913fca9
> Deleted: f9397733a099a5a8d80538ced5d9be3ca35fdbdf2d27ecbc6a2cac397b3c0ecb
> Deleted: 66ee81656c2af59048e6b114890c33bdf6459c73a6d559329f275313dfb5225f
> Deleted: 7389503e87d83aafe344a17b5fd3a6b94d7859d7171674bb3fcfce29254aee8c
> Build step 'Execute shell' marked build as failure
>

Mime
  • Unnamed multipart/alternative (inline, None, 0 bytes)
View raw message