mesos-builds mailing list archives

Site index · List index
Message view « Date » · « Thread »
Top « Date » · « Thread »
From Apache Jenkins Server <jenk...@builds.apache.org>
Subject Build failed in Jenkins: Mesos » clang,--verbose --enable-libevent,ubuntu:14.04,docker||Hadoop #680
Date Mon, 10 Aug 2015 07:01:48 GMT
See <https://builds.apache.org/job/Mesos/COMPILER=clang,CONFIGURATION=--verbose%20--enable-libevent,OS=ubuntu%3A14.04,label_exp=docker%7C%7CHadoop/680/changes>

Changes:

[mpark] Added Xiaomi to Mesos adopters list.

------------------------------------------
[...truncated 17557 lines...]
[       OK ] ProcessTest.OnAny (0 ms)
[ RUN      ] ProcessTest.Then
[       OK ] ProcessTest.Then (0 ms)
[ RUN      ] ProcessTest.Repair
[       OK ] ProcessTest.Repair (0 ms)
[ RUN      ] ProcessTest.After1
[       OK ] ProcessTest.After1 (11 ms)
[ RUN      ] ProcessTest.After2
[       OK ] ProcessTest.After2 (10 ms)
[ RUN      ] ProcessTest.Chain
[       OK ] ProcessTest.Chain (1 ms)
[ RUN      ] ProcessTest.Discard1
[       OK ] ProcessTest.Discard1 (0 ms)
[ RUN      ] ProcessTest.Discard2
[       OK ] ProcessTest.Discard2 (0 ms)
[ RUN      ] ProcessTest.Discard3
[       OK ] ProcessTest.Discard3 (0 ms)
[ RUN      ] ProcessTest.Spawn
[       OK ] ProcessTest.Spawn (1 ms)
[ RUN      ] ProcessTest.Dispatch
[       OK ] ProcessTest.Dispatch (1 ms)
[ RUN      ] ProcessTest.Defer1
[       OK ] ProcessTest.Defer1 (1 ms)
[ RUN      ] ProcessTest.Defer2
[       OK ] ProcessTest.Defer2 (1 ms)
[ RUN      ] ProcessTest.Defer3
[       OK ] ProcessTest.Defer3 (0 ms)
[ RUN      ] ProcessTest.Handlers
[       OK ] ProcessTest.Handlers (0 ms)
[ RUN      ] ProcessTest.Expect
[       OK ] ProcessTest.Expect (0 ms)
[ RUN      ] ProcessTest.Action
[       OK ] ProcessTest.Action (0 ms)
[ RUN      ] ProcessTest.Inheritance
[       OK ] ProcessTest.Inheritance (0 ms)
[ RUN      ] ProcessTest.Thunk
[       OK ] ProcessTest.Thunk (0 ms)
[ RUN      ] ProcessTest.Delegate
I0810 07:01:49.660029 22792 process.cpp:3002] Delegating message 'func' to (24)@172.17.1.98:44475
[       OK ] ProcessTest.Delegate (1 ms)
[ RUN      ] ProcessTest.Delay
[       OK ] ProcessTest.Delay (0 ms)
[ RUN      ] ProcessTest.Order
[       OK ] ProcessTest.Order (0 ms)
[ RUN      ] ProcessTest.Donate
[       OK ] ProcessTest.Donate (1 ms)
[ RUN      ] ProcessTest.Exited
[       OK ] ProcessTest.Exited (0 ms)
[ RUN      ] ProcessTest.InjectExited
[       OK ] ProcessTest.InjectExited (0 ms)
[ RUN      ] ProcessTest.Select
[       OK ] ProcessTest.Select (1 ms)
[ RUN      ] ProcessTest.Collect
[       OK ] ProcessTest.Collect (0 ms)
[ RUN      ] ProcessTest.Await1
[       OK ] ProcessTest.Await1 (1 ms)
[ RUN      ] ProcessTest.Await2
[       OK ] ProcessTest.Await2 (0 ms)
[ RUN      ] ProcessTest.Await3
[       OK ] ProcessTest.Await3 (0 ms)
[ RUN      ] ProcessTest.Settle
[       OK ] ProcessTest.Settle (41 ms)
[ RUN      ] ProcessTest.Pid
[       OK ] ProcessTest.Pid (0 ms)
[ RUN      ] ProcessTest.Listener
[       OK ] ProcessTest.Listener (0 ms)
[ RUN      ] ProcessTest.Executor
[       OK ] ProcessTest.Executor (0 ms)
[ RUN      ] ProcessTest.Remote
[       OK ] ProcessTest.Remote (2 ms)
[ RUN      ] ProcessTest.Http1
[       OK ] ProcessTest.Http1 (1 ms)
[ RUN      ] ProcessTest.Http2
[       OK ] ProcessTest.Http2 (3 ms)
[ RUN      ] ProcessTest.Async
[       OK ] ProcessTest.Async (2 ms)
[ RUN      ] ProcessTest.Provide
I0810 07:01:49.713490 22784 process.cpp:3019] Handling HTTP event for process '(46)' with
path: '/(46)'
I0810 07:01:49.713781 22783 process.cpp:1152] Sending file at '/tmp/bKkKFr/lorem.txt' with
length 446
[       OK ] ProcessTest.Provide (2 ms)
[ RUN      ] ProcessTest.Defers
[       OK ] ProcessTest.Defers (1 ms)
[ RUN      ] ProcessTest.FromTry
[       OK ] ProcessTest.FromTry (0 ms)
[ RUN      ] ProcessTest.PercentEncodedURLs
I0810 07:01:49.717064 22778 process.cpp:3019] Handling HTTP event for process 'id(42)' with
path: '/id%2842%29/handler2'
[       OK ] ProcessTest.PercentEncodedURLs (3 ms)
[ RUN      ] ProcessTest.FirewallDisablePaths
I0810 07:01:49.718876 22794 process.cpp:2264] Returning '403 Forbidden' for '/testprocess/handler1'
(firewall rule forbids request)
I0810 07:01:49.720490 22782 process.cpp:3019] Handling HTTP event for process 'testprocess'
with path: '/testprocess/handler2'
I0810 07:01:49.722031 22794 process.cpp:2264] Returning '403 Forbidden' for '/testprocess/handler2/nested'
(firewall rule forbids request)
I0810 07:01:49.723706 22784 process.cpp:3019] Handling HTTP event for process 'testprocess'
with path: '/testprocess/handler2/nested/path'
I0810 07:01:49.725178 22792 process.cpp:3019] Handling HTTP event for process 'testprocess'
with path: '/testprocess/handler3'
I0810 07:01:49.726847 22778 process.cpp:3019] Handling HTTP event for process 'testprocess'
with path: '/testprocess/handler3/nested'
[       OK ] ProcessTest.FirewallDisablePaths (9 ms)
[ RUN      ] ProcessTest.FirewallUninstall
I0810 07:01:49.728730 22794 process.cpp:2264] Returning '403 Forbidden' for '/testprocess/handler1'
(firewall rule forbids request)
I0810 07:01:49.730211 22794 process.cpp:2264] Returning '403 Forbidden' for '/testprocess/handler2'
(firewall rule forbids request)
I0810 07:01:49.731823 22792 process.cpp:3019] Handling HTTP event for process 'testprocess'
with path: '/testprocess/handler1'
I0810 07:01:49.733316 22789 process.cpp:3019] Handling HTTP event for process 'testprocess'
with path: '/testprocess/handler2'
[       OK ] ProcessTest.FirewallUninstall (7 ms)
[----------] 47 tests from ProcessTest (102 ms total)

[----------] 3 tests from QueueTest
[ RUN      ] QueueTest.Block
[       OK ] QueueTest.Block (0 ms)
[ RUN      ] QueueTest.Noblock
[       OK ] QueueTest.Noblock (0 ms)
[ RUN      ] QueueTest.Queue
[       OK ] QueueTest.Queue (0 ms)
[----------] 3 tests from QueueTest (0 ms total)

[----------] 3 tests from ReapTest
[ RUN      ] ReapTest.NonChildProcess
[       OK ] ReapTest.NonChildProcess (44 ms)
[ RUN      ] ReapTest.ChildProcess
[       OK ] ReapTest.ChildProcess (31 ms)
[ RUN      ] ReapTest.TerminatedChildProcess
[       OK ] ReapTest.TerminatedChildProcess (23 ms)
[----------] 3 tests from ReapTest (98 ms total)

[----------] 4 tests from SequenceTest
[ RUN      ] SequenceTest.Serialize
[       OK ] SequenceTest.Serialize (11 ms)
[ RUN      ] SequenceTest.DiscardOne
[       OK ] SequenceTest.DiscardOne (11 ms)
[ RUN      ] SequenceTest.DiscardAll
[       OK ] SequenceTest.DiscardAll (11 ms)
[ RUN      ] SequenceTest.Random
[       OK ] SequenceTest.Random (11 ms)
[----------] 4 tests from SequenceTest (44 ms total)

[----------] 4 tests from SharedTest
[ RUN      ] SharedTest.ConstAccess
[       OK ] SharedTest.ConstAccess (0 ms)
[ RUN      ] SharedTest.Null
[       OK ] SharedTest.Null (0 ms)
[ RUN      ] SharedTest.Reset
[       OK ] SharedTest.Reset (0 ms)
[ RUN      ] SharedTest.Own
[       OK ] SharedTest.Own (1 ms)
[----------] 4 tests from SharedTest (1 ms total)

[----------] 3 tests from StatisticsTest
[ RUN      ] StatisticsTest.Empty
[       OK ] StatisticsTest.Empty (0 ms)
[ RUN      ] StatisticsTest.Single
[       OK ] StatisticsTest.Single (0 ms)
[ RUN      ] StatisticsTest.Statistics
[       OK ] StatisticsTest.Statistics (0 ms)
[----------] 3 tests from StatisticsTest (0 ms total)

[----------] 16 tests from SubprocessTest
[ RUN      ] SubprocessTest.Status
[       OK ] SubprocessTest.Status (85 ms)
[ RUN      ] SubprocessTest.PipeOutput
[       OK ] SubprocessTest.PipeOutput (25 ms)
[ RUN      ] SubprocessTest.PipeInput
[       OK ] SubprocessTest.PipeInput (13 ms)
[ RUN      ] SubprocessTest.PipeRedirect
[       OK ] SubprocessTest.PipeRedirect (13 ms)
[ RUN      ] SubprocessTest.PathOutput
[       OK ] SubprocessTest.PathOutput (43 ms)
[ RUN      ] SubprocessTest.PathInput
[       OK ] SubprocessTest.PathInput (13 ms)
[ RUN      ] SubprocessTest.FdOutput
[       OK ] SubprocessTest.FdOutput (43 ms)
[ RUN      ] SubprocessTest.FdInput
[       OK ] SubprocessTest.FdInput (13 ms)
[ RUN      ] SubprocessTest.Default
hello world
[       OK ] SubprocessTest.Default (22 ms)
[ RUN      ] SubprocessTest.Flags
[       OK ] SubprocessTest.Flags (22 ms)
[ RUN      ] SubprocessTest.Environment
[       OK ] SubprocessTest.Environment (26 ms)
[ RUN      ] SubprocessTest.EnvironmentWithSpaces
[       OK ] SubprocessTest.EnvironmentWithSpaces (13 ms)
[ RUN      ] SubprocessTest.EnvironmentWithSpacesAndQuotes
[       OK ] SubprocessTest.EnvironmentWithSpacesAndQuotes (13 ms)
[ RUN      ] SubprocessTest.EnvironmentOverride
[       OK ] SubprocessTest.EnvironmentOverride (13 ms)
[ RUN      ] SubprocessTest.Setup
[       OK ] SubprocessTest.Setup (22 ms)
[ RUN      ] SubprocessTest.SetupStatus
[       OK ] SubprocessTest.SetupStatus (42 ms)
[----------] 16 tests from SubprocessTest (421 ms total)

[----------] 3 tests from TimeSeriesTest
[ RUN      ] TimeSeriesTest.Set
[       OK ] TimeSeriesTest.Set (0 ms)
[ RUN      ] TimeSeriesTest.Sparsify
[       OK ] TimeSeriesTest.Sparsify (1 ms)
[ RUN      ] TimeSeriesTest.Truncate
[       OK ] TimeSeriesTest.Truncate (0 ms)
[----------] 3 tests from TimeSeriesTest (1 ms total)

[----------] 5 tests from TimeTest
[ RUN      ] TimeTest.Arithmetic
[       OK ] TimeTest.Arithmetic (0 ms)
[ RUN      ] TimeTest.Now
../../../3rdparty/libprocess/src/tests/time_tests.cpp:50: Failure
Expected: (Microseconds(10)) < (Clock::now() - t1), actual: 8-byte object <10-27 00-00
00-00 00-00> vs 0ns
[  FAILED  ] TimeTest.Now (0 ms)
[ RUN      ] TimeTest.RFC1123Output
[       OK ] TimeTest.RFC1123Output (0 ms)
[ RUN      ] TimeTest.RFC3339Output
[       OK ] TimeTest.RFC3339Output (0 ms)
[ RUN      ] TimeTest.Output
[       OK ] TimeTest.Output (0 ms)
[----------] 5 tests from TimeTest (1 ms total)

[----------] Global test environment tear-down
[==========] 133 tests from 18 test cases ran. (1167 ms total)
[  PASSED  ] 132 tests.
[  FAILED  ] 1 test, listed below:
[  FAILED  ] TimeTest.Now

 1 FAILED TEST
  YOU HAVE 3 DISABLED TESTS

make[6]: *** [check-local] Error 1
make[6]: Leaving directory `/mesos/mesos-0.24.0/_build/3rdparty/libprocess'
make[5]: *** [check-am] Error 2
make[5]: Leaving directory `/mesos/mesos-0.24.0/_build/3rdparty/libprocess'
make[4]: *** [check-recursive] Error 1
make[4]: Leaving directory `/mesos/mesos-0.24.0/_build/3rdparty/libprocess'
make[3]: Leaving directory `/mesos/mesos-0.24.0/_build/3rdparty'
make[3]: *** [check-recursive] Error 1
make[2]: *** [check] Error 2
make[2]: Leaving directory `/mesos/mesos-0.24.0/_build/3rdparty'
make[1]: Leaving directory `/mesos/mesos-0.24.0/_build'
make[1]: *** [check-recursive] Error 1
make: *** [distcheck] Error 1
+ docker rmi mesos-1439188819-31746
Untagged: mesos-1439188819-31746:latest
Deleted: 4bb5c248e66242efd35b9bd571cc2fd19a4dd1f2577a8087cd5128e183966584
Deleted: 6eb7bfa182071dae68dbfe438f1b531066ef1794c19ffb11cdcfead80d551055
Deleted: aa36acf8121ef141a297742ed4abcc7fadbe0a85be3e4b3452af544a4abcbdf2
Deleted: 1880538a6a305accdc590b6a7384dcd4b651a0fdab0454a3e6081bda56cf55f2
Deleted: 780406cce80d675b9e739e2f6f88f3a3af6ce0090c056ba179db50621e440c54
Deleted: 2f2482983d41f69687d8b12e3d62a054462fcc5ef3aecd8dc6485d2ade45bdf8
Deleted: 64ff883e1b5a892b59d9a3eeee09944cef0445176d2a01d4061b7efa9a2d4668
Deleted: 7342bdeb8b170cd8b89eb150c4b2278959c3c5c6d4048d24d04aa247b0352cbe
Deleted: 004b7864423d97098d3695356b9e625b2473e288af77491cb04d5ff132054b81
Deleted: d40604366995d3050aeb3375f408f77e91d1af5ade6aebe5f596befbd565828e
Deleted: 2d41e8def19d6114d2ebe7745c1f9739018588235d13f967f539baac3a355b82
Deleted: ef53d53ed99fb5a8a9c66b53ba70d6f5a5069dc8228b65223a2194fff5eeaae8
Build step 'Execute shell' marked build as failure

Mime
View raw message