mesos-builds mailing list archives

Site index · List index
Message view « Date » · « Thread »
Top « Date » · « Thread »
From Apache Jenkins Server <jenk...@builds.apache.org>
Subject Build failed in Jenkins: Mesos » gcc,--verbose --enable-libevent,ubuntu:14.04,docker||Hadoop #705
Date Thu, 13 Aug 2015 19:59:58 GMT
See <https://builds.apache.org/job/Mesos/COMPILER=gcc,CONFIGURATION=--verbose%20--enable-libevent,OS=ubuntu%3A14.04,label_exp=docker%7C%7CHadoop/705/changes>

Changes:

[benjamin.mahler] Updated /scheduler endopint to use Request::acceptsMediaType.

[benjamin.mahler] Removed unnecessary std:: prefix in http_api_tests.cpp.

[benjamin.mahler] Ensure the Content-Type is set for the streaming scheduler endpoint.

[benjamin.mahler] Only accept POST requests for /scheduler endpoint.

------------------------------------------
[...truncated 85223 lines...]
Value of: event.get().type()
  Actual: HEARTBEAT
Expected: Event::OFFERS
Which is: OFFERS
../../src/tests/scheduler_tests.cpp:228: Failure
Expected: (0) != (event.get().offers().offers().size()), actual: 0 vs 0
I0813 20:00:42.606860 27116 log.cpp:685] Attempting to append 341 bytes to the log
[libprotobuf FATAL ../3rdparty/libprocess/3rdparty/protobuf-2.5.0/src/google/protobuf/repeated_field.h:824]
CHECK failed: (index) < (size()): 
I0813 20:00:42.607162 27120 coordinator.cpp:341] Coordinator attempting to write APPEND action
at position 3
../../src/tests/scheduler_tests.cpp:237: Failure
Actual function call count doesn't match EXPECT_CALL(containerizer, update(_, _))...
         Expected: to be called at least once
           Actual: never called - unsatisfied and active
../../src/tests/scheduler_tests.cpp:233: Failure
Actual function call count doesn't match EXPECT_CALL(exec, launchTask(_, _))...
         Expected: to be called once
           Actual: never called - unsatisfied and active
../../src/tests/scheduler_tests.cpp:230: Failure
Actual function call count doesn't match EXPECT_CALL(exec, registered(_, _, _, _))...
         Expected: to be called once
           Actual: never called - unsatisfied and active
unknown file: Failure
C++ exception with description "CHECK failed: (index) < (size()): " thrown in the test
body.
I0813 20:00:42.609213 27122 replica.cpp:511] Replica received write request for position 3
I0813 20:00:42.609225 27117 slave.cpp:1209] Will retry registration in 26.60588ms if necessary
I0813 20:00:42.609217 27113 master.cpp:859] Master terminating
I0813 20:00:42.609442 27108 hierarchical.hpp:428] Removed framework 20150813-200042-151130540-54398-27089-0000
I0813 20:00:42.609777 27122 leveldb.cpp:343] Persisting action (360 bytes) to leveldb took
517601ns
I0813 20:00:42.609812 27122 replica.cpp:679] Persisted action at 3
I0813 20:00:42.610157 27109 slave.cpp:3143] master@172.17.2.9:54398 exited
W0813 20:00:42.610195 27109 slave.cpp:3146] Master disconnected! Waiting for a new master
to be elected
I0813 20:00:42.611116 27122 replica.cpp:658] Replica received learned notice for position
3
I0813 20:00:42.611507 27122 leveldb.cpp:343] Persisting action (362 bytes) to leveldb took
355098ns
I0813 20:00:42.611538 27122 replica.cpp:679] Persisted action at 3
I0813 20:00:42.611559 27122 replica.cpp:664] Replica learned APPEND action at position 3
[  FAILED  ] SchedulerTest.TaskRunning (70 ms)
[ RUN      ] SchedulerTest.ReconcileTask
Using temporary directory '/tmp/SchedulerTest_ReconcileTask_yFYxDQ'
I0813 20:00:42.619635 27089 leveldb.cpp:176] Opened db in 2.832412ms
I0813 20:00:42.620666 27089 leveldb.cpp:183] Compacted db in 990274ns
I0813 20:00:42.620719 27089 leveldb.cpp:198] Created db iterator in 18148ns
I0813 20:00:42.620740 27089 leveldb.cpp:204] Seeked to beginning of db in 1958ns
I0813 20:00:42.620751 27089 leveldb.cpp:273] Iterated through 0 keys in the db in 268ns
I0813 20:00:42.620787 27089 replica.cpp:744] Replica recovered with log positions 0 ->
0 with 1 holes and 0 unlearned
I0813 20:00:42.621337 27123 recover.cpp:449] Starting replica recovery
I0813 20:00:42.621711 27121 recover.cpp:475] Replica is in EMPTY status
I0813 20:00:42.622890 27123 replica.cpp:641] Replica in EMPTY status received a broadcasted
recover request
I0813 20:00:42.623292 27120 recover.cpp:195] Received a recover response from a replica in
EMPTY status
I0813 20:00:42.623718 27123 recover.cpp:566] Updating replica status to STARTING
I0813 20:00:42.624054 27118 master.cpp:378] Master 20150813-200042-151130540-54398-27089 (23baf00bc1c5)
started on 172.17.2.9:54398
I0813 20:00:42.624080 27118 master.cpp:380] Flags at startup: --acls="" --allocation_interval="1secs"
--allocator="HierarchicalDRF" --authenticate="false" --authenticate_slaves="true" --authenticators="crammd5"
--credentials="/tmp/SchedulerTest_ReconcileTask_yFYxDQ/credentials" --framework_sorter="drf"
--help="false" --initialize_driver_logging="true" --log_auto_initialize="true" --logbufsecs="0"
--logging_level="INFO" --max_slave_ping_timeouts="5" --quiet="false" --recovery_slave_removal_limit="100%"
--registry="replicated_log" --registry_fetch_timeout="1mins" --registry_store_timeout="25secs"
--registry_strict="true" --root_submissions="true" --slave_ping_timeout="15secs" --slave_reregister_timeout="10mins"
--user_sorter="drf" --version="false" --webui_dir="/mesos/mesos-0.24.0/_inst/share/mesos/webui"
--work_dir="/tmp/SchedulerTest_ReconcileTask_yFYxDQ/master" --zk_session_timeout="10secs"
I0813 20:00:42.624325 27118 master.cpp:427] Master allowing unauthenticated frameworks to
register
I0813 20:00:42.624336 27118 master.cpp:430] Master only allowing authenticated slaves to register
I0813 20:00:42.624341 27118 credentials.hpp:37] Loading credentials for authentication from
'/tmp/SchedulerTest_ReconcileTask_yFYxDQ/credentials'
I0813 20:00:42.624517 27119 leveldb.cpp:306] Persisting metadata (8 bytes) to leveldb took
599681ns
I0813 20:00:42.624542 27119 replica.cpp:323] Persisted replica status to STARTING
I0813 20:00:42.624548 27118 master.cpp:469] Using default 'crammd5' authenticator
I0813 20:00:42.624644 27118 master.cpp:506] Authorization enabled
I0813 20:00:42.624717 27120 recover.cpp:475] Replica is in STARTING status
I0813 20:00:42.624801 27117 whitelist_watcher.cpp:79] No whitelist given
I0813 20:00:42.624867 27113 hierarchical.hpp:346] Initialized hierarchical allocator process
I0813 20:00:42.625814 27112 replica.cpp:641] Replica in STARTING status received a broadcasted
recover request
I0813 20:00:42.625866 27121 master.cpp:1524] The newly elected leader is master@172.17.2.9:54398
with id 20150813-200042-151130540-54398-27089
I0813 20:00:42.625912 27121 master.cpp:1537] Elected as the leading master!
I0813 20:00:42.625941 27121 master.cpp:1307] Recovering from registrar
I0813 20:00:42.626124 27109 recover.cpp:195] Received a recover response from a replica in
STARTING status
I0813 20:00:42.626245 27123 registrar.cpp:311] Recovering registrar
I0813 20:00:42.626689 27108 recover.cpp:566] Updating replica status to VOTING
I0813 20:00:42.627406 27123 leveldb.cpp:306] Persisting metadata (8 bytes) to leveldb took
350151ns
I0813 20:00:42.627437 27123 replica.cpp:323] Persisted replica status to VOTING
I0813 20:00:42.627563 27110 recover.cpp:580] Successfully joined the Paxos group
I0813 20:00:42.627799 27110 recover.cpp:464] Recover process terminated
I0813 20:00:42.628294 27113 log.cpp:661] Attempting to start the writer
I0813 20:00:42.629655 27110 replica.cpp:477] Replica received implicit promise request with
proposal 1
I0813 20:00:42.630053 27110 leveldb.cpp:306] Persisting metadata (8 bytes) to leveldb took
364833ns
I0813 20:00:42.630089 27110 replica.cpp:345] Persisted promised to 1
I0813 20:00:42.630880 27120 coordinator.cpp:231] Coordinator attemping to fill missing position
I0813 20:00:42.632082 27117 replica.cpp:378] Replica received explicit promise request for
position 0 with proposal 2
I0813 20:00:42.632480 27117 leveldb.cpp:343] Persisting action (8 bytes) to leveldb took 361290ns
I0813 20:00:42.632503 27117 replica.cpp:679] Persisted action at 0
I0813 20:00:42.633635 27119 replica.cpp:511] Replica received write request for position 0
I0813 20:00:42.633703 27119 leveldb.cpp:438] Reading position from leveldb took 34444ns
I0813 20:00:42.634188 27119 leveldb.cpp:343] Persisting action (14 bytes) to leveldb took
429349ns
I0813 20:00:42.634225 27119 replica.cpp:679] Persisted action at 0
I0813 20:00:42.634928 27114 replica.cpp:658] Replica received learned notice for position
0
I0813 20:00:42.635445 27114 leveldb.cpp:343] Persisting action (16 bytes) to leveldb took
481162ns
I0813 20:00:42.635476 27114 replica.cpp:679] Persisted action at 0
I0813 20:00:42.635499 27114 replica.cpp:664] Replica learned NOP action at position 0
I0813 20:00:42.636252 27115 log.cpp:677] Writer started with ending position 0
I0813 20:00:42.637204 27111 slave.cpp:1209] Will retry registration in 58.281296ms if necessary
I0813 20:00:42.637236 27108 master.cpp:1134] Dropping 'mesos.internal.RegisterSlaveMessage'
message since not recovered yet
I0813 20:00:42.637588 27109 leveldb.cpp:438] Reading position from leveldb took 34754ns
I0813 20:00:42.641024 27112 registrar.cpp:344] Successfully fetched the registry (0B) in 14.511872ms
I0813 20:00:42.641161 27112 registrar.cpp:443] Applied 1 operations in 29360ns; attempting
to update the 'registry'
I0813 20:00:42.644320 27109 log.cpp:685] Attempting to append 171 bytes to the log
I0813 20:00:42.644551 27111 coordinator.cpp:341] Coordinator attempting to write APPEND action
at position 1
I0813 20:00:42.645483 27118 replica.cpp:511] Replica received write request for position 1
I0813 20:00:42.646026 27118 leveldb.cpp:343] Persisting action (190 bytes) to leveldb took
501762ns
I0813 20:00:42.646061 27118 replica.cpp:679] Persisted action at 1
I0813 20:00:42.646828 27109 replica.cpp:658] Replica received learned notice for position
1
I0813 20:00:42.647209 27109 leveldb.cpp:343] Persisting action (192 bytes) to leveldb took
349781ns
I0813 20:00:42.647241 27109 replica.cpp:679] Persisted action at 1
I0813 20:00:42.647264 27109 replica.cpp:664] Replica learned APPEND action at position 1
I0813 20:00:42.648500 27116 registrar.cpp:488] Successfully updated the 'registry' in 7.265024ms
I0813 20:00:42.648669 27116 registrar.cpp:374] Successfully recovered registrar
I0813 20:00:42.648735 27115 log.cpp:704] Attempting to truncate the log to 1
I0813 20:00:42.648860 27108 coordinator.cpp:341] Coordinator attempting to write TRUNCATE
action at position 2
I0813 20:00:42.649173 27122 master.cpp:1334] Recovered 0 slaves from the Registry (132B) ;
allowing 10mins for slaves to re-register
I0813 20:00:42.649972 27121 replica.cpp:511] Replica received write request for position 2
I0813 20:00:42.650486 27121 leveldb.cpp:343] Persisting action (16 bytes) to leveldb took
416906ns
I0813 20:00:42.650518 27121 replica.cpp:679] Persisted action at 2
I0813 20:00:42.651274 27123 replica.cpp:658] Replica received learned notice for position
2
I0813 20:00:42.651698 27123 leveldb.cpp:343] Persisting action (18 bytes) to leveldb took
337201ns
I0813 20:00:42.651777 27123 leveldb.cpp:401] Deleting ~1 keys from leveldb took 44377ns
I0813 20:00:42.651810 27123 replica.cpp:679] Persisted action at 2
I0813 20:00:42.651847 27123 replica.cpp:664] Replica learned TRUNCATE action at position 2
I0813 20:00:42.665180 27110 slave.cpp:190] Slave started on 212)@172.17.2.9:54398
I0813 20:00:42.665212 27110 slave.cpp:191] Flags at startup: --authenticatee="crammd5" --cgroups_cpu_enable_pids_and_tids_count="false"
--cgroups_enable_cfs="false" --cgroups_hierarchy="/sys/fs/cgroup" --cgroups_limit_swap="false"
--cgroups_root="mesos" --container_disk_watch_interval="15secs" --containerizers="mesos" --credential="/tmp/SchedulerTest_ReconcileTask_lmwNEx/credential"
--default_role="*" --disk_watch_interval="1mins" --docker="docker" --docker_kill_orphans="true"
--docker_remove_delay="6hrs" --docker_socket="/var/run/docker.sock" --docker_stop_timeout="0ns"
--enforce_container_disk_quota="false" --executor_registration_timeout="1mins" --executor_shutdown_grace_period="5secs"
--fetcher_cache_dir="/tmp/SchedulerTest_ReconcileTask_lmwNEx/fetch" --fetcher_cache_size="2GB"
--frameworks_home="" --gc_delay="1weeks" --gc_disk_headroom="0.1" --hadoop_home="" --help="false"
--initialize_driver_logging="true" --isolation="posix/cpu,posix/mem" --launcher_dir="/mesos/mesos-0.24.0/_build/src"
--logbufsecs="0" --logging_level="INFO" --oversubscribed_resources_interval="15secs" --perf_duration="10secs"
--perf_interval="1mins" --qos_correction_interval_min="0ns" --quiet="false" --recover="reconnect"
--recovery_timeout="15mins" --registration_backoff_factor="10ms" --resource_monitoring_interval="1secs"
--resources="cpus:2;mem:1024;disk:1024;ports:[31000-32000]" --revocable_cpu_low_priority="true"
--sandbox_directory="/mnt/mesos/sandbox" --strict="true" --switch_user="true" --version="false"
--work_dir="/tmp/SchedulerTest_ReconcileTask_lmwNEx"
I0813 20:00:42.665722 27110 credentials.hpp:85] Loading credential for authentication from
'/tmp/SchedulerTest_ReconcileTask_lmwNEx/credential'
I0813 20:00:42.665964 27110 slave.cpp:321] Slave using credential for: test-principal
I0813 20:00:42.666393 27089 scheduler.cpp:157] Version: 0.24.0
I0813 20:00:42.666576 27110 slave.cpp:354] Slave resources: cpus(*):2; mem(*):1024; disk(*):1024;
ports(*):[31000-32000]
I0813 20:00:42.666705 27110 slave.cpp:384] Slave hostname: 23baf00bc1c5
I0813 20:00:42.666729 27110 slave.cpp:389] Slave checkpoint: true
I0813 20:00:42.667490 27120 state.cpp:54] Recovering state from '/tmp/SchedulerTest_ReconcileTask_lmwNEx/meta'
I0813 20:00:42.667778 27115 status_update_manager.cpp:202] Recovering status update manager
I0813 20:00:42.668107 27108 slave.cpp:4069] Finished recovery
I0813 20:00:42.668560 27108 slave.cpp:4226] Querying resource estimator for oversubscribable
resources
I0813 20:00:42.668844 27109 slave.cpp:684] New master detected at master@172.17.2.9:54398
I0813 20:00:42.668841 27121 scheduler.cpp:272] New master detected at master@172.17.2.9:54398
I0813 20:00:42.668850 27120 status_update_manager.cpp:176] Pausing sending status updates
I0813 20:00:42.668972 27109 slave.cpp:747] Authenticating with master master@172.17.2.9:54398
I0813 20:00:42.669011 27109 slave.cpp:752] Using default CRAM-MD5 authenticatee
I0813 20:00:42.669147 27109 slave.cpp:720] Detecting new master
I0813 20:00:42.669215 27117 authenticatee.cpp:115] Creating new client SASL connection
I0813 20:00:42.669437 27109 slave.cpp:4240] Received oversubscribable resources  from the
resource estimator
I0813 20:00:42.669478 27112 master.cpp:4693] Authenticating slave(212)@172.17.2.9:54398
I0813 20:00:42.669647 27123 authenticator.cpp:407] Starting authentication session for crammd5_authenticatee(515)@172.17.2.9:54398
I0813 20:00:42.669891 27114 authenticator.cpp:92] Creating new server SASL connection
I0813 20:00:42.670202 27119 authenticatee.cpp:206] Received SASL authentication mechanisms:
CRAM-MD5
I0813 20:00:42.670229 27119 authenticatee.cpp:232] Attempting to authenticate with mechanism
'CRAM-MD5'
I0813 20:00:42.670341 27116 authenticator.cpp:197] Received SASL authentication start
I0813 20:00:42.670387 27116 authenticator.cpp:319] Authentication requires more steps
I0813 20:00:42.670472 27116 authenticatee.cpp:252] Received SASL authentication step
I0813 20:00:42.670570 27115 authenticator.cpp:225] Received SASL authentication step
I0813 20:00:42.670603 27115 auxprop.cpp:102] Request to lookup properties for user: 'test-principal'
realm: '23baf00bc1c5' server FQDN: '23baf00bc1c5' SASL_AUXPROP_VERIFY_AGAINST_HASH: false
SASL_AUXPROP_OVERRIDE: false SASL_AUXPROP_AUTHZID: false 
I0813 20:00:42.670614 27115 auxprop.cpp:174] Looking up auxiliary property '*userPassword'
I0813 20:00:42.670655 27115 auxprop.cpp:174] Looking up auxiliary property '*cmusaslsecretCRAM-MD5'
I0813 20:00:42.670680 27115 auxprop.cpp:102] Request to lookup properties for user: 'test-principal'
realm: '23baf00bc1c5' server FQDN: '23baf00bc1c5' SASL_AUXPROP_VERIFY_AGAINST_HASH: false
SASL_AUXPROP_OVERRIDE: false SASL_AUXPROP_AUTHZID: true 
I0813 20:00:42.670687 27115 auxprop.cpp:124] Skipping auxiliary property '*userPassword' since
SASL_AUXPROP_AUTHZID == true
I0813 20:00:42.670694 27115 auxprop.cpp:124] Skipping auxiliary property '*cmusaslsecretCRAM-MD5'
since SASL_AUXPROP_AUTHZID == true
I0813 20:00:42.670712 27115 authenticator.cpp:311] Authentication success
I0813 20:00:42.670789 27116 authenticatee.cpp:292] Authentication success
I0813 20:00:42.670845 27112 master.cpp:4723] Successfully authenticated principal 'test-principal'
at slave(212)@172.17.2.9:54398
I0813 20:00:42.670869 27115 authenticator.cpp:425] Authentication session cleanup for crammd5_authenticatee(515)@172.17.2.9:54398
I0813 20:00:42.671094 27116 slave.cpp:815] Successfully authenticated with master master@172.17.2.9:54398
I0813 20:00:42.671191 27116 slave.cpp:1209] Will retry registration in 18.615907ms if necessary
I0813 20:00:42.671371 27123 master.cpp:3635] Registering slave at slave(212)@172.17.2.9:54398
(23baf00bc1c5) with id 20150813-200042-151130540-54398-27089-S0
I0813 20:00:42.671628 27123 process.cpp:3043] Handling HTTP event for process 'master' with
path: '/master/api/v1/scheduler'
I0813 20:00:42.671814 27121 registrar.cpp:443] Applied 1 operations in 73325ns; attempting
to update the 'registry'
I0813 20:00:42.672034 27123 master.cpp:1782] Received subscription request for HTTP framework
'default'
I0813 20:00:42.672113 27123 master.cpp:1563] Authorizing framework principal 'test-principal'
to receive offers for role '*'
I0813 20:00:42.672386 27123 master.cpp:1874] Subscribing framework 'default' with checkpointing
disabled and capabilities [  ]
I0813 20:00:42.672750 27111 hierarchical.hpp:391] Added framework 20150813-200042-151130540-54398-27089-0000
I0813 20:00:42.672787 27111 hierarchical.hpp:1008] No resources available to allocate!
I0813 20:00:42.672801 27111 hierarchical.hpp:908] Performed allocation for 0 slaves in 21227ns
I0813 20:00:42.672837 27119 master.hpp:1305] Sending heartbeat to 20150813-200042-151130540-54398-27089-0000
I0813 20:00:42.675727 27115 log.cpp:685] Attempting to append 341 bytes to the log
[libprotobuf FATAL ../3rdparty/libprocess/3rdparty/protobuf-2.5.0/src/google/protobuf/repeated_field.h:824]
CHECK failed: (index) < (size()): 
../../src/tests/scheduler_tests.cpp:337: Failure
Value of: event.get().type()
  Actual: HEARTBEAT
Expected: Event::OFFERS
Which is: OFFERS
../../src/tests/scheduler_tests.cpp:338: Failure
Expected: (0) != (event.get().offers().offers().size()), actual: 0 vs 0
I0813 20:00:42.676072 27118 coordinator.cpp:341] Coordinator attempting to write APPEND action
at position 3
../../src/tests/scheduler_tests.cpp:343: Failure
Actual function call count doesn't match EXPECT_CALL(exec, launchTask(_, _))...
         Expected: to be called once
           Actual: never called - unsatisfied and active
../../src/tests/scheduler_tests.cpp:340: Failure
Actual function call count doesn't match EXPECT_CALL(exec, registered(_, _, _, _))...
         Expected: to be called once
           Actual: never called - unsatisfied and active
unknown file: Failure
C++ exception with description "CHECK failed: (index) < (size()): " thrown in the test
body.
I0813 20:00:42.677289 27112 replica.cpp:511] Replica received write request for position 3
I0813 20:00:42.677821 27112 leveldb.cpp:343] Persisting action (360 bytes) to leveldb took
488382ns
I0813 20:00:42.677855 27112 replica.cpp:679] Persisted action at 3
I0813 20:00:42.678057 27109 master.cpp:859] Master terminating
I0813 20:00:42.678473 27110 hierarchical.hpp:428] Removed framework 20150813-200042-151130540-54398-27089-0000
I0813 20:00:42.678843 27111 replica.cpp:658] Replica received learned notice for position
3
I0813 20:00:42.679287 27110 slave.cpp:3143] master@172.17.2.9:54398 exited
W0813 20:00:42.679321 27110 slave.cpp:3146] Master disconnected! Waiting for a new master
to be elected
I0813 20:00:42.679424 27111 leveldb.cpp:343] Persisting action (362 bytes) to leveldb took
546515ns
I0813 20:00:42.679461 27111 replica.cpp:679] Persisted action at 3
I0813 20:00:42.679497 27111 replica.cpp:664] Replica learned APPEND action at position 3
I0813 20:00:42.681294 27121 registrar.cpp:488] Successfully updated the 'registry' in 9.374208ms
I0813 20:00:42.681584 27114 log.cpp:704] Attempting to truncate the log to 3
I0813 20:00:42.681730 27119 coordinator.cpp:341] Coordinator attempting to write TRUNCATE
action at position 4
I0813 20:00:42.683099 27114 replica.cpp:511] Replica received write request for position 4
I0813 20:00:42.683480 27114 leveldb.cpp:343] Persisting action (16 bytes) to leveldb took
348969ns
I0813 20:00:42.683506 27114 replica.cpp:679] Persisted action at 4
*** Aborted at 1439496042 (unix time) try "date -d @1439496042" if you are using GNU date
***
PC: @           0x8e26c0 mesos::internal::tests::Cluster::Slaves::shutdown()
I0813 20:00:42.690062 27117 slave.cpp:1209] Will retry registration in 22.716087ms if necessary
I0813 20:00:42.696158 27112 slave.cpp:1209] Will retry registration in 105.654802ms if necessary
I0813 20:00:42.713459 27119 slave.cpp:1209] Will retry registration in 40.030296ms if necessary
I0813 20:00:42.753821 27108 slave.cpp:1209] Will retry registration in 98.694199ms if necessary
*** SIGSEGV (@0x0) received by PID 27089 (TID 0x2b24d82e3bc0) from PID 0; stack trace: ***
    @     0x2b24ee7b7867 os::Linux::chained_handler()
    @     0x2b24ee7bbaf9 JVM_handle_linux_signal
    @     0x2b24de214340 (unknown)
    @           0x8e26c0 mesos::internal::tests::Cluster::Slaves::shutdown()
    @           0xe2decc mesos::internal::tests::MesosTest::ShutdownSlaves()
    @           0xe2de8e mesos::internal::tests::MesosTest::Shutdown()
    @           0xe2a437 mesos::internal::tests::MesosTest::TearDown()
I0813 20:00:42.803058 27123 slave.cpp:1209] Will retry registration in 10.790417ms if necessary
    @          0x132d216 testing::internal::HandleSehExceptionsInMethodIfSupported<>()
    @          0x132808c testing::internal::HandleExceptionsInMethodIfSupported<>()
    @          0x130984c testing::Test::Run()
    @          0x1309f86 testing::TestInfo::Run()
I0813 20:00:42.814385 27109 slave.cpp:1209] Will retry registration in 187.681354ms if necessary
    @          0x130a5cc testing::TestCase::Run()
    @          0x1310d14 testing::internal::UnitTestImpl::RunAllTests()
    @          0x132de3b testing::internal::HandleSehExceptionsInMethodIfSupported<>()
    @          0x1328c02 testing::internal::HandleExceptionsInMethodIfSupported<>()
    @          0x130fab0 testing::UnitTest::Run()
    @           0xc96d97 RUN_ALL_TESTS()
    @           0xc96a9b main
    @     0x2b24de443ec5 (unknown)
    @           0x8d86c9 (unknown)
make[4]: *** [check-local] Segmentation fault
make[4]: Leaving directory `/mesos/mesos-0.24.0/_build/src'
make[3]: *** [check-am] Error 2
make[3]: Leaving directory `/mesos/mesos-0.24.0/_build/src'
make[2]: *** [check] Error 2
make[2]: Leaving directory `/mesos/mesos-0.24.0/_build/src'
make[1]: *** [check-recursive] Error 1
make[1]: Leaving directory `/mesos/mesos-0.24.0/_build'
make: *** [distcheck] Error 1
+ docker rmi mesos-1439494769-18771
Untagged: mesos-1439494769-18771:latest
Deleted: 2a61bf4c02a1e29e69a954f574d255da36a72518ca9c2290c56c2e354a15fbfc
Deleted: 786de0faf6fba92cb900b6d80472a95ed376489afd048244f204dcf24ef4c408
Deleted: 0d42a572659e835f2847588105b899944aa6aaa27fa25c17b8619732b4f08527
Deleted: d7af74fa86c0e2277840eaf13a6b4bfd11f165be071aab00b1f060d5a3bd2522
Build step 'Execute shell' marked build as failure

Mime
View raw message