mesos-builds mailing list archives

Site index · List index
Message view « Date » · « Thread »
Top « Date » · « Thread »
From Apache Jenkins Server <jenk...@builds.apache.org>
Subject Build failed in Jenkins: Mesos » clang,docker||Hadoop,ubuntu:14.10 #589
Date Tue, 28 Jul 2015 21:03:25 GMT
See <https://builds.apache.org/job/Mesos/COMPILER=clang,LABEL=docker%7C%7CHadoop,OS=ubuntu%3A14.10/589/changes>

Changes:

[benjamin.mahler] Updated Framework struct in master for the http api.

------------------------------------------
[...truncated 112737 lines...]
I0728 21:03:45.447605 24805 leveldb.cpp:273] Iterated through 0 keys in the db in 6132ns
I0728 21:03:45.447631 24805 replica.cpp:744] Replica recovered with log positions 0 ->
0 with 1 holes and 0 unlearned
I0728 21:03:45.448478 24828 leveldb.cpp:306] Persisting metadata (8 bytes) to leveldb took
413750ns
I0728 21:03:45.448510 24828 replica.cpp:323] Persisted replica status to VOTING
I0728 21:03:45.451573 24805 leveldb.cpp:176] Opened db in 2.519775ms
I0728 21:03:45.453737 24805 leveldb.cpp:183] Compacted db in 2.143507ms
I0728 21:03:45.453789 24805 leveldb.cpp:198] Created db iterator in 26996ns
I0728 21:03:45.453832 24805 leveldb.cpp:204] Seeked to beginning of db in 34118ns
I0728 21:03:45.453860 24805 leveldb.cpp:273] Iterated through 1 keys in the db in 22720ns
I0728 21:03:45.453886 24805 replica.cpp:744] Replica recovered with log positions 0 ->
0 with 1 holes and 0 unlearned
I0728 21:03:45.456171 24805 leveldb.cpp:176] Opened db in 2.186331ms
I0728 21:03:45.458128 24805 leveldb.cpp:183] Compacted db in 1.945429ms
I0728 21:03:45.458171 24805 leveldb.cpp:198] Created db iterator in 22709ns
I0728 21:03:45.458210 24805 leveldb.cpp:204] Seeked to beginning of db in 29524ns
I0728 21:03:45.458251 24805 leveldb.cpp:273] Iterated through 1 keys in the db in 29724ns
I0728 21:03:45.458284 24805 replica.cpp:744] Replica recovered with log positions 0 ->
0 with 1 holes and 0 unlearned
I0728 21:03:45.458758 24833 recover.cpp:449] Starting replica recovery
I0728 21:03:45.458998 24833 recover.cpp:475] Replica is in VOTING status
I0728 21:03:45.459087 24833 recover.cpp:464] Recover process terminated
I0728 21:03:45.460877 24833 registrar.cpp:313] Recovering registrar
[       OK ] Strict/RegistrarTest.FetchTimeout/0 (43 ms)
[ RUN      ] Strict/RegistrarTest.FetchTimeout/1
Using temporary directory '/tmp/Strict_RegistrarTest_FetchTimeout_1_sBe9aE'
I0728 21:03:45.486516 24805 leveldb.cpp:176] Opened db in 2.017962ms
I0728 21:03:45.487241 24805 leveldb.cpp:183] Compacted db in 709649ns
I0728 21:03:45.487269 24805 leveldb.cpp:198] Created db iterator in 14704ns
I0728 21:03:45.487280 24805 leveldb.cpp:204] Seeked to beginning of db in 4929ns
I0728 21:03:45.487287 24805 leveldb.cpp:273] Iterated through 0 keys in the db in 3743ns
I0728 21:03:45.487308 24805 replica.cpp:744] Replica recovered with log positions 0 ->
0 with 1 holes and 0 unlearned
I0728 21:03:45.488216 24823 leveldb.cpp:306] Persisting metadata (8 bytes) to leveldb took
590346ns
I0728 21:03:45.488253 24823 replica.cpp:323] Persisted replica status to VOTING
I0728 21:03:45.491544 24805 leveldb.cpp:176] Opened db in 2.777297ms
I0728 21:03:45.492388 24805 leveldb.cpp:183] Compacted db in 823691ns
I0728 21:03:45.492434 24805 leveldb.cpp:198] Created db iterator in 25599ns
I0728 21:03:45.492451 24805 leveldb.cpp:204] Seeked to beginning of db in 7780ns
I0728 21:03:45.492462 24805 leveldb.cpp:273] Iterated through 0 keys in the db in 6063ns
I0728 21:03:45.492496 24805 replica.cpp:744] Replica recovered with log positions 0 ->
0 with 1 holes and 0 unlearned
I0728 21:03:45.493363 24827 leveldb.cpp:306] Persisting metadata (8 bytes) to leveldb took
438494ns
I0728 21:03:45.493393 24827 replica.cpp:323] Persisted replica status to VOTING
I0728 21:03:45.496592 24805 leveldb.cpp:176] Opened db in 2.658888ms
I0728 21:03:45.498695 24805 leveldb.cpp:183] Compacted db in 2.084173ms
I0728 21:03:45.498749 24805 leveldb.cpp:198] Created db iterator in 27727ns
I0728 21:03:45.498788 24805 leveldb.cpp:204] Seeked to beginning of db in 29654ns
I0728 21:03:45.498849 24805 leveldb.cpp:273] Iterated through 1 keys in the db in 56558ns
I0728 21:03:45.498889 24805 replica.cpp:744] Replica recovered with log positions 0 ->
0 with 1 holes and 0 unlearned
I0728 21:03:45.501762 24805 leveldb.cpp:176] Opened db in 2.7236ms
I0728 21:03:45.503856 24805 leveldb.cpp:183] Compacted db in 2.071776ms
I0728 21:03:45.503900 24805 leveldb.cpp:198] Created db iterator in 19844ns
I0728 21:03:45.503923 24805 leveldb.cpp:204] Seeked to beginning of db in 18821ns
I0728 21:03:45.503954 24805 leveldb.cpp:273] Iterated through 1 keys in the db in 29391ns
I0728 21:03:45.503985 24805 replica.cpp:744] Replica recovered with log positions 0 ->
0 with 1 holes and 0 unlearned
I0728 21:03:45.504384 24823 recover.cpp:449] Starting replica recovery
I0728 21:03:45.504724 24823 recover.cpp:475] Replica is in VOTING status
I0728 21:03:45.504871 24823 recover.cpp:464] Recover process terminated
I0728 21:03:45.506520 24832 registrar.cpp:313] Recovering registrar
[       OK ] Strict/RegistrarTest.FetchTimeout/1 (47 ms)
[ RUN      ] Strict/RegistrarTest.StoreTimeout/0
Using temporary directory '/tmp/Strict_RegistrarTest_StoreTimeout_0_XdvEj9'
I0728 21:03:45.533908 24805 leveldb.cpp:176] Opened db in 2.532927ms
I0728 21:03:45.534613 24805 leveldb.cpp:183] Compacted db in 679208ns
I0728 21:03:45.534646 24805 leveldb.cpp:198] Created db iterator in 15242ns
I0728 21:03:45.534657 24805 leveldb.cpp:204] Seeked to beginning of db in 5263ns
I0728 21:03:45.534663 24805 leveldb.cpp:273] Iterated through 0 keys in the db in 3660ns
I0728 21:03:45.534685 24805 replica.cpp:744] Replica recovered with log positions 0 ->
0 with 1 holes and 0 unlearned
I0728 21:03:45.535306 24837 leveldb.cpp:306] Persisting metadata (8 bytes) to leveldb took
426417ns
I0728 21:03:45.535339 24837 replica.cpp:323] Persisted replica status to VOTING
I0728 21:03:45.537566 24805 leveldb.cpp:176] Opened db in 1.798826ms
I0728 21:03:45.538208 24805 leveldb.cpp:183] Compacted db in 625363ns
I0728 21:03:45.538242 24805 leveldb.cpp:198] Created db iterator in 18402ns
I0728 21:03:45.538259 24805 leveldb.cpp:204] Seeked to beginning of db in 6760ns
I0728 21:03:45.538266 24805 leveldb.cpp:273] Iterated through 0 keys in the db in 5197ns
I0728 21:03:45.538296 24805 replica.cpp:744] Replica recovered with log positions 0 ->
0 with 1 holes and 0 unlearned
I0728 21:03:45.538967 24837 leveldb.cpp:306] Persisting metadata (8 bytes) to leveldb took
383923ns
I0728 21:03:45.538990 24837 replica.cpp:323] Persisted replica status to VOTING
I0728 21:03:45.542081 24805 leveldb.cpp:176] Opened db in 2.54082ms
I0728 21:03:45.544286 24805 leveldb.cpp:183] Compacted db in 2.183856ms
I0728 21:03:45.544345 24805 leveldb.cpp:198] Created db iterator in 30484ns
I0728 21:03:45.544384 24805 leveldb.cpp:204] Seeked to beginning of db in 27777ns
I0728 21:03:45.544420 24805 leveldb.cpp:273] Iterated through 1 keys in the db in 30470ns
I0728 21:03:45.544459 24805 replica.cpp:744] Replica recovered with log positions 0 ->
0 with 1 holes and 0 unlearned
I0728 21:03:45.547550 24805 leveldb.cpp:176] Opened db in 2.910844ms
I0728 21:03:45.549634 24805 leveldb.cpp:183] Compacted db in 2.065261ms
I0728 21:03:45.549693 24805 leveldb.cpp:198] Created db iterator in 29401ns
I0728 21:03:45.549731 24805 leveldb.cpp:204] Seeked to beginning of db in 27794ns
I0728 21:03:45.549767 24805 leveldb.cpp:273] Iterated through 1 keys in the db in 30044ns
I0728 21:03:45.549803 24805 replica.cpp:744] Replica recovered with log positions 0 ->
0 with 1 holes and 0 unlearned
I0728 21:03:45.550528 24824 recover.cpp:449] Starting replica recovery
I0728 21:03:45.550748 24824 recover.cpp:475] Replica is in VOTING status
I0728 21:03:45.550910 24824 recover.cpp:464] Recover process terminated
I0728 21:03:45.553709 24831 registrar.cpp:313] Recovering registrar
I0728 21:03:45.556584 24831 registrar.cpp:346] Successfully fetched the registry (0B) in 0ns
I0728 21:03:45.556685 24831 registrar.cpp:445] Applied 1 operations in 35181ns; attempting
to update the 'registry'
E0728 21:03:45.565992 24838 registrar.cpp:512] Registrar aborting: Failed to update 'registry':
Failed to perform store within 10secs
[       OK ] Strict/RegistrarTest.StoreTimeout/0 (47 ms)
[ RUN      ] Strict/RegistrarTest.StoreTimeout/1
Using temporary directory '/tmp/Strict_RegistrarTest_StoreTimeout_1_KVELzE'
I0728 21:03:45.580869 24805 leveldb.cpp:176] Opened db in 2.654957ms
I0728 21:03:45.581584 24805 leveldb.cpp:183] Compacted db in 692696ns
I0728 21:03:45.581619 24805 leveldb.cpp:198] Created db iterator in 15248ns
I0728 21:03:45.581629 24805 leveldb.cpp:204] Seeked to beginning of db in 5335ns
I0728 21:03:45.581636 24805 leveldb.cpp:273] Iterated through 0 keys in the db in 3829ns
I0728 21:03:45.581658 24805 replica.cpp:744] Replica recovered with log positions 0 ->
0 with 1 holes and 0 unlearned
I0728 21:03:45.582350 24838 leveldb.cpp:306] Persisting metadata (8 bytes) to leveldb took
425595ns
I0728 21:03:45.582384 24838 replica.cpp:323] Persisted replica status to VOTING
I0728 21:03:45.584408 24805 leveldb.cpp:176] Opened db in 1.556226ms
I0728 21:03:45.585115 24805 leveldb.cpp:183] Compacted db in 693849ns
I0728 21:03:45.585150 24805 leveldb.cpp:198] Created db iterator in 18846ns
I0728 21:03:45.585175 24805 leveldb.cpp:204] Seeked to beginning of db in 11696ns
I0728 21:03:45.585188 24805 leveldb.cpp:273] Iterated through 0 keys in the db in 4651ns
I0728 21:03:45.585211 24805 replica.cpp:744] Replica recovered with log positions 0 ->
0 with 1 holes and 0 unlearned
I0728 21:03:45.586040 24826 leveldb.cpp:306] Persisting metadata (8 bytes) to leveldb took
408229ns
I0728 21:03:45.586062 24826 replica.cpp:323] Persisted replica status to VOTING
I0728 21:03:45.588060 24805 leveldb.cpp:176] Opened db in 1.655061ms
I0728 21:03:45.589768 24805 leveldb.cpp:183] Compacted db in 1.693859ms
I0728 21:03:45.589812 24805 leveldb.cpp:198] Created db iterator in 39656ns
I0728 21:03:45.589867 24805 leveldb.cpp:204] Seeked to beginning of db in 23501ns
I0728 21:03:45.589895 24805 leveldb.cpp:273] Iterated through 1 keys in the db in 22576ns
I0728 21:03:45.589925 24805 replica.cpp:744] Replica recovered with log positions 0 ->
0 with 1 holes and 0 unlearned
I0728 21:03:45.591847 24805 leveldb.cpp:176] Opened db in 1.738189ms
I0728 21:03:45.593773 24805 leveldb.cpp:183] Compacted db in 1.911897ms
I0728 21:03:45.593811 24805 leveldb.cpp:198] Created db iterator in 28894ns
I0728 21:03:45.593847 24805 leveldb.cpp:204] Seeked to beginning of db in 20037ns
I0728 21:03:45.593873 24805 leveldb.cpp:273] Iterated through 1 keys in the db in 20757ns
I0728 21:03:45.593896 24805 replica.cpp:744] Replica recovered with log positions 0 ->
0 with 1 holes and 0 unlearned
I0728 21:03:45.594452 24824 recover.cpp:449] Starting replica recovery
I0728 21:03:45.594735 24824 recover.cpp:475] Replica is in VOTING status
I0728 21:03:45.594996 24824 recover.cpp:464] Recover process terminated
I0728 21:03:45.597471 24827 registrar.cpp:313] Recovering registrar
I0728 21:03:45.600307 24827 registrar.cpp:346] Successfully fetched the registry (0B) in 0ns
I0728 21:03:45.600396 24827 registrar.cpp:445] Applied 1 operations in 30569ns; attempting
to update the 'registry'
E0728 21:03:45.609273 24834 registrar.cpp:512] Registrar aborting: Failed to update 'registry':
Failed to perform store within 10secs
[       OK ] Strict/RegistrarTest.StoreTimeout/1 (44 ms)
[ RUN      ] Strict/RegistrarTest.Abort/0
Using temporary directory '/tmp/Strict_RegistrarTest_Abort_0_TR21W9'
I0728 21:03:45.624908 24805 leveldb.cpp:176] Opened db in 2.691551ms
I0728 21:03:45.625962 24805 leveldb.cpp:183] Compacted db in 1.031914ms
I0728 21:03:45.626010 24805 leveldb.cpp:198] Created db iterator in 18408ns
I0728 21:03:45.626029 24805 leveldb.cpp:204] Seeked to beginning of db in 5808ns
I0728 21:03:45.626036 24805 leveldb.cpp:273] Iterated through 0 keys in the db in 3795ns
I0728 21:03:45.626058 24805 replica.cpp:744] Replica recovered with log positions 0 ->
0 with 1 holes and 0 unlearned
I0728 21:03:45.626796 24830 leveldb.cpp:306] Persisting metadata (8 bytes) to leveldb took
555049ns
I0728 21:03:45.626873 24830 replica.cpp:323] Persisted replica status to VOTING
I0728 21:03:45.629587 24805 leveldb.cpp:176] Opened db in 2.030265ms
I0728 21:03:45.630177 24805 leveldb.cpp:183] Compacted db in 574918ns
I0728 21:03:45.630218 24805 leveldb.cpp:198] Created db iterator in 22107ns
I0728 21:03:45.630235 24805 leveldb.cpp:204] Seeked to beginning of db in 7446ns
I0728 21:03:45.630244 24805 leveldb.cpp:273] Iterated through 0 keys in the db in 3832ns
I0728 21:03:45.630266 24805 replica.cpp:744] Replica recovered with log positions 0 ->
0 with 1 holes and 0 unlearned
I0728 21:03:45.630964 24830 leveldb.cpp:306] Persisting metadata (8 bytes) to leveldb took
519130ns
I0728 21:03:45.631000 24830 replica.cpp:323] Persisted replica status to VOTING
I0728 21:03:45.633344 24805 leveldb.cpp:176] Opened db in 1.90357ms
I0728 21:03:45.634903 24805 leveldb.cpp:183] Compacted db in 1.543286ms
I0728 21:03:45.634939 24805 leveldb.cpp:198] Created db iterator in 17872ns
I0728 21:03:45.634966 24805 leveldb.cpp:204] Seeked to beginning of db in 23842ns
I0728 21:03:45.634996 24805 leveldb.cpp:273] Iterated through 1 keys in the db in 22459ns
I0728 21:03:45.635020 24805 replica.cpp:744] Replica recovered with log positions 0 ->
0 with 1 holes and 0 unlearned
I0728 21:03:45.637233 24805 leveldb.cpp:176] Opened db in 2.105039ms
I0728 21:03:45.638738 24805 leveldb.cpp:183] Compacted db in 1.49194ms
I0728 21:03:45.638777 24805 leveldb.cpp:198] Created db iterator in 21832ns
I0728 21:03:45.638800 24805 leveldb.cpp:204] Seeked to beginning of db in 17540ns
I0728 21:03:45.638841 24805 leveldb.cpp:273] Iterated through 1 keys in the db in 37922ns
I0728 21:03:45.638869 24805 replica.cpp:744] Replica recovered with log positions 0 ->
0 with 1 holes and 0 unlearned
I0728 21:03:45.639405 24833 recover.cpp:449] Starting replica recovery
I0728 21:03:45.639617 24833 recover.cpp:475] Replica is in VOTING status
I0728 21:03:45.639746 24833 recover.cpp:464] Recover process terminated
I0728 21:03:45.642452 24835 registrar.cpp:313] Recovering registrar
I0728 21:03:45.645437 24835 registrar.cpp:346] Successfully fetched the registry (0B) in 2.88896ms
I0728 21:03:45.645586 24835 registrar.cpp:445] Applied 1 operations in 58363ns; attempting
to update the 'registry'
I0728 21:03:45.648704 24835 registrar.cpp:490] Successfully updated the 'registry' in 3.051776ms
I0728 21:03:45.648845 24835 registrar.cpp:376] Successfully recovered registrar
I0728 21:03:45.649699 24828 registrar.cpp:445] Applied 1 operations in 64416ns; attempting
to update the 'registry'
E0728 21:03:45.652199 24828 registrar.cpp:512] Registrar aborting: Failed to update 'registry':
failure
[       OK ] Strict/RegistrarTest.Abort/0 (34 ms)
[ RUN      ] Strict/RegistrarTest.Abort/1
Using temporary directory '/tmp/Strict_RegistrarTest_Abort_1_ksONpF'
I0728 21:03:45.658697 24805 leveldb.cpp:176] Opened db in 2.555877ms
I0728 21:03:45.659616 24805 leveldb.cpp:183] Compacted db in 899066ns
I0728 21:03:45.659667 24805 leveldb.cpp:198] Created db iterator in 27296ns
I0728 21:03:45.659689 24805 leveldb.cpp:204] Seeked to beginning of db in 9224ns
I0728 21:03:45.659700 24805 leveldb.cpp:273] Iterated through 0 keys in the db in 5945ns
I0728 21:03:45.659735 24805 replica.cpp:744] Replica recovered with log positions 0 ->
0 with 1 holes and 0 unlearned
I0728 21:03:45.660676 24825 leveldb.cpp:306] Persisting metadata (8 bytes) to leveldb took
417075ns
I0728 21:03:45.660699 24825 replica.cpp:323] Persisted replica status to VOTING
I0728 21:03:45.663575 24805 leveldb.cpp:176] Opened db in 2.387291ms
I0728 21:03:45.664424 24805 leveldb.cpp:183] Compacted db in 828150ns
I0728 21:03:45.664466 24805 leveldb.cpp:198] Created db iterator in 20560ns
I0728 21:03:45.664482 24805 leveldb.cpp:204] Seeked to beginning of db in 7680ns
I0728 21:03:45.664494 24805 leveldb.cpp:273] Iterated through 0 keys in the db in 6015ns
I0728 21:03:45.664528 24805 replica.cpp:744] Replica recovered with log positions 0 ->
0 with 1 holes and 0 unlearned
I0728 21:03:45.665547 24825 leveldb.cpp:306] Persisting metadata (8 bytes) to leveldb took
470501ns
I0728 21:03:45.665577 24825 replica.cpp:323] Persisted replica status to VOTING
I0728 21:03:45.668678 24805 leveldb.cpp:176] Opened db in 2.53838ms
I0728 21:03:45.671206 24805 leveldb.cpp:183] Compacted db in 2.509079ms
I0728 21:03:45.671265 24805 leveldb.cpp:198] Created db iterator in 29757ns
I0728 21:03:45.671310 24805 leveldb.cpp:204] Seeked to beginning of db in 27487ns
I0728 21:03:45.671349 24805 leveldb.cpp:273] Iterated through 1 keys in the db in 31874ns
I0728 21:03:45.671383 24805 replica.cpp:744] Replica recovered with log positions 0 ->
0 with 1 holes and 0 unlearned
I0728 21:03:45.674253 24805 leveldb.cpp:176] Opened db in 2.734966ms
I0728 21:03:45.676719 24805 leveldb.cpp:183] Compacted db in 2.444512ms
I0728 21:03:45.676770 24805 leveldb.cpp:198] Created db iterator in 25667ns
I0728 21:03:45.676807 24805 leveldb.cpp:204] Seeked to beginning of db in 55706ns
I0728 21:03:45.676885 24805 leveldb.cpp:273] Iterated through 1 keys in the db in 41571ns
I0728 21:03:45.676933 24805 replica.cpp:744] Replica recovered with log positions 0 ->
0 with 1 holes and 0 unlearned
I0728 21:03:45.677428 24824 recover.cpp:449] Starting replica recovery
I0728 21:03:45.677881 24824 recover.cpp:475] Replica is in VOTING status
I0728 21:03:45.678020 24824 recover.cpp:464] Recover process terminated
I0728 21:03:45.680302 24832 registrar.cpp:313] Recovering registrar
I0728 21:03:45.683359 24832 registrar.cpp:346] Successfully fetched the registry (0B) in 2.950912ms
I0728 21:03:45.683464 24832 registrar.cpp:445] Applied 1 operations in 38232ns; attempting
to update the 'registry'
I0728 21:03:45.686502 24832 registrar.cpp:490] Successfully updated the 'registry' in 2.973184ms
I0728 21:03:45.686624 24832 registrar.cpp:376] Successfully recovered registrar
I0728 21:03:45.687336 24831 registrar.cpp:445] Applied 1 operations in 70888ns; attempting
to update the 'registry'
E0728 21:03:45.690126 24831 registrar.cpp:512] Registrar aborting: Failed to update 'registry':
failure
[       OK ] Strict/RegistrarTest.Abort/1 (37 ms)
[----------] 16 tests from Strict/RegistrarTest (940 ms total)

[----------] Global test environment tear-down
[==========] 683 tests from 97 test cases ran. (287531 ms total)
[  PASSED  ] 682 tests.
[  FAILED  ] 1 test, listed below:
[  FAILED  ] SchedulerDriverEventTest.SubscribedSchedulerFailover

 1 FAILED TEST
  YOU HAVE 12 DISABLED TESTS

Makefile:7686: recipe for target 'check-local' failed
make[4]: Leaving directory '/mesos/mesos-0.24.0/_build/src'
make[4]: *** [check-local] Error 1
make[3]: *** [check-am] Error 2
Makefile:7133: recipe for target 'check-am' failed
make[3]: Leaving directory '/mesos/mesos-0.24.0/_build/src'
make[2]: *** [check] Error 2
Makefile:7137: recipe for target 'check' failed
make[2]: Leaving directory '/mesos/mesos-0.24.0/_build/src'
Makefile:667: recipe for target 'check-recursive' failed
make[1]: Leaving directory '/mesos/mesos-0.24.0/_build'
make[1]: *** [check-recursive] Error 1
Makefile:873: recipe for target 'distcheck' failed
make: *** [distcheck] Error 1
+ docker rmi mesos-1438116229-29622
Untagged: mesos-1438116229-29622:latest
Deleted: 90f0219a90b8146fdbcd0ccdcf2b9847c85d0713fe9c2bab2eca0f1e69194d6b
Deleted: e73e4dfbd70df9aa31f2c17434259a21b4ce3ee0f2ac26bce3dd8ddc9e69c1a4
Deleted: 3fd41ab3fb29e191936359af9d6ba72b712bb499c8d756384fc412924cf8beef
Deleted: 30cca3d333672b7f2bd32f361b2decdbbdd62d3d04dfdbe887ab45afd056a2ff
Deleted: c263659fcaa86bdb3efd6d1f762517ac7fb4cca123bbc7877ecdc40f187dbfde
Deleted: fed243f235c267d66620034cd04d47caafb6e481aa5867c00d3feffd80d8f5f9
Deleted: fc34a9304fbe711f381975385e3578a749db2ceca56f31c543078071e7a92f49
Build step 'Execute shell' marked build as failure

Mime
View raw message