mesos-builds mailing list archives

Site index · List index
Message view « Date » · « Thread »
Top « Date » · « Thread »
From Apache Jenkins Server <jenk...@builds.apache.org>
Subject Build failed in Jenkins: Mesos » gcc,docker||Hadoop,ubuntu:14.10 #517
Date Wed, 15 Jul 2015 01:13:21 GMT
See <https://builds.apache.org/job/Mesos/COMPILER=gcc,LABEL=docker%7C%7CHadoop,OS=ubuntu%3A14.10/517/changes>

Changes:

[tnachen] Added cpuacct subsystem to cgroups.

[tnachen] Added cgroups based statistics to Docker containerizer.

------------------------------------------
[...truncated 14340 lines...]
[  PASSED  ] 132 tests.

  YOU HAVE 3 DISABLED TESTS

make[6]: Leaving directory '/mesos/mesos-0.24.0/_build/3rdparty/libprocess'
make[5]: Leaving directory '/mesos/mesos-0.24.0/_build/3rdparty/libprocess'
Making check in include
make[5]: Entering directory '/mesos/mesos-0.24.0/_build/3rdparty/libprocess/include'
make[5]: Nothing to be done for 'check'.
make[5]: Leaving directory '/mesos/mesos-0.24.0/_build/3rdparty/libprocess/include'
make[4]: Leaving directory '/mesos/mesos-0.24.0/_build/3rdparty/libprocess'
make[4]: Entering directory '/mesos/mesos-0.24.0/_build/3rdparty'
make[4]: Nothing to be done for 'check-am'.
make[4]: Leaving directory '/mesos/mesos-0.24.0/_build/3rdparty'
make[3]: Leaving directory '/mesos/mesos-0.24.0/_build/3rdparty'
make[2]: Leaving directory '/mesos/mesos-0.24.0/_build/3rdparty'
Making check in src
make[2]: Entering directory '/mesos/mesos-0.24.0/_build/src'
make  check-am
make[3]: Entering directory '/mesos/mesos-0.24.0/_build/src'
test "../.." = ".." ||			\
	(/bin/mkdir -p python/src/mesos && cp -pf ../../src/python/src/mesos/__init__.py python/src/mesos/__init__.py)
test "../.." = ".." ||			\
	(/bin/mkdir -p python/interface/src/mesos && cp -pf ../../src/python/interface/src/mesos/__init__.py python/interface/src/mesos/__init__.py)
test "../.." = ".." ||			\
	(/bin/mkdir -p python/interface/src/mesos/interface && cp -pf ../../src/python/interface/src/mesos/interface/__init__.py python/interface/src/mesos/interface/__init__.py)
test "../.." = ".." ||			\
	(/bin/mkdir -p python/native/src/mesos && cp -pf ../../src/python/native/src/mesos/__init__.py python/native/src/mesos/__init__.py)
test "../.." = ".." ||			\
	(/bin/mkdir -p python/native/src/mesos/native && cp -pf ../../src/python/native/src/mesos/native/__init__.py python/native/src/mesos/native/__init__.py)
test "../.." = ".." ||			\
	(/bin/mkdir -p python/native/src/mesos/native && cp -pf ../../src/python/native/src/mesos/native/mesos_executor_driver_impl.cpp python/native/src/mesos/native/mesos_executor_driver_impl.cpp)
test "../.." = ".." ||			\
	(/bin/mkdir -p python/native/src/mesos/native && cp -pf ../../src/python/native/src/mesos/native/mesos_executor_driver_impl.hpp python/native/src/mesos/native/mesos_executor_driver_impl.hpp)
test "../.." = ".." ||			\
	(/bin/mkdir -p python/native/src/mesos/native && cp -pf ../../src/python/native/src/mesos/native/mesos_scheduler_driver_impl.cpp python/native/src/mesos/native/mesos_scheduler_driver_impl.cpp)
test "../.." = ".." ||			\
	(/bin/mkdir -p python/native/src/mesos/native && cp -pf ../../src/python/native/src/mesos/native/mesos_scheduler_driver_impl.hpp python/native/src/mesos/native/mesos_scheduler_driver_impl.hpp)
test "../.." = ".." ||			\
	(/bin/mkdir -p python/native/src/mesos/native && cp -pf ../../src/python/native/src/mesos/native/module.cpp python/native/src/mesos/native/module.cpp)
test "../.." = ".." ||			\
	(/bin/mkdir -p python/native/src/mesos/native && cp -pf ../../src/python/native/src/mesos/native/module.hpp python/native/src/mesos/native/module.hpp)
test "../.." = ".." ||			\
	(/bin/mkdir -p python/native/src/mesos/native && cp -pf ../../src/python/native/src/mesos/native/proxy_executor.cpp python/native/src/mesos/native/proxy_executor.cpp)
test "../.." = ".." ||			\
	(/bin/mkdir -p python/native/src/mesos/native && cp -pf ../../src/python/native/src/mesos/native/proxy_executor.hpp python/native/src/mesos/native/proxy_executor.hpp)
test "../.." = ".." ||			\
	(/bin/mkdir -p python/native/src/mesos/native && cp -pf ../../src/python/native/src/mesos/native/proxy_scheduler.cpp python/native/src/mesos/native/proxy_scheduler.cpp)
test "../.." = ".." ||			\
	(/bin/mkdir -p python/native/src/mesos/native && cp -pf ../../src/python/native/src/mesos/native/proxy_scheduler.hpp python/native/src/mesos/native/proxy_scheduler.hpp)
running bdist_egg
running bdist_egg
running egg_info
running egg_info
writing requirements to src/mesos.interface.egg-info/requires.txt
writing requirements to src/mesos.native.egg-info/requires.txt
writing src/mesos.native.egg-info/PKG-INFO
writing src/mesos.interface.egg-info/PKG-INFO
writing namespace_packages to src/mesos.native.egg-info/namespace_packages.txt
writing namespace_packages to src/mesos.interface.egg-info/namespace_packages.txt
writing top-level names to src/mesos.native.egg-info/top_level.txt
writing top-level names to src/mesos.interface.egg-info/top_level.txt
writing dependency_links to src/mesos.native.egg-info/dependency_links.txt
writing dependency_links to src/mesos.interface.egg-info/dependency_links.txt
reading manifest file 'src/mesos.interface.egg-info/SOURCES.txt'
writing manifest file 'src/mesos.interface.egg-info/SOURCES.txt'
installing library code to build/bdist.linux-x86_64/egg
running install_lib
running build_py
reading manifest file 'src/mesos.native.egg-info/SOURCES.txt'
creating build/bdist.linux-x86_64/egg
creating build/bdist.linux-x86_64/egg/mesos
creating build/bdist.linux-x86_64/egg/mesos/interface
copying build/lib.linux-x86_64-2.7/mesos/interface/containerizer_pb2.py -> build/bdist.linux-x86_64/egg/mesos/interface
copying build/lib.linux-x86_64-2.7/mesos/interface/__init__.py -> build/bdist.linux-x86_64/egg/mesos/interface
writing manifest file 'src/mesos.native.egg-info/SOURCES.txt'
installing library code to build/bdist.linux-x86_64/egg
copying build/lib.linux-x86_64-2.7/mesos/interface/mesos_pb2.py -> build/bdist.linux-x86_64/egg/mesos/interface
copying build/lib.linux-x86_64-2.7/mesos/__init__.py -> build/bdist.linux-x86_64/egg/mesos
running install_lib
running build_py
byte-compiling build/bdist.linux-x86_64/egg/mesos/interface/containerizer_pb2.py to containerizer_pb2.pyc
running build_ext
creating build/bdist.linux-x86_64/egg
byte-compiling build/bdist.linux-x86_64/egg/mesos/interface/__init__.py to __init__.pyc
creating build/bdist.linux-x86_64/egg/mesos
copying build/lib.linux-x86_64-2.7/mesos/__init__.py -> build/bdist.linux-x86_64/egg/mesos
creating build/bdist.linux-x86_64/egg/mesos/native
copying build/lib.linux-x86_64-2.7/mesos/native/__init__.py -> build/bdist.linux-x86_64/egg/mesos/native
copying build/lib.linux-x86_64-2.7/mesos/native/_mesos.so -> build/bdist.linux-x86_64/egg/mesos/native
byte-compiling build/bdist.linux-x86_64/egg/mesos/interface/mesos_pb2.py to mesos_pb2.pyc
byte-compiling build/bdist.linux-x86_64/egg/mesos/__init__.py to __init__.pyc
creating build/bdist.linux-x86_64/egg/EGG-INFO
copying src/mesos.interface.egg-info/PKG-INFO -> build/bdist.linux-x86_64/egg/EGG-INFO
copying src/mesos.interface.egg-info/SOURCES.txt -> build/bdist.linux-x86_64/egg/EGG-INFO
copying src/mesos.interface.egg-info/dependency_links.txt -> build/bdist.linux-x86_64/egg/EGG-INFO
copying src/mesos.interface.egg-info/namespace_packages.txt -> build/bdist.linux-x86_64/egg/EGG-INFO
copying src/mesos.interface.egg-info/requires.txt -> build/bdist.linux-x86_64/egg/EGG-INFO
copying src/mesos.interface.egg-info/top_level.txt -> build/bdist.linux-x86_64/egg/EGG-INFO
zip_safe flag not set; analyzing archive contents...
mesos.__init__: module references __path__
creating '../dist/mesos.interface-0.24.0-py2.7.egg' and adding 'build/bdist.linux-x86_64/egg' to it
removing 'build/bdist.linux-x86_64/egg' (and everything under it)
running bdist_wheel
running build
installing to build/bdist.linux-x86_64/wheel
running install
running install_lib
Skipping installation of build/bdist.linux-x86_64/wheel/mesos/__init__.py (namespace package)
copying mesos/interface/containerizer_pb2.py -> build/bdist.linux-x86_64/wheel/mesos/interface
copying mesos/interface/__init__.py -> build/bdist.linux-x86_64/wheel/mesos/interface
copying mesos/interface/mesos_pb2.py -> build/bdist.linux-x86_64/wheel/mesos/interface
running install_egg_info
Copying src/mesos.interface.egg-info to build/bdist.linux-x86_64/wheel/mesos.interface-0.24.0-py2.7.egg-info
Installing build/bdist.linux-x86_64/wheel/mesos.interface-0.24.0-py2.7-nspkg.pth
running install_scripts
creating build/bdist.linux-x86_64/wheel/mesos.interface-0.24.0.dist-info/WHEEL
byte-compiling build/bdist.linux-x86_64/egg/mesos/__init__.py to __init__.pyc
byte-compiling build/bdist.linux-x86_64/egg/mesos/native/__init__.py to __init__.pyc
creating stub loader for mesos/native/_mesos.so
byte-compiling build/bdist.linux-x86_64/egg/mesos/native/_mesos.py to _mesos.pyc
creating build/bdist.linux-x86_64/egg/EGG-INFO
copying src/mesos.native.egg-info/PKG-INFO -> build/bdist.linux-x86_64/egg/EGG-INFO
copying src/mesos.native.egg-info/SOURCES.txt -> build/bdist.linux-x86_64/egg/EGG-INFO
copying src/mesos.native.egg-info/dependency_links.txt -> build/bdist.linux-x86_64/egg/EGG-INFO
copying src/mesos.native.egg-info/namespace_packages.txt -> build/bdist.linux-x86_64/egg/EGG-INFO
copying src/mesos.native.egg-info/requires.txt -> build/bdist.linux-x86_64/egg/EGG-INFO
copying src/mesos.native.egg-info/top_level.txt -> build/bdist.linux-x86_64/egg/EGG-INFO
writing build/bdist.linux-x86_64/egg/EGG-INFO/native_libs.txt
zip_safe flag not set; analyzing archive contents...
mesos.__init__: module references __path__
creating '../dist/mesos.native-0.24.0-py2.7-linux-x86_64.egg' and adding 'build/bdist.linux-x86_64/egg' to it
removing 'build/bdist.linux-x86_64/egg' (and everything under it)
running bdist_wheel
running build
installing to build/bdist.linux-x86_64/wheel
running install
running install_lib
Skipping installation of build/bdist.linux-x86_64/wheel/mesos/__init__.py (namespace package)
copying mesos/native/__init__.py -> build/bdist.linux-x86_64/wheel/mesos/native
copying mesos/native/_mesos.so -> build/bdist.linux-x86_64/wheel/mesos/native
running install_egg_info
Copying src/mesos.native.egg-info to build/bdist.linux-x86_64/wheel/mesos.native-0.24.0-py2.7.egg-info
Installing build/bdist.linux-x86_64/wheel/mesos.native-0.24.0-py2.7-nspkg.pth
running install_scripts
creating build/bdist.linux-x86_64/wheel/mesos.native-0.24.0.dist-info/WHEEL
make  event-call-framework test-framework test-executor long-lived-framework long-lived-executor no-executor-framework docker-no-executor-framework balloon-framework balloon-executor load-generator-framework persistent-volume-framework setns-test-helper memory-test-helper active-user-test-helper mesos-tests examples/java/test-framework examples/java/test-executor examples/java/test-exception-framework examples/java/test-multiple-executors-framework examples/java/test-log examples/python/test_containerizer.py examples/python/test-containerizer examples/python/test_framework.py examples/python/test-framework examples/python/test_executor.py examples/python/test-executor \
  tests/balloon_framework_test.sh tests/event_call_framework_test.sh tests/java_exception_test.sh tests/java_framework_test.sh tests/java_log_test.sh tests/no_executor_framework_test.sh tests/persistent_volume_framework_test.sh tests/python_framework_test.sh tests/test_framework_test.sh
make[4]: Entering directory '/mesos/mesos-0.24.0/_build/src'
g++ -DPACKAGE_NAME=\"mesos\" -DPACKAGE_TARNAME=\"mesos\" -DPACKAGE_VERSION=\"0.24.0\" -DPACKAGE_STRING=\"mesos\ 0.24.0\" -DPACKAGE_BUGREPORT=\"\" -DPACKAGE_URL=\"\" -DPACKAGE=\"mesos\" -DVERSION=\"0.24.0\" -DSTDC_HEADERS=1 -DHAVE_SYS_TYPES_H=1 -DHAVE_SYS_STAT_H=1 -DHAVE_STDLIB_H=1 -DHAVE_STRING_H=1 -DHAVE_MEMORY_H=1 -DHAVE_STRINGS_H=1 -DHAVE_INTTYPES_H=1 -DHAVE_STDINT_H=1 -DHAVE_UNISTD_H=1 -DHAVE_DLFCN_H=1 -DLT_OBJDIR=\".libs/\" -DHAVE_PTHREAD_PRIO_INHERIT=1 -DHAVE_PTHREAD=1 -DHAVE_LIBZ=1 -DHAVE_LIBCURL=1 -DHAVE_APR_POOLS_H=1 -DHAVE_LIBAPR_1=1 -DHAVE_SVN_VERSION_H=1 -DHAVE_LIBSVN_SUBR_1=1 -DHAVE_SVN_DELTA_H=1 -DHAVE_LIBSVN_DELTA_1=1 -DHAVE_LIBSASL2=1 -DMESOS_HAS_JAVA=1 -DHAVE_PYTHON=\"2.7\" -DMESOS_HAS_PYTHON=1 -I. -I../../src   -Wall -Werror -DLIBDIR=\"/mesos/mesos-0.24.0/_inst/lib\" -DPKGLIBEXECDIR=\"/mesos/mesos-0.24.0/_inst/libexec/mesos\" -DPKGDATADIR=\"/mesos/mesos-0.24.0/_inst/share/mesos\" -I../../include -I../../3rdparty/libprocess/include -I../../3rdparty/libprocess/3rdparty/stout/include -I../include -I../include/mesos -I../3rdparty/libprocess/3rdparty/boost-1.53.0 -I../3rdparty/libprocess/3rdparty/picojson-4f93734 -I../3rdparty/libprocess/3rdparty/protobuf-2.5.0/src -I../3rdparty/libprocess/3rdparty/glog-0.3.3/src -I../3rdparty/libprocess/3rdparty/glog-0.3.3/src -I../3rdparty/leveldb/include -I../3rdparty/zookeeper-3.4.5/src/c/include -I../3rdparty/zookeeper-3.4.5/src/c/generated -I../3rdparty/libprocess/3rdparty/protobuf-2.5.0/src -I/usr/include/subversion-1 -I/usr/include/apr-1 -I/usr/include/apr-1.0  -pthread -g1 -O0 -Wno-unused-local-typedefs -std=c++11 -MT examples/event_call_framework-event_call_framework.o -MD -MP -MF examples/.deps/event_call_framework-event_call_framework.Tpo -c -o examples/event_call_framework-event_call_framework.o `test -f 'examples/event_call_framework.cpp' || echo '../../src/'`examples/event_call_framework.cpp
g++ -DPACKAGE_NAME=\"mesos\" -DPACKAGE_TARNAME=\"mesos\" -DPACKAGE_VERSION=\"0.24.0\" -DPACKAGE_STRING=\"mesos\ 0.24.0\" -DPACKAGE_BUGREPORT=\"\" -DPACKAGE_URL=\"\" -DPACKAGE=\"mesos\" -DVERSION=\"0.24.0\" -DSTDC_HEADERS=1 -DHAVE_SYS_TYPES_H=1 -DHAVE_SYS_STAT_H=1 -DHAVE_STDLIB_H=1 -DHAVE_STRING_H=1 -DHAVE_MEMORY_H=1 -DHAVE_STRINGS_H=1 -DHAVE_INTTYPES_H=1 -DHAVE_STDINT_H=1 -DHAVE_UNISTD_H=1 -DHAVE_DLFCN_H=1 -DLT_OBJDIR=\".libs/\" -DHAVE_PTHREAD_PRIO_INHERIT=1 -DHAVE_PTHREAD=1 -DHAVE_LIBZ=1 -DHAVE_LIBCURL=1 -DHAVE_APR_POOLS_H=1 -DHAVE_LIBAPR_1=1 -DHAVE_SVN_VERSION_H=1 -DHAVE_LIBSVN_SUBR_1=1 -DHAVE_SVN_DELTA_H=1 -DHAVE_LIBSVN_DELTA_1=1 -DHAVE_LIBSASL2=1 -DMESOS_HAS_JAVA=1 -DHAVE_PYTHON=\"2.7\" -DMESOS_HAS_PYTHON=1 -I. -I../../src   -Wall -Werror -DLIBDIR=\"/mesos/mesos-0.24.0/_inst/lib\" -DPKGLIBEXECDIR=\"/mesos/mesos-0.24.0/_inst/libexec/mesos\" -DPKGDATADIR=\"/mesos/mesos-0.24.0/_inst/share/mesos\" -I../../include -I../../3rdparty/libprocess/include -I../../3rdparty/libprocess/3rdparty/stout/include -I../include -I../include/mesos -I../3rdparty/libprocess/3rdparty/boost-1.53.0 -I../3rdparty/libprocess/3rdparty/picojson-4f93734 -I../3rdparty/libprocess/3rdparty/protobuf-2.5.0/src -I../3rdparty/libprocess/3rdparty/glog-0.3.3/src -I../3rdparty/libprocess/3rdparty/glog-0.3.3/src -I../3rdparty/leveldb/include -I../3rdparty/zookeeper-3.4.5/src/c/include -I../3rdparty/zookeeper-3.4.5/src/c/generated -I../3rdparty/libprocess/3rdparty/protobuf-2.5.0/src -I/usr/include/subversion-1 -I/usr/include/apr-1 -I/usr/include/apr-1.0  -pthread -g1 -O0 -Wno-unused-local-typedefs -std=c++11 -MT examples/test_framework-test_framework.o -MD -MP -MF examples/.deps/test_framework-test_framework.Tpo -c -o examples/test_framework-test_framework.o `test -f 'examples/test_framework.cpp' || echo '../../src/'`examples/test_framework.cpp
g++ -DPACKAGE_NAME=\"mesos\" -DPACKAGE_TARNAME=\"mesos\" -DPACKAGE_VERSION=\"0.24.0\" -DPACKAGE_STRING=\"mesos\ 0.24.0\" -DPACKAGE_BUGREPORT=\"\" -DPACKAGE_URL=\"\" -DPACKAGE=\"mesos\" -DVERSION=\"0.24.0\" -DSTDC_HEADERS=1 -DHAVE_SYS_TYPES_H=1 -DHAVE_SYS_STAT_H=1 -DHAVE_STDLIB_H=1 -DHAVE_STRING_H=1 -DHAVE_MEMORY_H=1 -DHAVE_STRINGS_H=1 -DHAVE_INTTYPES_H=1 -DHAVE_STDINT_H=1 -DHAVE_UNISTD_H=1 -DHAVE_DLFCN_H=1 -DLT_OBJDIR=\".libs/\" -DHAVE_PTHREAD_PRIO_INHERIT=1 -DHAVE_PTHREAD=1 -DHAVE_LIBZ=1 -DHAVE_LIBCURL=1 -DHAVE_APR_POOLS_H=1 -DHAVE_LIBAPR_1=1 -DHAVE_SVN_VERSION_H=1 -DHAVE_LIBSVN_SUBR_1=1 -DHAVE_SVN_DELTA_H=1 -DHAVE_LIBSVN_DELTA_1=1 -DHAVE_LIBSASL2=1 -DMESOS_HAS_JAVA=1 -DHAVE_PYTHON=\"2.7\" -DMESOS_HAS_PYTHON=1 -I. -I../../src   -Wall -Werror -DLIBDIR=\"/mesos/mesos-0.24.0/_inst/lib\" -DPKGLIBEXECDIR=\"/mesos/mesos-0.24.0/_inst/libexec/mesos\" -DPKGDATADIR=\"/mesos/mesos-0.24.0/_inst/share/mesos\" -I../../include -I../../3rdparty/libprocess/include -I../../3rdparty/libprocess/3rdparty/stout/include -I../include -I../include/mesos -I../3rdparty/libprocess/3rdparty/boost-1.53.0 -I../3rdparty/libprocess/3rdparty/picojson-4f93734 -I../3rdparty/libprocess/3rdparty/protobuf-2.5.0/src -I../3rdparty/libprocess/3rdparty/glog-0.3.3/src -I../3rdparty/libprocess/3rdparty/glog-0.3.3/src -I../3rdparty/leveldb/include -I../3rdparty/zookeeper-3.4.5/src/c/include -I../3rdparty/zookeeper-3.4.5/src/c/generated -I../3rdparty/libprocess/3rdparty/protobuf-2.5.0/src -I/usr/include/subversion-1 -I/usr/include/apr-1 -I/usr/include/apr-1.0  -pthread -g1 -O0 -Wno-unused-local-typedefs -std=c++11 -MT examples/test_executor-test_executor.o -MD -MP -MF examples/.deps/test_executor-test_executor.Tpo -c -o examples/test_executor-test_executor.o `test -f 'examples/test_executor.cpp' || echo '../../src/'`examples/test_executor.cpp
g++ -DPACKAGE_NAME=\"mesos\" -DPACKAGE_TARNAME=\"mesos\" -DPACKAGE_VERSION=\"0.24.0\" -DPACKAGE_STRING=\"mesos\ 0.24.0\" -DPACKAGE_BUGREPORT=\"\" -DPACKAGE_URL=\"\" -DPACKAGE=\"mesos\" -DVERSION=\"0.24.0\" -DSTDC_HEADERS=1 -DHAVE_SYS_TYPES_H=1 -DHAVE_SYS_STAT_H=1 -DHAVE_STDLIB_H=1 -DHAVE_STRING_H=1 -DHAVE_MEMORY_H=1 -DHAVE_STRINGS_H=1 -DHAVE_INTTYPES_H=1 -DHAVE_STDINT_H=1 -DHAVE_UNISTD_H=1 -DHAVE_DLFCN_H=1 -DLT_OBJDIR=\".libs/\" -DHAVE_PTHREAD_PRIO_INHERIT=1 -DHAVE_PTHREAD=1 -DHAVE_LIBZ=1 -DHAVE_LIBCURL=1 -DHAVE_APR_POOLS_H=1 -DHAVE_LIBAPR_1=1 -DHAVE_SVN_VERSION_H=1 -DHAVE_LIBSVN_SUBR_1=1 -DHAVE_SVN_DELTA_H=1 -DHAVE_LIBSVN_DELTA_1=1 -DHAVE_LIBSASL2=1 -DMESOS_HAS_JAVA=1 -DHAVE_PYTHON=\"2.7\" -DMESOS_HAS_PYTHON=1 -I. -I../../src   -Wall -Werror -DLIBDIR=\"/mesos/mesos-0.24.0/_inst/lib\" -DPKGLIBEXECDIR=\"/mesos/mesos-0.24.0/_inst/libexec/mesos\" -DPKGDATADIR=\"/mesos/mesos-0.24.0/_inst/share/mesos\" -I../../include -I../../3rdparty/libprocess/include -I../../3rdparty/libprocess/3rdparty/stout/include -I../include -I../include/mesos -I../3rdparty/libprocess/3rdparty/boost-1.53.0 -I../3rdparty/libprocess/3rdparty/picojson-4f93734 -I../3rdparty/libprocess/3rdparty/protobuf-2.5.0/src -I../3rdparty/libprocess/3rdparty/glog-0.3.3/src -I../3rdparty/libprocess/3rdparty/glog-0.3.3/src -I../3rdparty/leveldb/include -I../3rdparty/zookeeper-3.4.5/src/c/include -I../3rdparty/zookeeper-3.4.5/src/c/generated -I../3rdparty/libprocess/3rdparty/protobuf-2.5.0/src -I/usr/include/subversion-1 -I/usr/include/apr-1 -I/usr/include/apr-1.0  -pthread -g1 -O0 -Wno-unused-local-typedefs -std=c++11 -MT examples/long_lived_framework-long_lived_framework.o -MD -MP -MF examples/.deps/long_lived_framework-long_lived_framework.Tpo -c -o examples/long_lived_framework-long_lived_framework.o `test -f 'examples/long_lived_framework.cpp' || echo '../../src/'`examples/long_lived_framework.cpp
g++ -DPACKAGE_NAME=\"mesos\" -DPACKAGE_TARNAME=\"mesos\" -DPACKAGE_VERSION=\"0.24.0\" -DPACKAGE_STRING=\"mesos\ 0.24.0\" -DPACKAGE_BUGREPORT=\"\" -DPACKAGE_URL=\"\" -DPACKAGE=\"mesos\" -DVERSION=\"0.24.0\" -DSTDC_HEADERS=1 -DHAVE_SYS_TYPES_H=1 -DHAVE_SYS_STAT_H=1 -DHAVE_STDLIB_H=1 -DHAVE_STRING_H=1 -DHAVE_MEMORY_H=1 -DHAVE_STRINGS_H=1 -DHAVE_INTTYPES_H=1 -DHAVE_STDINT_H=1 -DHAVE_UNISTD_H=1 -DHAVE_DLFCN_H=1 -DLT_OBJDIR=\".libs/\" -DHAVE_PTHREAD_PRIO_INHERIT=1 -DHAVE_PTHREAD=1 -DHAVE_LIBZ=1 -DHAVE_LIBCURL=1 -DHAVE_APR_POOLS_H=1 -DHAVE_LIBAPR_1=1 -DHAVE_SVN_VERSION_H=1 -DHAVE_LIBSVN_SUBR_1=1 -DHAVE_SVN_DELTA_H=1 -DHAVE_LIBSVN_DELTA_1=1 -DHAVE_LIBSASL2=1 -DMESOS_HAS_JAVA=1 -DHAVE_PYTHON=\"2.7\" -DMESOS_HAS_PYTHON=1 -I. -I../../src   -Wall -Werror -DLIBDIR=\"/mesos/mesos-0.24.0/_inst/lib\" -DPKGLIBEXECDIR=\"/mesos/mesos-0.24.0/_inst/libexec/mesos\" -DPKGDATADIR=\"/mesos/mesos-0.24.0/_inst/share/mesos\" -I../../include -I../../3rdparty/libprocess/include -I../../3rdparty/libprocess/3rdparty/stout/include -I../include -I../include/mesos -I../3rdparty/libprocess/3rdparty/boost-1.53.0 -I../3rdparty/libprocess/3rdparty/picojson-4f93734 -I../3rdparty/libprocess/3rdparty/protobuf-2.5.0/src -I../3rdparty/libprocess/3rdparty/glog-0.3.3/src -I../3rdparty/libprocess/3rdparty/glog-0.3.3/src -I../3rdparty/leveldb/include -I../3rdparty/zookeeper-3.4.5/src/c/include -I../3rdparty/zookeeper-3.4.5/src/c/generated -I../3rdparty/libprocess/3rdparty/protobuf-2.5.0/src -I/usr/include/subversion-1 -I/usr/include/apr-1 -I/usr/include/apr-1.0  -pthread -g1 -O0 -Wno-unused-local-typedefs -std=c++11 -MT examples/long_lived_executor-long_lived_executor.o -MD -MP -MF examples/.deps/long_lived_executor-long_lived_executor.Tpo -c -o examples/long_lived_executor-long_lived_executor.o `test -f 'examples/long_lived_executor.cpp' || echo '../../src/'`examples/long_lived_executor.cpp
g++ -DPACKAGE_NAME=\"mesos\" -DPACKAGE_TARNAME=\"mesos\" -DPACKAGE_VERSION=\"0.24.0\" -DPACKAGE_STRING=\"mesos\ 0.24.0\" -DPACKAGE_BUGREPORT=\"\" -DPACKAGE_URL=\"\" -DPACKAGE=\"mesos\" -DVERSION=\"0.24.0\" -DSTDC_HEADERS=1 -DHAVE_SYS_TYPES_H=1 -DHAVE_SYS_STAT_H=1 -DHAVE_STDLIB_H=1 -DHAVE_STRING_H=1 -DHAVE_MEMORY_H=1 -DHAVE_STRINGS_H=1 -DHAVE_INTTYPES_H=1 -DHAVE_STDINT_H=1 -DHAVE_UNISTD_H=1 -DHAVE_DLFCN_H=1 -DLT_OBJDIR=\".libs/\" -DHAVE_PTHREAD_PRIO_INHERIT=1 -DHAVE_PTHREAD=1 -DHAVE_LIBZ=1 -DHAVE_LIBCURL=1 -DHAVE_APR_POOLS_H=1 -DHAVE_LIBAPR_1=1 -DHAVE_SVN_VERSION_H=1 -DHAVE_LIBSVN_SUBR_1=1 -DHAVE_SVN_DELTA_H=1 -DHAVE_LIBSVN_DELTA_1=1 -DHAVE_LIBSASL2=1 -DMESOS_HAS_JAVA=1 -DHAVE_PYTHON=\"2.7\" -DMESOS_HAS_PYTHON=1 -I. -I../../src   -Wall -Werror -DLIBDIR=\"/mesos/mesos-0.24.0/_inst/lib\" -DPKGLIBEXECDIR=\"/mesos/mesos-0.24.0/_inst/libexec/mesos\" -DPKGDATADIR=\"/mesos/mesos-0.24.0/_inst/share/mesos\" -I../../include -I../../3rdparty/libprocess/include -I../../3rdparty/libprocess/3rdparty/stout/include -I../include -I../include/mesos -I../3rdparty/libprocess/3rdparty/boost-1.53.0 -I../3rdparty/libprocess/3rdparty/picojson-4f93734 -I../3rdparty/libprocess/3rdparty/protobuf-2.5.0/src -I../3rdparty/libprocess/3rdparty/glog-0.3.3/src -I../3rdparty/libprocess/3rdparty/glog-0.3.3/src -I../3rdparty/leveldb/include -I../3rdparty/zookeeper-3.4.5/src/c/include -I../3rdparty/zookeeper-3.4.5/src/c/generated -I../3rdparty/libprocess/3rdparty/protobuf-2.5.0/src -I/usr/include/subversion-1 -I/usr/include/apr-1 -I/usr/include/apr-1.0  -pthread -g1 -O0 -Wno-unused-local-typedefs -std=c++11 -MT examples/no_executor_framework-no_executor_framework.o -MD -MP -MF examples/.deps/no_executor_framework-no_executor_framework.Tpo -c -o examples/no_executor_framework-no_executor_framework.o `test -f 'examples/no_executor_framework.cpp' || echo '../../src/'`examples/no_executor_framework.cpp
g++ -DPACKAGE_NAME=\"mesos\" -DPACKAGE_TARNAME=\"mesos\" -DPACKAGE_VERSION=\"0.24.0\" -DPACKAGE_STRING=\"mesos\ 0.24.0\" -DPACKAGE_BUGREPORT=\"\" -DPACKAGE_URL=\"\" -DPACKAGE=\"mesos\" -DVERSION=\"0.24.0\" -DSTDC_HEADERS=1 -DHAVE_SYS_TYPES_H=1 -DHAVE_SYS_STAT_H=1 -DHAVE_STDLIB_H=1 -DHAVE_STRING_H=1 -DHAVE_MEMORY_H=1 -DHAVE_STRINGS_H=1 -DHAVE_INTTYPES_H=1 -DHAVE_STDINT_H=1 -DHAVE_UNISTD_H=1 -DHAVE_DLFCN_H=1 -DLT_OBJDIR=\".libs/\" -DHAVE_PTHREAD_PRIO_INHERIT=1 -DHAVE_PTHREAD=1 -DHAVE_LIBZ=1 -DHAVE_LIBCURL=1 -DHAVE_APR_POOLS_H=1 -DHAVE_LIBAPR_1=1 -DHAVE_SVN_VERSION_H=1 -DHAVE_LIBSVN_SUBR_1=1 -DHAVE_SVN_DELTA_H=1 -DHAVE_LIBSVN_DELTA_1=1 -DHAVE_LIBSASL2=1 -DMESOS_HAS_JAVA=1 -DHAVE_PYTHON=\"2.7\" -DMESOS_HAS_PYTHON=1 -I. -I../../src   -Wall -Werror -DLIBDIR=\"/mesos/mesos-0.24.0/_inst/lib\" -DPKGLIBEXECDIR=\"/mesos/mesos-0.24.0/_inst/libexec/mesos\" -DPKGDATADIR=\"/mesos/mesos-0.24.0/_inst/share/mesos\" -I../../include -I../../3rdparty/libprocess/include -I../../3rdparty/libprocess/3rdparty/stout/include -I../include -I../include/mesos -I../3rdparty/libprocess/3rdparty/boost-1.53.0 -I../3rdparty/libprocess/3rdparty/picojson-4f93734 -I../3rdparty/libprocess/3rdparty/protobuf-2.5.0/src -I../3rdparty/libprocess/3rdparty/glog-0.3.3/src -I../3rdparty/libprocess/3rdparty/glog-0.3.3/src -I../3rdparty/leveldb/include -I../3rdparty/zookeeper-3.4.5/src/c/include -I../3rdparty/zookeeper-3.4.5/src/c/generated -I../3rdparty/libprocess/3rdparty/protobuf-2.5.0/src -I/usr/include/subversion-1 -I/usr/include/apr-1 -I/usr/include/apr-1.0  -pthread -g1 -O0 -Wno-unused-local-typedefs -std=c++11 -MT examples/docker_no_executor_framework-docker_no_executor_framework.o -MD -MP -MF examples/.deps/docker_no_executor_framework-docker_no_executor_framework.Tpo -c -o examples/docker_no_executor_framework-docker_no_executor_framework.o `test -f 'examples/docker_no_executor_framework.cpp' || echo '../../src/'`examples/docker_no_executor_framework.cpp
g++ -DPACKAGE_NAME=\"mesos\" -DPACKAGE_TARNAME=\"mesos\" -DPACKAGE_VERSION=\"0.24.0\" -DPACKAGE_STRING=\"mesos\ 0.24.0\" -DPACKAGE_BUGREPORT=\"\" -DPACKAGE_URL=\"\" -DPACKAGE=\"mesos\" -DVERSION=\"0.24.0\" -DSTDC_HEADERS=1 -DHAVE_SYS_TYPES_H=1 -DHAVE_SYS_STAT_H=1 -DHAVE_STDLIB_H=1 -DHAVE_STRING_H=1 -DHAVE_MEMORY_H=1 -DHAVE_STRINGS_H=1 -DHAVE_INTTYPES_H=1 -DHAVE_STDINT_H=1 -DHAVE_UNISTD_H=1 -DHAVE_DLFCN_H=1 -DLT_OBJDIR=\".libs/\" -DHAVE_PTHREAD_PRIO_INHERIT=1 -DHAVE_PTHREAD=1 -DHAVE_LIBZ=1 -DHAVE_LIBCURL=1 -DHAVE_APR_POOLS_H=1 -DHAVE_LIBAPR_1=1 -DHAVE_SVN_VERSION_H=1 -DHAVE_LIBSVN_SUBR_1=1 -DHAVE_SVN_DELTA_H=1 -DHAVE_LIBSVN_DELTA_1=1 -DHAVE_LIBSASL2=1 -DMESOS_HAS_JAVA=1 -DHAVE_PYTHON=\"2.7\" -DMESOS_HAS_PYTHON=1 -I. -I../../src   -Wall -Werror -DLIBDIR=\"/mesos/mesos-0.24.0/_inst/lib\" -DPKGLIBEXECDIR=\"/mesos/mesos-0.24.0/_inst/libexec/mesos\" -DPKGDATADIR=\"/mesos/mesos-0.24.0/_inst/share/mesos\" -I../../include -I../../3rdparty/libprocess/include -I../../3rdparty/libprocess/3rdparty/stout/include -I../include -I../include/mesos -I../3rdparty/libprocess/3rdparty/boost-1.53.0 -I../3rdparty/libprocess/3rdparty/picojson-4f93734 -I../3rdparty/libprocess/3rdparty/protobuf-2.5.0/src -I../3rdparty/libprocess/3rdparty/glog-0.3.3/src -I../3rdparty/libprocess/3rdparty/glog-0.3.3/src -I../3rdparty/leveldb/include -I../3rdparty/zookeeper-3.4.5/src/c/include -I../3rdparty/zookeeper-3.4.5/src/c/generated -I../3rdparty/libprocess/3rdparty/protobuf-2.5.0/src -I/usr/include/subversion-1 -I/usr/include/apr-1 -I/usr/include/apr-1.0  -pthread -g1 -O0 -Wno-unused-local-typedefs -std=c++11 -MT examples/balloon_framework-balloon_framework.o -MD -MP -MF examples/.deps/balloon_framework-balloon_framework.Tpo -c -o examples/balloon_framework-balloon_framework.o `test -f 'examples/balloon_framework.cpp' || echo '../../src/'`examples/balloon_framework.cpp
mv -f examples/.deps/test_executor-test_executor.Tpo examples/.deps/test_executor-test_executor.Po
g++ -DPACKAGE_NAME=\"mesos\" -DPACKAGE_TARNAME=\"mesos\" -DPACKAGE_VERSION=\"0.24.0\" -DPACKAGE_STRING=\"mesos\ 0.24.0\" -DPACKAGE_BUGREPORT=\"\" -DPACKAGE_URL=\"\" -DPACKAGE=\"mesos\" -DVERSION=\"0.24.0\" -DSTDC_HEADERS=1 -DHAVE_SYS_TYPES_H=1 -DHAVE_SYS_STAT_H=1 -DHAVE_STDLIB_H=1 -DHAVE_STRING_H=1 -DHAVE_MEMORY_H=1 -DHAVE_STRINGS_H=1 -DHAVE_INTTYPES_H=1 -DHAVE_STDINT_H=1 -DHAVE_UNISTD_H=1 -DHAVE_DLFCN_H=1 -DLT_OBJDIR=\".libs/\" -DHAVE_PTHREAD_PRIO_INHERIT=1 -DHAVE_PTHREAD=1 -DHAVE_LIBZ=1 -DHAVE_LIBCURL=1 -DHAVE_APR_POOLS_H=1 -DHAVE_LIBAPR_1=1 -DHAVE_SVN_VERSION_H=1 -DHAVE_LIBSVN_SUBR_1=1 -DHAVE_SVN_DELTA_H=1 -DHAVE_LIBSVN_DELTA_1=1 -DHAVE_LIBSASL2=1 -DMESOS_HAS_JAVA=1 -DHAVE_PYTHON=\"2.7\" -DMESOS_HAS_PYTHON=1 -I. -I../../src   -Wall -Werror -DLIBDIR=\"/mesos/mesos-0.24.0/_inst/lib\" -DPKGLIBEXECDIR=\"/mesos/mesos-0.24.0/_inst/libexec/mesos\" -DPKGDATADIR=\"/mesos/mesos-0.24.0/_inst/share/mesos\" -I../../include -I../../3rdparty/libprocess/include -I../../3rdparty/libprocess/3rdparty/stout/include -I../include -I../include/mesos -I../3rdparty/libprocess/3rdparty/boost-1.53.0 -I../3rdparty/libprocess/3rdparty/picojson-4f93734 -I../3rdparty/libprocess/3rdparty/protobuf-2.5.0/src -I../3rdparty/libprocess/3rdparty/glog-0.3.3/src -I../3rdparty/libprocess/3rdparty/glog-0.3.3/src -I../3rdparty/leveldb/include -I../3rdparty/zookeeper-3.4.5/src/c/include -I../3rdparty/zookeeper-3.4.5/src/c/generated -I../3rdparty/libprocess/3rdparty/protobuf-2.5.0/src -I/usr/include/subversion-1 -I/usr/include/apr-1 -I/usr/include/apr-1.0  -pthread -g1 -O0 -Wno-unused-local-typedefs -std=c++11 -MT examples/balloon_executor-balloon_executor.o -MD -MP -MF examples/.deps/balloon_executor-balloon_executor.Tpo -c -o examples/balloon_executor-balloon_executor.o `test -f 'examples/balloon_executor.cpp' || echo '../../src/'`examples/balloon_executor.cpp
mv -f examples/.deps/long_lived_framework-long_lived_framework.Tpo examples/.deps/long_lived_framework-long_lived_framework.Po
g++ -DPACKAGE_NAME=\"mesos\" -DPACKAGE_TARNAME=\"mesos\" -DPACKAGE_VERSION=\"0.24.0\" -DPACKAGE_STRING=\"mesos\ 0.24.0\" -DPACKAGE_BUGREPORT=\"\" -DPACKAGE_URL=\"\" -DPACKAGE=\"mesos\" -DVERSION=\"0.24.0\" -DSTDC_HEADERS=1 -DHAVE_SYS_TYPES_H=1 -DHAVE_SYS_STAT_H=1 -DHAVE_STDLIB_H=1 -DHAVE_STRING_H=1 -DHAVE_MEMORY_H=1 -DHAVE_STRINGS_H=1 -DHAVE_INTTYPES_H=1 -DHAVE_STDINT_H=1 -DHAVE_UNISTD_H=1 -DHAVE_DLFCN_H=1 -DLT_OBJDIR=\".libs/\" -DHAVE_PTHREAD_PRIO_INHERIT=1 -DHAVE_PTHREAD=1 -DHAVE_LIBZ=1 -DHAVE_LIBCURL=1 -DHAVE_APR_POOLS_H=1 -DHAVE_LIBAPR_1=1 -DHAVE_SVN_VERSION_H=1 -DHAVE_LIBSVN_SUBR_1=1 -DHAVE_SVN_DELTA_H=1 -DHAVE_LIBSVN_DELTA_1=1 -DHAVE_LIBSASL2=1 -DMESOS_HAS_JAVA=1 -DHAVE_PYTHON=\"2.7\" -DMESOS_HAS_PYTHON=1 -I. -I../../src   -Wall -Werror -DLIBDIR=\"/mesos/mesos-0.24.0/_inst/lib\" -DPKGLIBEXECDIR=\"/mesos/mesos-0.24.0/_inst/libexec/mesos\" -DPKGDATADIR=\"/mesos/mesos-0.24.0/_inst/share/mesos\" -I../../include -I../../3rdparty/libprocess/include -I../../3rdparty/libprocess/3rdparty/stout/include -I../include -I../include/mesos -I../3rdparty/libprocess/3rdparty/boost-1.53.0 -I../3rdparty/libprocess/3rdparty/picojson-4f93734 -I../3rdparty/libprocess/3rdparty/protobuf-2.5.0/src -I../3rdparty/libprocess/3rdparty/glog-0.3.3/src -I../3rdparty/libprocess/3rdparty/glog-0.3.3/src -I../3rdparty/leveldb/include -I../3rdparty/zookeeper-3.4.5/src/c/include -I../3rdparty/zookeeper-3.4.5/src/c/generated -I../3rdparty/libprocess/3rdparty/protobuf-2.5.0/src -I/usr/include/subversion-1 -I/usr/include/apr-1 -I/usr/include/apr-1.0  -pthread -g1 -O0 -Wno-unused-local-typedefs -std=c++11 -MT examples/load_generator_framework-load_generator_framework.o -MD -MP -MF examples/.deps/load_generator_framework-load_generator_framework.Tpo -c -o examples/load_generator_framework-load_generator_framework.o `test -f 'examples/load_generator_framework.cpp' || echo '../../src/'`examples/load_generator_framework.cpp
mv -f examples/.deps/long_lived_executor-long_lived_executor.Tpo examples/.deps/long_lived_executor-long_lived_executor.Po
g++ -DPACKAGE_NAME=\"mesos\" -DPACKAGE_TARNAME=\"mesos\" -DPACKAGE_VERSION=\"0.24.0\" -DPACKAGE_STRING=\"mesos\ 0.24.0\" -DPACKAGE_BUGREPORT=\"\" -DPACKAGE_URL=\"\" -DPACKAGE=\"mesos\" -DVERSION=\"0.24.0\" -DSTDC_HEADERS=1 -DHAVE_SYS_TYPES_H=1 -DHAVE_SYS_STAT_H=1 -DHAVE_STDLIB_H=1 -DHAVE_STRING_H=1 -DHAVE_MEMORY_H=1 -DHAVE_STRINGS_H=1 -DHAVE_INTTYPES_H=1 -DHAVE_STDINT_H=1 -DHAVE_UNISTD_H=1 -DHAVE_DLFCN_H=1 -DLT_OBJDIR=\".libs/\" -DHAVE_PTHREAD_PRIO_INHERIT=1 -DHAVE_PTHREAD=1 -DHAVE_LIBZ=1 -DHAVE_LIBCURL=1 -DHAVE_APR_POOLS_H=1 -DHAVE_LIBAPR_1=1 -DHAVE_SVN_VERSION_H=1 -DHAVE_LIBSVN_SUBR_1=1 -DHAVE_SVN_DELTA_H=1 -DHAVE_LIBSVN_DELTA_1=1 -DHAVE_LIBSASL2=1 -DMESOS_HAS_JAVA=1 -DHAVE_PYTHON=\"2.7\" -DMESOS_HAS_PYTHON=1 -I. -I../../src   -Wall -Werror -DLIBDIR=\"/mesos/mesos-0.24.0/_inst/lib\" -DPKGLIBEXECDIR=\"/mesos/mesos-0.24.0/_inst/libexec/mesos\" -DPKGDATADIR=\"/mesos/mesos-0.24.0/_inst/share/mesos\" -I../../include -I../../3rdparty/libprocess/include -I../../3rdparty/libprocess/3rdparty/stout/include -I../include -I../include/mesos -I../3rdparty/libprocess/3rdparty/boost-1.53.0 -I../3rdparty/libprocess/3rdparty/picojson-4f93734 -I../3rdparty/libprocess/3rdparty/protobuf-2.5.0/src -I../3rdparty/libprocess/3rdparty/glog-0.3.3/src -I../3rdparty/libprocess/3rdparty/glog-0.3.3/src -I../3rdparty/leveldb/include -I../3rdparty/zookeeper-3.4.5/src/c/include -I../3rdparty/zookeeper-3.4.5/src/c/generated -I../3rdparty/libprocess/3rdparty/protobuf-2.5.0/src -I/usr/include/subversion-1 -I/usr/include/apr-1 -I/usr/include/apr-1.0  -pthread -g1 -O0 -Wno-unused-local-typedefs -std=c++11 -MT examples/persistent_volume_framework-persistent_volume_framework.o -MD -MP -MF examples/.deps/persistent_volume_framework-persistent_volume_framework.Tpo -c -o examples/persistent_volume_framework-persistent_volume_framework.o `test -f 'examples/persistent_volume_framework.cpp' || echo '../../src/'`examples/persistent_volume_framework.cpp
mv -f examples/.deps/docker_no_executor_framework-docker_no_executor_framework.Tpo examples/.deps/docker_no_executor_framework-docker_no_executor_framework.Po
g++ -DPACKAGE_NAME=\"mesos\" -DPACKAGE_TARNAME=\"mesos\" -DPACKAGE_VERSION=\"0.24.0\" -DPACKAGE_STRING=\"mesos\ 0.24.0\" -DPACKAGE_BUGREPORT=\"\" -DPACKAGE_URL=\"\" -DPACKAGE=\"mesos\" -DVERSION=\"0.24.0\" -DSTDC_HEADERS=1 -DHAVE_SYS_TYPES_H=1 -DHAVE_SYS_STAT_H=1 -DHAVE_STDLIB_H=1 -DHAVE_STRING_H=1 -DHAVE_MEMORY_H=1 -DHAVE_STRINGS_H=1 -DHAVE_INTTYPES_H=1 -DHAVE_STDINT_H=1 -DHAVE_UNISTD_H=1 -DHAVE_DLFCN_H=1 -DLT_OBJDIR=\".libs/\" -DHAVE_PTHREAD_PRIO_INHERIT=1 -DHAVE_PTHREAD=1 -DHAVE_LIBZ=1 -DHAVE_LIBCURL=1 -DHAVE_APR_POOLS_H=1 -DHAVE_LIBAPR_1=1 -DHAVE_SVN_VERSION_H=1 -DHAVE_LIBSVN_SUBR_1=1 -DHAVE_SVN_DELTA_H=1 -DHAVE_LIBSVN_DELTA_1=1 -DHAVE_LIBSASL2=1 -DMESOS_HAS_JAVA=1 -DHAVE_PYTHON=\"2.7\" -DMESOS_HAS_PYTHON=1 -I. -I../../src   -Wall -Werror -DLIBDIR=\"/mesos/mesos-0.24.0/_inst/lib\" -DPKGLIBEXECDIR=\"/mesos/mesos-0.24.0/_inst/libexec/mesos\" -DPKGDATADIR=\"/mesos/mesos-0.24.0/_inst/share/mesos\" -I../../include -I../../3rdparty/libprocess/include -I../../3rdparty/libprocess/3rdparty/stout/include -I../include -I../include/mesos -I../3rdparty/libprocess/3rdparty/boost-1.53.0 -I../3rdparty/libprocess/3rdparty/picojson-4f93734 -I../3rdparty/libprocess/3rdparty/protobuf-2.5.0/src -I../3rdparty/libprocess/3rdparty/glog-0.3.3/src -I../3rdparty/libprocess/3rdparty/glog-0.3.3/src -I../3rdparty/leveldb/include -I../3rdparty/zookeeper-3.4.5/src/c/include -I../3rdparty/zookeeper-3.4.5/src/c/generated -I../3rdparty/libprocess/3rdparty/protobuf-2.5.0/src -DSOURCE_DIR=\"/mesos/mesos-0.24.0/_build/..\" -DBUILD_DIR=\"/mesos/mesos-0.24.0/_build\" -I../3rdparty/libprocess/3rdparty/gmock-1.6.0/gtest/include -I../3rdparty/libprocess/3rdparty/gmock-1.6.0/include -I/usr/lib/jvm/java-7-openjdk-amd64/include -I/usr/lib/jvm/java-7-openjdk-amd64/include/linux -DZOOKEEPER_VERSION=\"3.4.5\" -I/usr/include/subversion-1 -I/usr/include/apr-1 -I/usr/include/apr-1.0  -pthread -g1 -O0 -Wno-unused-local-typedefs -std=c++11 -MT tests/mesos_tests-composing_containerizer_tests.o -MD -MP -MF tests/.deps/mesos_tests-composing_containerizer_tests.Tpo -c -o tests/mesos_tests-composing_containerizer_tests.o `test -f 'tests/composing_containerizer_tests.cpp' || echo '../../src/'`tests/composing_containerizer_tests.cpp
mv -f examples/.deps/balloon_framework-balloon_framework.Tpo examples/.deps/balloon_framework-balloon_framework.Po
g++ -DPACKAGE_NAME=\"mesos\" -DPACKAGE_TARNAME=\"mesos\" -DPACKAGE_VERSION=\"0.24.0\" -DPACKAGE_STRING=\"mesos\ 0.24.0\" -DPACKAGE_BUGREPORT=\"\" -DPACKAGE_URL=\"\" -DPACKAGE=\"mesos\" -DVERSION=\"0.24.0\" -DSTDC_HEADERS=1 -DHAVE_SYS_TYPES_H=1 -DHAVE_SYS_STAT_H=1 -DHAVE_STDLIB_H=1 -DHAVE_STRING_H=1 -DHAVE_MEMORY_H=1 -DHAVE_STRINGS_H=1 -DHAVE_INTTYPES_H=1 -DHAVE_STDINT_H=1 -DHAVE_UNISTD_H=1 -DHAVE_DLFCN_H=1 -DLT_OBJDIR=\".libs/\" -DHAVE_PTHREAD_PRIO_INHERIT=1 -DHAVE_PTHREAD=1 -DHAVE_LIBZ=1 -DHAVE_LIBCURL=1 -DHAVE_APR_POOLS_H=1 -DHAVE_LIBAPR_1=1 -DHAVE_SVN_VERSION_H=1 -DHAVE_LIBSVN_SUBR_1=1 -DHAVE_SVN_DELTA_H=1 -DHAVE_LIBSVN_DELTA_1=1 -DHAVE_LIBSASL2=1 -DMESOS_HAS_JAVA=1 -DHAVE_PYTHON=\"2.7\" -DMESOS_HAS_PYTHON=1 -I. -I../../src   -Wall -Werror -DLIBDIR=\"/mesos/mesos-0.24.0/_inst/lib\" -DPKGLIBEXECDIR=\"/mesos/mesos-0.24.0/_inst/libexec/mesos\" -DPKGDATADIR=\"/mesos/mesos-0.24.0/_inst/share/mesos\" -I../../include -I../../3rdparty/libprocess/include -I../../3rdparty/libprocess/3rdparty/stout/include -I../include -I../include/mesos -I../3rdparty/libprocess/3rdparty/boost-1.53.0 -I../3rdparty/libprocess/3rdparty/picojson-4f93734 -I../3rdparty/libprocess/3rdparty/protobuf-2.5.0/src -I../3rdparty/libprocess/3rdparty/glog-0.3.3/src -I../3rdparty/libprocess/3rdparty/glog-0.3.3/src -I../3rdparty/leveldb/include -I../3rdparty/zookeeper-3.4.5/src/c/include -I../3rdparty/zookeeper-3.4.5/src/c/generated -I../3rdparty/libprocess/3rdparty/protobuf-2.5.0/src -DSOURCE_DIR=\"/mesos/mesos-0.24.0/_build/..\" -DBUILD_DIR=\"/mesos/mesos-0.24.0/_build\" -I../3rdparty/libprocess/3rdparty/gmock-1.6.0/gtest/include -I../3rdparty/libprocess/3rdparty/gmock-1.6.0/include -I/usr/lib/jvm/java-7-openjdk-amd64/include -I/usr/lib/jvm/java-7-openjdk-amd64/include/linux -DZOOKEEPER_VERSION=\"3.4.5\" -I/usr/include/subversion-1 -I/usr/include/apr-1 -I/usr/include/apr-1.0  -pthread -g1 -O0 -Wno-unused-local-typedefs -std=c++11 -MT tests/mesos_tests-containerizer.o -MD -MP -MF tests/.deps/mesos_tests-containerizer.Tpo -c -o tests/mesos_tests-containerizer.o `test -f 'tests/containerizer.cpp' || echo '../../src/'`tests/containerizer.cpp
mv -f examples/.deps/test_framework-test_framework.Tpo examples/.deps/test_framework-test_framework.Po
g++ -DPACKAGE_NAME=\"mesos\" -DPACKAGE_TARNAME=\"mesos\" -DPACKAGE_VERSION=\"0.24.0\" -DPACKAGE_STRING=\"mesos\ 0.24.0\" -DPACKAGE_BUGREPORT=\"\" -DPACKAGE_URL=\"\" -DPACKAGE=\"mesos\" -DVERSION=\"0.24.0\" -DSTDC_HEADERS=1 -DHAVE_SYS_TYPES_H=1 -DHAVE_SYS_STAT_H=1 -DHAVE_STDLIB_H=1 -DHAVE_STRING_H=1 -DHAVE_MEMORY_H=1 -DHAVE_STRINGS_H=1 -DHAVE_INTTYPES_H=1 -DHAVE_STDINT_H=1 -DHAVE_UNISTD_H=1 -DHAVE_DLFCN_H=1 -DLT_OBJDIR=\".libs/\" -DHAVE_PTHREAD_PRIO_INHERIT=1 -DHAVE_PTHREAD=1 -DHAVE_LIBZ=1 -DHAVE_LIBCURL=1 -DHAVE_APR_POOLS_H=1 -DHAVE_LIBAPR_1=1 -DHAVE_SVN_VERSION_H=1 -DHAVE_LIBSVN_SUBR_1=1 -DHAVE_SVN_DELTA_H=1 -DHAVE_LIBSVN_DELTA_1=1 -DHAVE_LIBSASL2=1 -DMESOS_HAS_JAVA=1 -DHAVE_PYTHON=\"2.7\" -DMESOS_HAS_PYTHON=1 -I. -I../../src   -Wall -Werror -DLIBDIR=\"/mesos/mesos-0.24.0/_inst/lib\" -DPKGLIBEXECDIR=\"/mesos/mesos-0.24.0/_inst/libexec/mesos\" -DPKGDATADIR=\"/mesos/mesos-0.24.0/_inst/share/mesos\" -I../../include -I../../3rdparty/libprocess/include -I../../3rdparty/libprocess/3rdparty/stout/include -I../include -I../include/mesos -I../3rdparty/libprocess/3rdparty/boost-1.53.0 -I../3rdparty/libprocess/3rdparty/picojson-4f93734 -I../3rdparty/libprocess/3rdparty/protobuf-2.5.0/src -I../3rdparty/libprocess/3rdparty/glog-0.3.3/src -I../3rdparty/libprocess/3rdparty/glog-0.3.3/src -I../3rdparty/leveldb/include -I../3rdparty/zookeeper-3.4.5/src/c/include -I../3rdparty/zookeeper-3.4.5/src/c/generated -I../3rdparty/libprocess/3rdparty/protobuf-2.5.0/src -DSOURCE_DIR=\"/mesos/mesos-0.24.0/_build/..\" -DBUILD_DIR=\"/mesos/mesos-0.24.0/_build\" -I../3rdparty/libprocess/3rdparty/gmock-1.6.0/gtest/include -I../3rdparty/libprocess/3rdparty/gmock-1.6.0/include -I/usr/lib/jvm/java-7-openjdk-amd64/include -I/usr/lib/jvm/java-7-openjdk-amd64/include/linux -DZOOKEEPER_VERSION=\"3.4.5\" -I/usr/include/subversion-1 -I/usr/include/apr-1 -I/usr/include/apr-1.0  -pthread -g1 -O0 -Wno-unused-local-typedefs -std=c++11 -MT tests/mesos_tests-containerizer_tests.o -MD -MP -MF tests/.deps/mesos_tests-containerizer_tests.Tpo -c -o tests/mesos_tests-containerizer_tests.o `test -f 'tests/containerizer_tests.cpp' || echo '../../src/'`tests/containerizer_tests.cpp
mv -f examples/.deps/no_executor_framework-no_executor_framework.Tpo examples/.deps/no_executor_framework-no_executor_framework.Po
g++ -DPACKAGE_NAME=\"mesos\" -DPACKAGE_TARNAME=\"mesos\" -DPACKAGE_VERSION=\"0.24.0\" -DPACKAGE_STRING=\"mesos\ 0.24.0\" -DPACKAGE_BUGREPORT=\"\" -DPACKAGE_URL=\"\" -DPACKAGE=\"mesos\" -DVERSION=\"0.24.0\" -DSTDC_HEADERS=1 -DHAVE_SYS_TYPES_H=1 -DHAVE_SYS_STAT_H=1 -DHAVE_STDLIB_H=1 -DHAVE_STRING_H=1 -DHAVE_MEMORY_H=1 -DHAVE_STRINGS_H=1 -DHAVE_INTTYPES_H=1 -DHAVE_STDINT_H=1 -DHAVE_UNISTD_H=1 -DHAVE_DLFCN_H=1 -DLT_OBJDIR=\".libs/\" -DHAVE_PTHREAD_PRIO_INHERIT=1 -DHAVE_PTHREAD=1 -DHAVE_LIBZ=1 -DHAVE_LIBCURL=1 -DHAVE_APR_POOLS_H=1 -DHAVE_LIBAPR_1=1 -DHAVE_SVN_VERSION_H=1 -DHAVE_LIBSVN_SUBR_1=1 -DHAVE_SVN_DELTA_H=1 -DHAVE_LIBSVN_DELTA_1=1 -DHAVE_LIBSASL2=1 -DMESOS_HAS_JAVA=1 -DHAVE_PYTHON=\"2.7\" -DMESOS_HAS_PYTHON=1 -I. -I../../src   -Wall -Werror -DLIBDIR=\"/mesos/mesos-0.24.0/_inst/lib\" -DPKGLIBEXECDIR=\"/mesos/mesos-0.24.0/_inst/libexec/mesos\" -DPKGDATADIR=\"/mesos/mesos-0.24.0/_inst/share/mesos\" -I../../include -I../../3rdparty/libprocess/include -I../../3rdparty/libprocess/3rdparty/stout/include -I../include -I../include/mesos -I../3rdparty/libprocess/3rdparty/boost-1.53.0 -I../3rdparty/libprocess/3rdparty/picojson-4f93734 -I../3rdparty/libprocess/3rdparty/protobuf-2.5.0/src -I../3rdparty/libprocess/3rdparty/glog-0.3.3/src -I../3rdparty/libprocess/3rdparty/glog-0.3.3/src -I../3rdparty/leveldb/include -I../3rdparty/zookeeper-3.4.5/src/c/include -I../3rdparty/zookeeper-3.4.5/src/c/generated -I../3rdparty/libprocess/3rdparty/protobuf-2.5.0/src -DSOURCE_DIR=\"/mesos/mesos-0.24.0/_build/..\" -DBUILD_DIR=\"/mesos/mesos-0.24.0/_build\" -I../3rdparty/libprocess/3rdparty/gmock-1.6.0/gtest/include -I../3rdparty/libprocess/3rdparty/gmock-1.6.0/include -I/usr/lib/jvm/java-7-openjdk-amd64/include -I/usr/lib/jvm/java-7-openjdk-amd64/include/linux -DZOOKEEPER_VERSION=\"3.4.5\" -I/usr/include/subversion-1 -I/usr/include/apr-1 -I/usr/include/apr-1.0  -pthread -g1 -O0 -Wno-unused-local-typedefs -std=c++11 -MT tests/mesos_tests-cram_md5_authentication_tests.o -MD -MP -MF tests/.deps/mesos_tests-cram_md5_authentication_tests.Tpo -c -o tests/mesos_tests-cram_md5_authentication_tests.o `test -f 'tests/cram_md5_authentication_tests.cpp' || echo '../../src/'`tests/cram_md5_authentication_tests.cpp
mv -f examples/.deps/balloon_executor-balloon_executor.Tpo examples/.deps/balloon_executor-balloon_executor.Po
g++ -DPACKAGE_NAME=\"mesos\" -DPACKAGE_TARNAME=\"mesos\" -DPACKAGE_VERSION=\"0.24.0\" -DPACKAGE_STRING=\"mesos\ 0.24.0\" -DPACKAGE_BUGREPORT=\"\" -DPACKAGE_URL=\"\" -DPACKAGE=\"mesos\" -DVERSION=\"0.24.0\" -DSTDC_HEADERS=1 -DHAVE_SYS_TYPES_H=1 -DHAVE_SYS_STAT_H=1 -DHAVE_STDLIB_H=1 -DHAVE_STRING_H=1 -DHAVE_MEMORY_H=1 -DHAVE_STRINGS_H=1 -DHAVE_INTTYPES_H=1 -DHAVE_STDINT_H=1 -DHAVE_UNISTD_H=1 -DHAVE_DLFCN_H=1 -DLT_OBJDIR=\".libs/\" -DHAVE_PTHREAD_PRIO_INHERIT=1 -DHAVE_PTHREAD=1 -DHAVE_LIBZ=1 -DHAVE_LIBCURL=1 -DHAVE_APR_POOLS_H=1 -DHAVE_LIBAPR_1=1 -DHAVE_SVN_VERSION_H=1 -DHAVE_LIBSVN_SUBR_1=1 -DHAVE_SVN_DELTA_H=1 -DHAVE_LIBSVN_DELTA_1=1 -DHAVE_LIBSASL2=1 -DMESOS_HAS_JAVA=1 -DHAVE_PYTHON=\"2.7\" -DMESOS_HAS_PYTHON=1 -I. -I../../src   -Wall -Werror -DLIBDIR=\"/mesos/mesos-0.24.0/_inst/lib\" -DPKGLIBEXECDIR=\"/mesos/mesos-0.24.0/_inst/libexec/mesos\" -DPKGDATADIR=\"/mesos/mesos-0.24.0/_inst/share/mesos\" -I../../include -I../../3rdparty/libprocess/include -I../../3rdparty/libprocess/3rdparty/stout/include -I../include -I../include/mesos -I../3rdparty/libprocess/3rdparty/boost-1.53.0 -I../3rdparty/libprocess/3rdparty/picojson-4f93734 -I../3rdparty/libprocess/3rdparty/protobuf-2.5.0/src -I../3rdparty/libprocess/3rdparty/glog-0.3.3/src -I../3rdparty/libprocess/3rdparty/glog-0.3.3/src -I../3rdparty/leveldb/include -I../3rdparty/zookeeper-3.4.5/src/c/include -I../3rdparty/zookeeper-3.4.5/src/c/generated -I../3rdparty/libprocess/3rdparty/protobuf-2.5.0/src -DSOURCE_DIR=\"/mesos/mesos-0.24.0/_build/..\" -DBUILD_DIR=\"/mesos/mesos-0.24.0/_build\" -I../3rdparty/libprocess/3rdparty/gmock-1.6.0/gtest/include -I../3rdparty/libprocess/3rdparty/gmock-1.6.0/include -I/usr/lib/jvm/java-7-openjdk-amd64/include -I/usr/lib/jvm/java-7-openjdk-amd64/include/linux -DZOOKEEPER_VERSION=\"3.4.5\" -I/usr/include/subversion-1 -I/usr/include/apr-1 -I/usr/include/apr-1.0  -pthread -g1 -O0 -Wno-unused-local-typedefs -std=c++11 -MT tests/mesos_tests-credentials_tests.o -MD -MP -MF tests/.deps/mesos_tests-credentials_tests.Tpo -c -o tests/mesos_tests-credentials_tests.o `test -f 'tests/credentials_tests.cpp' || echo '../../src/'`tests/credentials_tests.cpp
mv -f examples/.deps/event_call_framework-event_call_framework.Tpo examples/.deps/event_call_framework-event_call_framework.Po
g++ -DPACKAGE_NAME=\"mesos\" -DPACKAGE_TARNAME=\"mesos\" -DPACKAGE_VERSION=\"0.24.0\" -DPACKAGE_STRING=\"mesos\ 0.24.0\" -DPACKAGE_BUGREPORT=\"\" -DPACKAGE_URL=\"\" -DPACKAGE=\"mesos\" -DVERSION=\"0.24.0\" -DSTDC_HEADERS=1 -DHAVE_SYS_TYPES_H=1 -DHAVE_SYS_STAT_H=1 -DHAVE_STDLIB_H=1 -DHAVE_STRING_H=1 -DHAVE_MEMORY_H=1 -DHAVE_STRINGS_H=1 -DHAVE_INTTYPES_H=1 -DHAVE_STDINT_H=1 -DHAVE_UNISTD_H=1 -DHAVE_DLFCN_H=1 -DLT_OBJDIR=\".libs/\" -DHAVE_PTHREAD_PRIO_INHERIT=1 -DHAVE_PTHREAD=1 -DHAVE_LIBZ=1 -DHAVE_LIBCURL=1 -DHAVE_APR_POOLS_H=1 -DHAVE_LIBAPR_1=1 -DHAVE_SVN_VERSION_H=1 -DHAVE_LIBSVN_SUBR_1=1 -DHAVE_SVN_DELTA_H=1 -DHAVE_LIBSVN_DELTA_1=1 -DHAVE_LIBSASL2=1 -DMESOS_HAS_JAVA=1 -DHAVE_PYTHON=\"2.7\" -DMESOS_HAS_PYTHON=1 -I. -I../../src   -Wall -Werror -DLIBDIR=\"/mesos/mesos-0.24.0/_inst/lib\" -DPKGLIBEXECDIR=\"/mesos/mesos-0.24.0/_inst/libexec/mesos\" -DPKGDATADIR=\"/mesos/mesos-0.24.0/_inst/share/mesos\" -I../../include -I../../3rdparty/libprocess/include -I../../3rdparty/libprocess/3rdparty/stout/include -I../include -I../include/mesos -I../3rdparty/libprocess/3rdparty/boost-1.53.0 -I../3rdparty/libprocess/3rdparty/picojson-4f93734 -I../3rdparty/libprocess/3rdparty/protobuf-2.5.0/src -I../3rdparty/libprocess/3rdparty/glog-0.3.3/src -I../3rdparty/libprocess/3rdparty/glog-0.3.3/src -I../3rdparty/leveldb/include -I../3rdparty/zookeeper-3.4.5/src/c/include -I../3rdparty/zookeeper-3.4.5/src/c/generated -I../3rdparty/libprocess/3rdparty/protobuf-2.5.0/src -DSOURCE_DIR=\"/mesos/mesos-0.24.0/_build/..\" -DBUILD_DIR=\"/mesos/mesos-0.24.0/_build\" -I../3rdparty/libprocess/3rdparty/gmock-1.6.0/gtest/include -I../3rdparty/libprocess/3rdparty/gmock-1.6.0/include -I/usr/lib/jvm/java-7-openjdk-amd64/include -I/usr/lib/jvm/java-7-openjdk-amd64/include/linux -DZOOKEEPER_VERSION=\"3.4.5\" -I/usr/include/subversion-1 -I/usr/include/apr-1 -I/usr/include/apr-1.0  -pthread -g1 -O0 -Wno-unused-local-typedefs -std=c++11 -MT tests/mesos_tests-disk_quota_tests.o -MD -MP -MF tests/.deps/mesos_tests-disk_quota_tests.Tpo -c -o tests/mesos_tests-disk_quota_tests.o `test -f 'tests/disk_quota_tests.cpp' || echo '../../src/'`tests/disk_quota_tests.cpp
mv -f examples/.deps/load_generator_framework-load_generator_framework.Tpo examples/.deps/load_generator_framework-load_generator_framework.Po
g++ -DPACKAGE_NAME=\"mesos\" -DPACKAGE_TARNAME=\"mesos\" -DPACKAGE_VERSION=\"0.24.0\" -DPACKAGE_STRING=\"mesos\ 0.24.0\" -DPACKAGE_BUGREPORT=\"\" -DPACKAGE_URL=\"\" -DPACKAGE=\"mesos\" -DVERSION=\"0.24.0\" -DSTDC_HEADERS=1 -DHAVE_SYS_TYPES_H=1 -DHAVE_SYS_STAT_H=1 -DHAVE_STDLIB_H=1 -DHAVE_STRING_H=1 -DHAVE_MEMORY_H=1 -DHAVE_STRINGS_H=1 -DHAVE_INTTYPES_H=1 -DHAVE_STDINT_H=1 -DHAVE_UNISTD_H=1 -DHAVE_DLFCN_H=1 -DLT_OBJDIR=\".libs/\" -DHAVE_PTHREAD_PRIO_INHERIT=1 -DHAVE_PTHREAD=1 -DHAVE_LIBZ=1 -DHAVE_LIBCURL=1 -DHAVE_APR_POOLS_H=1 -DHAVE_LIBAPR_1=1 -DHAVE_SVN_VERSION_H=1 -DHAVE_LIBSVN_SUBR_1=1 -DHAVE_SVN_DELTA_H=1 -DHAVE_LIBSVN_DELTA_1=1 -DHAVE_LIBSASL2=1 -DMESOS_HAS_JAVA=1 -DHAVE_PYTHON=\"2.7\" -DMESOS_HAS_PYTHON=1 -I. -I../../src   -Wall -Werror -DLIBDIR=\"/mesos/mesos-0.24.0/_inst/lib\" -DPKGLIBEXECDIR=\"/mesos/mesos-0.24.0/_inst/libexec/mesos\" -DPKGDATADIR=\"/mesos/mesos-0.24.0/_inst/share/mesos\" -I../../include -I../../3rdparty/libprocess/include -I../../3rdparty/libprocess/3rdparty/stout/include -I../include -I../include/mesos -I../3rdparty/libprocess/3rdparty/boost-1.53.0 -I../3rdparty/libprocess/3rdparty/picojson-4f93734 -I../3rdparty/libprocess/3rdparty/protobuf-2.5.0/src -I../3rdparty/libprocess/3rdparty/glog-0.3.3/src -I../3rdparty/libprocess/3rdparty/glog-0.3.3/src -I../3rdparty/leveldb/include -I../3rdparty/zookeeper-3.4.5/src/c/include -I../3rdparty/zookeeper-3.4.5/src/c/generated -I../3rdparty/libprocess/3rdparty/protobuf-2.5.0/src -DSOURCE_DIR=\"/mesos/mesos-0.24.0/_build/..\" -DBUILD_DIR=\"/mesos/mesos-0.24.0/_build\" -I../3rdparty/libprocess/3rdparty/gmock-1.6.0/gtest/include -I../3rdparty/libprocess/3rdparty/gmock-1.6.0/include -I/usr/lib/jvm/java-7-openjdk-amd64/include -I/usr/lib/jvm/java-7-openjdk-amd64/include/linux -DZOOKEEPER_VERSION=\"3.4.5\" -I/usr/include/subversion-1 -I/usr/include/apr-1 -I/usr/include/apr-1.0  -pthread -g1 -O0 -Wno-unused-local-typedefs -std=c++11 -MT tests/mesos_tests-docker_containerizer_tests.o -MD -MP -MF tests/.deps/mesos_tests-docker_containerizer_tests.Tpo -c -o tests/mesos_tests-docker_containerizer_tests.o `test -f 'tests/docker_containerizer_tests.cpp' || echo '../../src/'`tests/docker_containerizer_tests.cpp
mv -f examples/.deps/persistent_volume_framework-persistent_volume_framework.Tpo examples/.deps/persistent_volume_framework-persistent_volume_framework.Po
g++ -DPACKAGE_NAME=\"mesos\" -DPACKAGE_TARNAME=\"mesos\" -DPACKAGE_VERSION=\"0.24.0\" -DPACKAGE_STRING=\"mesos\ 0.24.0\" -DPACKAGE_BUGREPORT=\"\" -DPACKAGE_URL=\"\" -DPACKAGE=\"mesos\" -DVERSION=\"0.24.0\" -DSTDC_HEADERS=1 -DHAVE_SYS_TYPES_H=1 -DHAVE_SYS_STAT_H=1 -DHAVE_STDLIB_H=1 -DHAVE_STRING_H=1 -DHAVE_MEMORY_H=1 -DHAVE_STRINGS_H=1 -DHAVE_INTTYPES_H=1 -DHAVE_STDINT_H=1 -DHAVE_UNISTD_H=1 -DHAVE_DLFCN_H=1 -DLT_OBJDIR=\".libs/\" -DHAVE_PTHREAD_PRIO_INHERIT=1 -DHAVE_PTHREAD=1 -DHAVE_LIBZ=1 -DHAVE_LIBCURL=1 -DHAVE_APR_POOLS_H=1 -DHAVE_LIBAPR_1=1 -DHAVE_SVN_VERSION_H=1 -DHAVE_LIBSVN_SUBR_1=1 -DHAVE_SVN_DELTA_H=1 -DHAVE_LIBSVN_DELTA_1=1 -DHAVE_LIBSASL2=1 -DMESOS_HAS_JAVA=1 -DHAVE_PYTHON=\"2.7\" -DMESOS_HAS_PYTHON=1 -I. -I../../src   -Wall -Werror -DLIBDIR=\"/mesos/mesos-0.24.0/_inst/lib\" -DPKGLIBEXECDIR=\"/mesos/mesos-0.24.0/_inst/libexec/mesos\" -DPKGDATADIR=\"/mesos/mesos-0.24.0/_inst/share/mesos\" -I../../include -I../../3rdparty/libprocess/include -I../../3rdparty/libprocess/3rdparty/stout/include -I../include -I../include/mesos -I../3rdparty/libprocess/3rdparty/boost-1.53.0 -I../3rdparty/libprocess/3rdparty/picojson-4f93734 -I../3rdparty/libprocess/3rdparty/protobuf-2.5.0/src -I../3rdparty/libprocess/3rdparty/glog-0.3.3/src -I../3rdparty/libprocess/3rdparty/glog-0.3.3/src -I../3rdparty/leveldb/include -I../3rdparty/zookeeper-3.4.5/src/c/include -I../3rdparty/zookeeper-3.4.5/src/c/generated -I../3rdparty/libprocess/3rdparty/protobuf-2.5.0/src -DSOURCE_DIR=\"/mesos/mesos-0.24.0/_build/..\" -DBUILD_DIR=\"/mesos/mesos-0.24.0/_build\" -I../3rdparty/libprocess/3rdparty/gmock-1.6.0/gtest/include -I../3rdparty/libprocess/3rdparty/gmock-1.6.0/include -I/usr/lib/jvm/java-7-openjdk-amd64/include -I/usr/lib/jvm/java-7-openjdk-amd64/include/linux -DZOOKEEPER_VERSION=\"3.4.5\" -I/usr/include/subversion-1 -I/usr/include/apr-1 -I/usr/include/apr-1.0  -pthread -g1 -O0 -Wno-unused-local-typedefs -std=c++11 -MT tests/mesos_tests-docker_tests.o -MD -MP -MF tests/.deps/mesos_tests-docker_tests.Tpo -c -o tests/mesos_tests-docker_tests.o `test -f 'tests/docker_tests.cpp' || echo '../../src/'`tests/docker_tests.cpp
In file included from ../3rdparty/libprocess/3rdparty/gmock-1.6.0/include/gmock/internal/gmock-internal-utils.h:47:0,
                 from ../3rdparty/libprocess/3rdparty/gmock-1.6.0/include/gmock/gmock-actions.h:46,
                 from ../3rdparty/libprocess/3rdparty/gmock-1.6.0/include/gmock/gmock.h:58,
                 from ../../src/tests/docker_containerizer_tests.cpp:19:
../3rdparty/libprocess/3rdparty/gmock-1.6.0/gtest/include/gtest/gtest.h: In instantiation of 'testing::AssertionResult testing::internal::CmpHelperGT(const char*, const char*, const T1&, const T2&) [with T1 = long unsigned int; T2 = int]':
../../src/tests/docker_containerizer_tests.cpp:964:3:   required from here
../3rdparty/libprocess/3rdparty/gmock-1.6.0/gtest/include/gtest/gtest.h:1453:28: error: comparison between signed and unsigned integer expressions [-Werror=sign-compare]
 GTEST_IMPL_CMP_HELPER_(GT, > );
                            ^
../3rdparty/libprocess/3rdparty/gmock-1.6.0/gtest/include/gtest/gtest.h:1430:12: note: in definition of macro 'GTEST_IMPL_CMP_HELPER_'
   if (val1 op val2) {\
            ^
mv -f tests/.deps/mesos_tests-composing_containerizer_tests.Tpo tests/.deps/mesos_tests-composing_containerizer_tests.Po
g++ -DPACKAGE_NAME=\"mesos\" -DPACKAGE_TARNAME=\"mesos\" -DPACKAGE_VERSION=\"0.24.0\" -DPACKAGE_STRING=\"mesos\ 0.24.0\" -DPACKAGE_BUGREPORT=\"\" -DPACKAGE_URL=\"\" -DPACKAGE=\"mesos\" -DVERSION=\"0.24.0\" -DSTDC_HEADERS=1 -DHAVE_SYS_TYPES_H=1 -DHAVE_SYS_STAT_H=1 -DHAVE_STDLIB_H=1 -DHAVE_STRING_H=1 -DHAVE_MEMORY_H=1 -DHAVE_STRINGS_H=1 -DHAVE_INTTYPES_H=1 -DHAVE_STDINT_H=1 -DHAVE_UNISTD_H=1 -DHAVE_DLFCN_H=1 -DLT_OBJDIR=\".libs/\" -DHAVE_PTHREAD_PRIO_INHERIT=1 -DHAVE_PTHREAD=1 -DHAVE_LIBZ=1 -DHAVE_LIBCURL=1 -DHAVE_APR_POOLS_H=1 -DHAVE_LIBAPR_1=1 -DHAVE_SVN_VERSION_H=1 -DHAVE_LIBSVN_SUBR_1=1 -DHAVE_SVN_DELTA_H=1 -DHAVE_LIBSVN_DELTA_1=1 -DHAVE_LIBSASL2=1 -DMESOS_HAS_JAVA=1 -DHAVE_PYTHON=\"2.7\" -DMESOS_HAS_PYTHON=1 -I. -I../../src   -Wall -Werror -DLIBDIR=\"/mesos/mesos-0.24.0/_inst/lib\" -DPKGLIBEXECDIR=\"/mesos/mesos-0.24.0/_inst/libexec/mesos\" -DPKGDATADIR=\"/mesos/mesos-0.24.0/_inst/share/mesos\" -I../../include -I../../3rdparty/libprocess/include -I../../3rdparty/libprocess/3rdparty/stout/include -I../include -I../include/mesos -I../3rdparty/libprocess/3rdparty/boost-1.53.0 -I../3rdparty/libprocess/3rdparty/picojson-4f93734 -I../3rdparty/libprocess/3rdparty/protobuf-2.5.0/src -I../3rdparty/libprocess/3rdparty/glog-0.3.3/src -I../3rdparty/libprocess/3rdparty/glog-0.3.3/src -I../3rdparty/leveldb/include -I../3rdparty/zookeeper-3.4.5/src/c/include -I../3rdparty/zookeeper-3.4.5/src/c/generated -I../3rdparty/libprocess/3rdparty/protobuf-2.5.0/src -DSOURCE_DIR=\"/mesos/mesos-0.24.0/_build/..\" -DBUILD_DIR=\"/mesos/mesos-0.24.0/_build\" -I../3rdparty/libprocess/3rdparty/gmock-1.6.0/gtest/include -I../3rdparty/libprocess/3rdparty/gmock-1.6.0/include -I/usr/lib/jvm/java-7-openjdk-amd64/include -I/usr/lib/jvm/java-7-openjdk-amd64/include/linux -DZOOKEEPER_VERSION=\"3.4.5\" -I/usr/include/subversion-1 -I/usr/include/apr-1 -I/usr/include/apr-1.0  -pthread -g1 -O0 -Wno-unused-local-typedefs -std=c++11 -MT tests/mesos_tests-environment.o -MD -MP -MF tests/.deps/mesos_tests-environment.Tpo -c -o tests/mesos_tests-environment.o `test -f 'tests/environment.cpp' || echo '../../src/'`tests/environment.cpp
mv -f tests/.deps/mesos_tests-containerizer.Tpo tests/.deps/mesos_tests-containerizer.Po
g++ -DPACKAGE_NAME=\"mesos\" -DPACKAGE_TARNAME=\"mesos\" -DPACKAGE_VERSION=\"0.24.0\" -DPACKAGE_STRING=\"mesos\ 0.24.0\" -DPACKAGE_BUGREPORT=\"\" -DPACKAGE_URL=\"\" -DPACKAGE=\"mesos\" -DVERSION=\"0.24.0\" -DSTDC_HEADERS=1 -DHAVE_SYS_TYPES_H=1 -DHAVE_SYS_STAT_H=1 -DHAVE_STDLIB_H=1 -DHAVE_STRING_H=1 -DHAVE_MEMORY_H=1 -DHAVE_STRINGS_H=1 -DHAVE_INTTYPES_H=1 -DHAVE_STDINT_H=1 -DHAVE_UNISTD_H=1 -DHAVE_DLFCN_H=1 -DLT_OBJDIR=\".libs/\" -DHAVE_PTHREAD_PRIO_INHERIT=1 -DHAVE_PTHREAD=1 -DHAVE_LIBZ=1 -DHAVE_LIBCURL=1 -DHAVE_APR_POOLS_H=1 -DHAVE_LIBAPR_1=1 -DHAVE_SVN_VERSION_H=1 -DHAVE_LIBSVN_SUBR_1=1 -DHAVE_SVN_DELTA_H=1 -DHAVE_LIBSVN_DELTA_1=1 -DHAVE_LIBSASL2=1 -DMESOS_HAS_JAVA=1 -DHAVE_PYTHON=\"2.7\" -DMESOS_HAS_PYTHON=1 -I. -I../../src   -Wall -Werror -DLIBDIR=\"/mesos/mesos-0.24.0/_inst/lib\" -DPKGLIBEXECDIR=\"/mesos/mesos-0.24.0/_inst/libexec/mesos\" -DPKGDATADIR=\"/mesos/mesos-0.24.0/_inst/share/mesos\" -I../../include -I../../3rdparty/libprocess/include -I../../3rdparty/libprocess/3rdparty/stout/include -I../include -I../include/mesos -I../3rdparty/libprocess/3rdparty/boost-1.53.0 -I../3rdparty/libprocess/3rdparty/picojson-4f93734 -I../3rdparty/libprocess/3rdparty/protobuf-2.5.0/src -I../3rdparty/libprocess/3rdparty/glog-0.3.3/src -I../3rdparty/libprocess/3rdparty/glog-0.3.3/src -I../3rdparty/leveldb/include -I../3rdparty/zookeeper-3.4.5/src/c/include -I../3rdparty/zookeeper-3.4.5/src/c/generated -I../3rdparty/libprocess/3rdparty/protobuf-2.5.0/src -DSOURCE_DIR=\"/mesos/mesos-0.24.0/_build/..\" -DBUILD_DIR=\"/mesos/mesos-0.24.0/_build\" -I../3rdparty/libprocess/3rdparty/gmock-1.6.0/gtest/include -I../3rdparty/libprocess/3rdparty/gmock-1.6.0/include -I/usr/lib/jvm/java-7-openjdk-amd64/include -I/usr/lib/jvm/java-7-openjdk-amd64/include/linux -DZOOKEEPER_VERSION=\"3.4.5\" -I/usr/include/subversion-1 -I/usr/include/apr-1 -I/usr/include/apr-1.0  -pthread -g1 -O0 -Wno-unused-local-typedefs -std=c++11 -MT tests/mesos_tests-examples_tests.o -MD -MP -MF tests/.deps/mesos_tests-examples_tests.Tpo -c -o tests/mesos_tests-examples_tests.o `test -f 'tests/examples_tests.cpp' || echo '../../src/'`tests/examples_tests.cpp
mv -f tests/.deps/mesos_tests-examples_tests.Tpo tests/.deps/mesos_tests-examples_tests.Po
g++ -DPACKAGE_NAME=\"mesos\" -DPACKAGE_TARNAME=\"mesos\" -DPACKAGE_VERSION=\"0.24.0\" -DPACKAGE_STRING=\"mesos\ 0.24.0\" -DPACKAGE_BUGREPORT=\"\" -DPACKAGE_URL=\"\" -DPACKAGE=\"mesos\" -DVERSION=\"0.24.0\" -DSTDC_HEADERS=1 -DHAVE_SYS_TYPES_H=1 -DHAVE_SYS_STAT_H=1 -DHAVE_STDLIB_H=1 -DHAVE_STRING_H=1 -DHAVE_MEMORY_H=1 -DHAVE_STRINGS_H=1 -DHAVE_INTTYPES_H=1 -DHAVE_STDINT_H=1 -DHAVE_UNISTD_H=1 -DHAVE_DLFCN_H=1 -DLT_OBJDIR=\".libs/\" -DHAVE_PTHREAD_PRIO_INHERIT=1 -DHAVE_PTHREAD=1 -DHAVE_LIBZ=1 -DHAVE_LIBCURL=1 -DHAVE_APR_POOLS_H=1 -DHAVE_LIBAPR_1=1 -DHAVE_SVN_VERSION_H=1 -DHAVE_LIBSVN_SUBR_1=1 -DHAVE_SVN_DELTA_H=1 -DHAVE_LIBSVN_DELTA_1=1 -DHAVE_LIBSASL2=1 -DMESOS_HAS_JAVA=1 -DHAVE_PYTHON=\"2.7\" -DMESOS_HAS_PYTHON=1 -I. -I../../src   -Wall -Werror -DLIBDIR=\"/mesos/mesos-0.24.0/_inst/lib\" -DPKGLIBEXECDIR=\"/mesos/mesos-0.24.0/_inst/libexec/mesos\" -DPKGDATADIR=\"/mesos/mesos-0.24.0/_inst/share/mesos\" -I../../include -I../../3rdparty/libprocess/include -I../../3rdparty/libprocess/3rdparty/stout/include -I../include -I../include/mesos -I../3rdparty/libprocess/3rdparty/boost-1.53.0 -I../3rdparty/libprocess/3rdparty/picojson-4f93734 -I../3rdparty/libprocess/3rdparty/protobuf-2.5.0/src -I../3rdparty/libprocess/3rdparty/glog-0.3.3/src -I../3rdparty/libprocess/3rdparty/glog-0.3.3/src -I../3rdparty/leveldb/include -I../3rdparty/zookeeper-3.4.5/src/c/include -I../3rdparty/zookeeper-3.4.5/src/c/generated -I../3rdparty/libprocess/3rdparty/protobuf-2.5.0/src -DSOURCE_DIR=\"/mesos/mesos-0.24.0/_build/..\" -DBUILD_DIR=\"/mesos/mesos-0.24.0/_build\" -I../3rdparty/libprocess/3rdparty/gmock-1.6.0/gtest/include -I../3rdparty/libprocess/3rdparty/gmock-1.6.0/include -I/usr/lib/jvm/java-7-openjdk-amd64/include -I/usr/lib/jvm/java-7-openjdk-amd64/include/linux -DZOOKEEPER_VERSION=\"3.4.5\" -I/usr/include/subversion-1 -I/usr/include/apr-1 -I/usr/include/apr-1.0  -pthread -g1 -O0 -Wno-unused-local-typedefs -std=c++11 -MT tests/mesos_tests-exception_tests.o -MD -MP -MF tests/.deps/mesos_tests-exception_tests.Tpo -c -o tests/mesos_tests-exception_tests.o `test -f 'tests/exception_tests.cpp' || echo '../../src/'`tests/exception_tests.cpp
mv -f tests/.deps/mesos_tests-cram_md5_authentication_tests.Tpo tests/.deps/mesos_tests-cram_md5_authentication_tests.Po
g++ -DPACKAGE_NAME=\"mesos\" -DPACKAGE_TARNAME=\"mesos\" -DPACKAGE_VERSION=\"0.24.0\" -DPACKAGE_STRING=\"mesos\ 0.24.0\" -DPACKAGE_BUGREPORT=\"\" -DPACKAGE_URL=\"\" -DPACKAGE=\"mesos\" -DVERSION=\"0.24.0\" -DSTDC_HEADERS=1 -DHAVE_SYS_TYPES_H=1 -DHAVE_SYS_STAT_H=1 -DHAVE_STDLIB_H=1 -DHAVE_STRING_H=1 -DHAVE_MEMORY_H=1 -DHAVE_STRINGS_H=1 -DHAVE_INTTYPES_H=1 -DHAVE_STDINT_H=1 -DHAVE_UNISTD_H=1 -DHAVE_DLFCN_H=1 -DLT_OBJDIR=\".libs/\" -DHAVE_PTHREAD_PRIO_INHERIT=1 -DHAVE_PTHREAD=1 -DHAVE_LIBZ=1 -DHAVE_LIBCURL=1 -DHAVE_APR_POOLS_H=1 -DHAVE_LIBAPR_1=1 -DHAVE_SVN_VERSION_H=1 -DHAVE_LIBSVN_SUBR_1=1 -DHAVE_SVN_DELTA_H=1 -DHAVE_LIBSVN_DELTA_1=1 -DHAVE_LIBSASL2=1 -DMESOS_HAS_JAVA=1 -DHAVE_PYTHON=\"2.7\" -DMESOS_HAS_PYTHON=1 -I. -I../../src   -Wall -Werror -DLIBDIR=\"/mesos/mesos-0.24.0/_inst/lib\" -DPKGLIBEXECDIR=\"/mesos/mesos-0.24.0/_inst/libexec/mesos\" -DPKGDATADIR=\"/mesos/mesos-0.24.0/_inst/share/mesos\" -I../../include -I../../3rdparty/libprocess/include -I../../3rdparty/libprocess/3rdparty/stout/include -I../include -I../include/mesos -I../3rdparty/libprocess/3rdparty/boost-1.53.0 -I../3rdparty/libprocess/3rdparty/picojson-4f93734 -I../3rdparty/libprocess/3rdparty/protobuf-2.5.0/src -I../3rdparty/libprocess/3rdparty/glog-0.3.3/src -I../3rdparty/libprocess/3rdparty/glog-0.3.3/src -I../3rdparty/leveldb/include -I../3rdparty/zookeeper-3.4.5/src/c/include -I../3rdparty/zookeeper-3.4.5/src/c/generated -I../3rdparty/libprocess/3rdparty/protobuf-2.5.0/src -DSOURCE_DIR=\"/mesos/mesos-0.24.0/_build/..\" -DBUILD_DIR=\"/mesos/mesos-0.24.0/_build\" -I../3rdparty/libprocess/3rdparty/gmock-1.6.0/gtest/include -I../3rdparty/libprocess/3rdparty/gmock-1.6.0/include -I/usr/lib/jvm/java-7-openjdk-amd64/include -I/usr/lib/jvm/java-7-openjdk-amd64/include/linux -DZOOKEEPER_VERSION=\"3.4.5\" -I/usr/include/subversion-1 -I/usr/include/apr-1 -I/usr/include/apr-1.0  -pthread -g1 -O0 -Wno-unused-local-typedefs -std=c++11 -MT tests/mesos_tests-external_containerizer_test.o -MD -MP -MF tests/.deps/mesos_tests-external_containerizer_test.Tpo -c -o tests/mesos_tests-external_containerizer_test.o `test -f 'tests/external_containerizer_test.cpp' || echo '../../src/'`tests/external_containerizer_test.cpp
mv -f tests/.deps/mesos_tests-credentials_tests.Tpo tests/.deps/mesos_tests-credentials_tests.Po
g++ -DPACKAGE_NAME=\"mesos\" -DPACKAGE_TARNAME=\"mesos\" -DPACKAGE_VERSION=\"0.24.0\" -DPACKAGE_STRING=\"mesos\ 0.24.0\" -DPACKAGE_BUGREPORT=\"\" -DPACKAGE_URL=\"\" -DPACKAGE=\"mesos\" -DVERSION=\"0.24.0\" -DSTDC_HEADERS=1 -DHAVE_SYS_TYPES_H=1 -DHAVE_SYS_STAT_H=1 -DHAVE_STDLIB_H=1 -DHAVE_STRING_H=1 -DHAVE_MEMORY_H=1 -DHAVE_STRINGS_H=1 -DHAVE_INTTYPES_H=1 -DHAVE_STDINT_H=1 -DHAVE_UNISTD_H=1 -DHAVE_DLFCN_H=1 -DLT_OBJDIR=\".libs/\" -DHAVE_PTHREAD_PRIO_INHERIT=1 -DHAVE_PTHREAD=1 -DHAVE_LIBZ=1 -DHAVE_LIBCURL=1 -DHAVE_APR_POOLS_H=1 -DHAVE_LIBAPR_1=1 -DHAVE_SVN_VERSION_H=1 -DHAVE_LIBSVN_SUBR_1=1 -DHAVE_SVN_DELTA_H=1 -DHAVE_LIBSVN_DELTA_1=1 -DHAVE_LIBSASL2=1 -DMESOS_HAS_JAVA=1 -DHAVE_PYTHON=\"2.7\" -DMESOS_HAS_PYTHON=1 -I. -I../../src   -Wall -Werror -DLIBDIR=\"/mesos/mesos-0.24.0/_inst/lib\" -DPKGLIBEXECDIR=\"/mesos/mesos-0.24.0/_inst/libexec/mesos\" -DPKGDATADIR=\"/mesos/mesos-0.24.0/_inst/share/mesos\" -I../../include -I../../3rdparty/libprocess/include -I../../3rdparty/libprocess/3rdparty/stout/include -I../include -I../include/mesos -I../3rdparty/libprocess/3rdparty/boost-1.53.0 -I../3rdparty/libprocess/3rdparty/picojson-4f93734 -I../3rdparty/libprocess/3rdparty/protobuf-2.5.0/src -I../3rdparty/libprocess/3rdparty/glog-0.3.3/src -I../3rdparty/libprocess/3rdparty/glog-0.3.3/src -I../3rdparty/leveldb/include -I../3rdparty/zookeeper-3.4.5/src/c/include -I../3rdparty/zookeeper-3.4.5/src/c/generated -I../3rdparty/libprocess/3rdparty/protobuf-2.5.0/src -DSOURCE_DIR=\"/mesos/mesos-0.24.0/_build/..\" -DBUILD_DIR=\"/mesos/mesos-0.24.0/_build\" -I../3rdparty/libprocess/3rdparty/gmock-1.6.0/gtest/include -I../3rdparty/libprocess/3rdparty/gmock-1.6.0/include -I/usr/lib/jvm/java-7-openjdk-amd64/include -I/usr/lib/jvm/java-7-openjdk-amd64/include/linux -DZOOKEEPER_VERSION=\"3.4.5\" -I/usr/include/subversion-1 -I/usr/include/apr-1 -I/usr/include/apr-1.0  -pthread -g1 -O0 -Wno-unused-local-typedefs -std=c++11 -MT tests/mesos_tests-health_check_tests.o -MD -MP -MF tests/.deps/mesos_tests-health_check_tests.Tpo -c -o tests/mesos_tests-health_check_tests.o `test -f 'tests/health_check_tests.cpp' || echo '../../src/'`tests/health_check_tests.cpp
mv -f tests/.deps/mesos_tests-containerizer_tests.Tpo tests/.deps/mesos_tests-containerizer_tests.Po
g++ -DPACKAGE_NAME=\"mesos\" -DPACKAGE_TARNAME=\"mesos\" -DPACKAGE_VERSION=\"0.24.0\" -DPACKAGE_STRING=\"mesos\ 0.24.0\" -DPACKAGE_BUGREPORT=\"\" -DPACKAGE_URL=\"\" -DPACKAGE=\"mesos\" -DVERSION=\"0.24.0\" -DSTDC_HEADERS=1 -DHAVE_SYS_TYPES_H=1 -DHAVE_SYS_STAT_H=1 -DHAVE_STDLIB_H=1 -DHAVE_STRING_H=1 -DHAVE_MEMORY_H=1 -DHAVE_STRINGS_H=1 -DHAVE_INTTYPES_H=1 -DHAVE_STDINT_H=1 -DHAVE_UNISTD_H=1 -DHAVE_DLFCN_H=1 -DLT_OBJDIR=\".libs/\" -DHAVE_PTHREAD_PRIO_INHERIT=1 -DHAVE_PTHREAD=1 -DHAVE_LIBZ=1 -DHAVE_LIBCURL=1 -DHAVE_APR_POOLS_H=1 -DHAVE_LIBAPR_1=1 -DHAVE_SVN_VERSION_H=1 -DHAVE_LIBSVN_SUBR_1=1 -DHAVE_SVN_DELTA_H=1 -DHAVE_LIBSVN_DELTA_1=1 -DHAVE_LIBSASL2=1 -DMESOS_HAS_JAVA=1 -DHAVE_PYTHON=\"2.7\" -DMESOS_HAS_PYTHON=1 -I. -I../../src   -Wall -Werror -DLIBDIR=\"/mesos/mesos-0.24.0/_inst/lib\" -DPKGLIBEXECDIR=\"/mesos/mesos-0.24.0/_inst/libexec/mesos\" -DPKGDATADIR=\"/mesos/mesos-0.24.0/_inst/share/mesos\" -I../../include -I../../3rdparty/libprocess/include -I../../3rdparty/libprocess/3rdparty/stout/include -I../include -I../include/mesos -I../3rdparty/libprocess/3rdparty/boost-1.53.0 -I../3rdparty/libprocess/3rdparty/picojson-4f93734 -I../3rdparty/libprocess/3rdparty/protobuf-2.5.0/src -I../3rdparty/libprocess/3rdparty/glog-0.3.3/src -I../3rdparty/libprocess/3rdparty/glog-0.3.3/src -I../3rdparty/leveldb/include -I../3rdparty/zookeeper-3.4.5/src/c/include -I../3rdparty/zookeeper-3.4.5/src/c/generated -I../3rdparty/libprocess/3rdparty/protobuf-2.5.0/src -DSOURCE_DIR=\"/mesos/mesos-0.24.0/_build/..\" -DBUILD_DIR=\"/mesos/mesos-0.24.0/_build\" -I../3rdparty/libprocess/3rdparty/gmock-1.6.0/gtest/include -I../3rdparty/libprocess/3rdparty/gmock-1.6.0/include -I/usr/lib/jvm/java-7-openjdk-amd64/include -I/usr/lib/jvm/java-7-openjdk-amd64/include/linux -DZOOKEEPER_VERSION=\"3.4.5\" -I/usr/include/subversion-1 -I/usr/include/apr-1 -I/usr/include/apr-1.0  -pthread -g1 -O0 -Wno-unused-local-typedefs -std=c++11 -MT tests/mesos_tests-fault_tolerance_tests.o -MD -MP -MF tests/.deps/mesos_tests-fault_tolerance_tests.Tpo -c -o tests/mesos_tests-fault_tolerance_tests.o `test -f 'tests/fault_tolerance_tests.cpp' || echo '../../src/'`tests/fault_tolerance_tests.cpp
mv -f tests/.deps/mesos_tests-environment.Tpo tests/.deps/mesos_tests-environment.Po
g++ -DPACKAGE_NAME=\"mesos\" -DPACKAGE_TARNAME=\"mesos\" -DPACKAGE_VERSION=\"0.24.0\" -DPACKAGE_STRING=\"mesos\ 0.24.0\" -DPACKAGE_BUGREPORT=\"\" -DPACKAGE_URL=\"\" -DPACKAGE=\"mesos\" -DVERSION=\"0.24.0\" -DSTDC_HEADERS=1 -DHAVE_SYS_TYPES_H=1 -DHAVE_SYS_STAT_H=1 -DHAVE_STDLIB_H=1 -DHAVE_STRING_H=1 -DHAVE_MEMORY_H=1 -DHAVE_STRINGS_H=1 -DHAVE_INTTYPES_H=1 -DHAVE_STDINT_H=1 -DHAVE_UNISTD_H=1 -DHAVE_DLFCN_H=1 -DLT_OBJDIR=\".libs/\" -DHAVE_PTHREAD_PRIO_INHERIT=1 -DHAVE_PTHREAD=1 -DHAVE_LIBZ=1 -DHAVE_LIBCURL=1 -DHAVE_APR_POOLS_H=1 -DHAVE_LIBAPR_1=1 -DHAVE_SVN_VERSION_H=1 -DHAVE_LIBSVN_SUBR_1=1 -DHAVE_SVN_DELTA_H=1 -DHAVE_LIBSVN_DELTA_1=1 -DHAVE_LIBSASL2=1 -DMESOS_HAS_JAVA=1 -DHAVE_PYTHON=\"2.7\" -DMESOS_HAS_PYTHON=1 -I. -I../../src   -Wall -Werror -DLIBDIR=\"/mesos/mesos-0.24.0/_inst/lib\" -DPKGLIBEXECDIR=\"/mesos/mesos-0.24.0/_inst/libexec/mesos\" -DPKGDATADIR=\"/mesos/mesos-0.24.0/_inst/share/mesos\" -I../../include -I../../3rdparty/libprocess/include -I../../3rdparty/libprocess/3rdparty/stout/include -I../include -I../include/mesos -I../3rdparty/libprocess/3rdparty/boost-1.53.0 -I../3rdparty/libprocess/3rdparty/picojson-4f93734 -I../3rdparty/libprocess/3rdparty/protobuf-2.5.0/src -I../3rdparty/libprocess/3rdparty/glog-0.3.3/src -I../3rdparty/libprocess/3rdparty/glog-0.3.3/src -I../3rdparty/leveldb/include -I../3rdparty/zookeeper-3.4.5/src/c/include -I../3rdparty/zookeeper-3.4.5/src/c/generated -I../3rdparty/libprocess/3rdparty/protobuf-2.5.0/src -DSOURCE_DIR=\"/mesos/mesos-0.24.0/_build/..\" -DBUILD_DIR=\"/mesos/mesos-0.24.0/_build\" -I../3rdparty/libprocess/3rdparty/gmock-1.6.0/gtest/include -I../3rdparty/libprocess/3rdparty/gmock-1.6.0/include -I/usr/lib/jvm/java-7-openjdk-amd64/include -I/usr/lib/jvm/java-7-openjdk-amd64/include/linux -DZOOKEEPER_VERSION=\"3.4.5\" -I/usr/include/subversion-1 -I/usr/include/apr-1 -I/usr/include/apr-1.0  -pthread -g1 -O0 -Wno-unused-local-typedefs -std=c++11 -MT tests/mesos_tests-fetcher_cache_tests.o -MD -MP -MF tests/.deps/mesos_tests-fetcher_cache_tests.Tpo -c -o tests/mesos_tests-fetcher_cache_tests.o `test -f 'tests/fetcher_cache_tests.cpp' || echo '../../src/'`tests/fetcher_cache_tests.cpp
mv -f tests/.deps/mesos_tests-docker_tests.Tpo tests/.deps/mesos_tests-docker_tests.Po
g++ -DPACKAGE_NAME=\"mesos\" -DPACKAGE_TARNAME=\"mesos\" -DPACKAGE_VERSION=\"0.24.0\" -DPACKAGE_STRING=\"mesos\ 0.24.0\" -DPACKAGE_BUGREPORT=\"\" -DPACKAGE_URL=\"\" -DPACKAGE=\"mesos\" -DVERSION=\"0.24.0\" -DSTDC_HEADERS=1 -DHAVE_SYS_TYPES_H=1 -DHAVE_SYS_STAT_H=1 -DHAVE_STDLIB_H=1 -DHAVE_STRING_H=1 -DHAVE_MEMORY_H=1 -DHAVE_STRINGS_H=1 -DHAVE_INTTYPES_H=1 -DHAVE_STDINT_H=1 -DHAVE_UNISTD_H=1 -DHAVE_DLFCN_H=1 -DLT_OBJDIR=\".libs/\" -DHAVE_PTHREAD_PRIO_INHERIT=1 -DHAVE_PTHREAD=1 -DHAVE_LIBZ=1 -DHAVE_LIBCURL=1 -DHAVE_APR_POOLS_H=1 -DHAVE_LIBAPR_1=1 -DHAVE_SVN_VERSION_H=1 -DHAVE_LIBSVN_SUBR_1=1 -DHAVE_SVN_DELTA_H=1 -DHAVE_LIBSVN_DELTA_1=1 -DHAVE_LIBSASL2=1 -DMESOS_HAS_JAVA=1 -DHAVE_PYTHON=\"2.7\" -DMESOS_HAS_PYTHON=1 -I. -I../../src   -Wall -Werror -DLIBDIR=\"/mesos/mesos-0.24.0/_inst/lib\" -DPKGLIBEXECDIR=\"/mesos/mesos-0.24.0/_inst/libexec/mesos\" -DPKGDATADIR=\"/mesos/mesos-0.24.0/_inst/share/mesos\" -I../../include -I../../3rdparty/libprocess/include -I../../3rdparty/libprocess/3rdparty/stout/include -I../include -I../include/mesos -I../3rdparty/libprocess/3rdparty/boost-1.53.0 -I../3rdparty/libprocess/3rdparty/picojson-4f93734 -I../3rdparty/libprocess/3rdparty/protobuf-2.5.0/src -I../3rdparty/libprocess/3rdparty/glog-0.3.3/src -I../3rdparty/libprocess/3rdparty/glog-0.3.3/src -I../3rdparty/leveldb/include -I../3rdparty/zookeeper-3.4.5/src/c/include -I../3rdparty/zookeeper-3.4.5/src/c/generated -I../3rdparty/libprocess/3rdparty/protobuf-2.5.0/src -DSOURCE_DIR=\"/mesos/mesos-0.24.0/_build/..\" -DBUILD_DIR=\"/mesos/mesos-0.24.0/_build\" -I../3rdparty/libprocess/3rdparty/gmock-1.6.0/gtest/include -I../3rdparty/libprocess/3rdparty/gmock-1.6.0/include -I/usr/lib/jvm/java-7-openjdk-amd64/include -I/usr/lib/jvm/java-7-openjdk-amd64/include/linux -DZOOKEEPER_VERSION=\"3.4.5\" -I/usr/include/subversion-1 -I/usr/include/apr-1 -I/usr/include/apr-1.0  -pthread -g1 -O0 -Wno-unused-local-typedefs -std=c++11 -MT tests/mesos_tests-fetcher_tests.o -MD -MP -MF tests/.deps/mesos_tests-fetcher_tests.Tpo -c -o tests/mesos_tests-fetcher_tests.o `test -f 'tests/fetcher_tests.cpp' || echo '../../src/'`tests/fetcher_tests.cpp
mv -f tests/.deps/mesos_tests-disk_quota_tests.Tpo tests/.deps/mesos_tests-disk_quota_tests.Po
g++ -DPACKAGE_NAME=\"mesos\" -DPACKAGE_TARNAME=\"mesos\" -DPACKAGE_VERSION=\"0.24.0\" -DPACKAGE_STRING=\"mesos\ 0.24.0\" -DPACKAGE_BUGREPORT=\"\" -DPACKAGE_URL=\"\" -DPACKAGE=\"mesos\" -DVERSION=\"0.24.0\" -DSTDC_HEADERS=1 -DHAVE_SYS_TYPES_H=1 -DHAVE_SYS_STAT_H=1 -DHAVE_STDLIB_H=1 -DHAVE_STRING_H=1 -DHAVE_MEMORY_H=1 -DHAVE_STRINGS_H=1 -DHAVE_INTTYPES_H=1 -DHAVE_STDINT_H=1 -DHAVE_UNISTD_H=1 -DHAVE_DLFCN_H=1 -DLT_OBJDIR=\".libs/\" -DHAVE_PTHREAD_PRIO_INHERIT=1 -DHAVE_PTHREAD=1 -DHAVE_LIBZ=1 -DHAVE_LIBCURL=1 -DHAVE_APR_POOLS_H=1 -DHAVE_LIBAPR_1=1 -DHAVE_SVN_VERSION_H=1 -DHAVE_LIBSVN_SUBR_1=1 -DHAVE_SVN_DELTA_H=1 -DHAVE_LIBSVN_DELTA_1=1 -DHAVE_LIBSASL2=1 -DMESOS_HAS_JAVA=1 -DHAVE_PYTHON=\"2.7\" -DMESOS_HAS_PYTHON=1 -I. -I../../src   -Wall -Werror -DLIBDIR=\"/mesos/mesos-0.24.0/_inst/lib\" -DPKGLIBEXECDIR=\"/mesos/mesos-0.24.0/_inst/libexec/mesos\" -DPKGDATADIR=\"/mesos/mesos-0.24.0/_inst/share/mesos\" -I../../include -I../../3rdparty/libprocess/include -I../../3rdparty/libprocess/3rdparty/stout/include -I../include -I../include/mesos -I../3rdparty/libprocess/3rdparty/boost-1.53.0 -I../3rdparty/libprocess/3rdparty/picojson-4f93734 -I../3rdparty/libprocess/3rdparty/protobuf-2.5.0/src -I../3rdparty/libprocess/3rdparty/glog-0.3.3/src -I../3rdparty/libprocess/3rdparty/glog-0.3.3/src -I../3rdparty/leveldb/include -I../3rdparty/zookeeper-3.4.5/src/c/include -I../3rdparty/zookeeper-3.4.5/src/c/generated -I../3rdparty/libprocess/3rdparty/protobuf-2.5.0/src -DSOURCE_DIR=\"/mesos/mesos-0.24.0/_build/..\" -DBUILD_DIR=\"/mesos/mesos-0.24.0/_build\" -I../3rdparty/libprocess/3rdparty/gmock-1.6.0/gtest/include -I../3rdparty/libprocess/3rdparty/gmock-1.6.0/include -I/usr/lib/jvm/java-7-openjdk-amd64/include -I/usr/lib/jvm/java-7-openjdk-amd64/include/linux -DZOOKEEPER_VERSION=\"3.4.5\" -I/usr/include/subversion-1 -I/usr/include/apr-1 -I/usr/include/apr-1.0  -pthread -g1 -O0 -Wno-unused-local-typedefs -std=c++11 -MT tests/mesos_tests-files_tests.o -MD -MP -MF tests/.deps/mesos_tests-files_tests.Tpo -c -o tests/mesos_tests-files_tests.o `test -f 'tests/files_tests.cpp' || echo '../../src/'`tests/files_tests.cpp
mv -f tests/.deps/mesos_tests-files_tests.Tpo tests/.deps/mesos_tests-files_tests.Po
g++ -DPACKAGE_NAME=\"mesos\" -DPACKAGE_TARNAME=\"mesos\" -DPACKAGE_VERSION=\"0.24.0\" -DPACKAGE_STRING=\"mesos\ 0.24.0\" -DPACKAGE_BUGREPORT=\"\" -DPACKAGE_URL=\"\" -DPACKAGE=\"mesos\" -DVERSION=\"0.24.0\" -DSTDC_HEADERS=1 -DHAVE_SYS_TYPES_H=1 -DHAVE_SYS_STAT_H=1 -DHAVE_STDLIB_H=1 -DHAVE_STRING_H=1 -DHAVE_MEMORY_H=1 -DHAVE_STRINGS_H=1 -DHAVE_INTTYPES_H=1 -DHAVE_STDINT_H=1 -DHAVE_UNISTD_H=1 -DHAVE_DLFCN_H=1 -DLT_OBJDIR=\".libs/\" -DHAVE_PTHREAD_PRIO_INHERIT=1 -DHAVE_PTHREAD=1 -DHAVE_LIBZ=1 -DHAVE_LIBCURL=1 -DHAVE_APR_POOLS_H=1 -DHAVE_LIBAPR_1=1 -DHAVE_SVN_VERSION_H=1 -DHAVE_LIBSVN_SUBR_1=1 -DHAVE_SVN_DELTA_H=1 -DHAVE_LIBSVN_DELTA_1=1 -DHAVE_LIBSASL2=1 -DMESOS_HAS_JAVA=1 -DHAVE_PYTHON=\"2.7\" -DMESOS_HAS_PYTHON=1 -I. -I../../src   -Wall -Werror -DLIBDIR=\"/mesos/mesos-0.24.0/_inst/lib\" -DPKGLIBEXECDIR=\"/mesos/mesos-0.24.0/_inst/libexec/mesos\" -DPKGDATADIR=\"/mesos/mesos-0.24.0/_inst/share/mesos\" -I../../include -I../../3rdparty/libprocess/include -I../../3rdparty/libprocess/3rdparty/stout/include -I../include -I../include/mesos -I../3rdparty/libprocess/3rdparty/boost-1.53.0 -I../3rdparty/libprocess/3rdparty/picojson-4f93734 -I../3rdparty/libprocess/3rdparty/protobuf-2.5.0/src -I../3rdparty/libprocess/3rdparty/glog-0.3.3/src -I../3rdparty/libprocess/3rdparty/glog-0.3.3/src -I../3rdparty/leveldb/include -I../3rdparty/zookeeper-3.4.5/src/c/include -I../3rdparty/zookeeper-3.4.5/src/c/generated -I../3rdparty/libprocess/3rdparty/protobuf-2.5.0/src -DSOURCE_DIR=\"/mesos/mesos-0.24.0/_build/..\" -DBUILD_DIR=\"/mesos/mesos-0.24.0/_build\" -I../3rdparty/libprocess/3rdparty/gmock-1.6.0/gtest/include -I../3rdparty/libprocess/3rdparty/gmock-1.6.0/include -I/usr/lib/jvm/java-7-openjdk-amd64/include -I/usr/lib/jvm/java-7-openjdk-amd64/include/linux -DZOOKEEPER_VERSION=\"3.4.5\" -I/usr/include/subversion-1 -I/usr/include/apr-1 -I/usr/include/apr-1.0  -pthread -g1 -O0 -Wno-unused-local-typedefs -std=c++11 -MT tests/mesos_tests-flags.o -MD -MP -MF tests/.deps/mesos_tests-flags.Tpo -c -o tests/mesos_tests-flags.o `test -f 'tests/flags.cpp' || echo '../../src/'`tests/flags.cpp
mv -f tests/.deps/mesos_tests-flags.Tpo tests/.deps/mesos_tests-flags.Po
g++ -DPACKAGE_NAME=\"mesos\" -DPACKAGE_TARNAME=\"mesos\" -DPACKAGE_VERSION=\"0.24.0\" -DPACKAGE_STRING=\"mesos\ 0.24.0\" -DPACKAGE_BUGREPORT=\"\" -DPACKAGE_URL=\"\" -DPACKAGE=\"mesos\" -DVERSION=\"0.24.0\" -DSTDC_HEADERS=1 -DHAVE_SYS_TYPES_H=1 -DHAVE_SYS_STAT_H=1 -DHAVE_STDLIB_H=1 -DHAVE_STRING_H=1 -DHAVE_MEMORY_H=1 -DHAVE_STRINGS_H=1 -DHAVE_INTTYPES_H=1 -DHAVE_STDINT_H=1 -DHAVE_UNISTD_H=1 -DHAVE_DLFCN_H=1 -DLT_OBJDIR=\".libs/\" -DHAVE_PTHREAD_PRIO_INHERIT=1 -DHAVE_PTHREAD=1 -DHAVE_LIBZ=1 -DHAVE_LIBCURL=1 -DHAVE_APR_POOLS_H=1 -DHAVE_LIBAPR_1=1 -DHAVE_SVN_VERSION_H=1 -DHAVE_LIBSVN_SUBR_1=1 -DHAVE_SVN_DELTA_H=1 -DHAVE_LIBSVN_DELTA_1=1 -DHAVE_LIBSASL2=1 -DMESOS_HAS_JAVA=1 -DHAVE_PYTHON=\"2.7\" -DMESOS_HAS_PYTHON=1 -I. -I../../src   -Wall -Werror -DLIBDIR=\"/mesos/mesos-0.24.0/_inst/lib\" -DPKGLIBEXECDIR=\"/mesos/mesos-0.24.0/_inst/libexec/mesos\" -DPKGDATADIR=\"/mesos/mesos-0.24.0/_inst/share/mesos\" -I../../include -I../../3rdparty/libprocess/include -I../../3rdparty/libprocess/3rdparty/stout/include -I../include -I../include/mesos -I../3rdparty/libprocess/3rdparty/boost-1.53.0 -I../3rdparty/libprocess/3rdparty/picojson-4f93734 -I../3rdparty/libprocess/3rdparty/protobuf-2.5.0/src -I../3rdparty/libprocess/3rdparty/glog-0.3.3/src -I../3rdparty/libprocess/3rdparty/glog-0.3.3/src -I../3rdparty/leveldb/include -I../3rdparty/zookeeper-3.4.5/src/c/include -I../3rdparty/zookeeper-3.4.5/src/c/generated -I../3rdparty/libprocess/3rdparty/protobuf-2.5.0/src -DSOURCE_DIR=\"/mesos/mesos-0.24.0/_build/..\" -DBUILD_DIR=\"/mesos/mesos-0.24.0/_build\" -I../3rdparty/libprocess/3rdparty/gmock-1.6.0/gtest/include -I../3rdparty/libprocess/3rdparty/gmock-1.6.0/include -I/usr/lib/jvm/java-7-openjdk-amd64/include -I/usr/lib/jvm/java-7-openjdk-amd64/include/linux -DZOOKEEPER_VERSION=\"3.4.5\" -I/usr/include/subversion-1 -I/usr/include/apr-1 -I/usr/include/apr-1.0  -pthread -g1 -O0 -Wno-unused-local-typedefs -std=c++11 -MT tests/mesos_tests-gc_tests.o -MD -MP -MF tests/.deps/mesos_tests-gc_tests.Tpo -c -o tests/mesos_tests-gc_tests.o `test -f 'tests/gc_tests.cpp' || echo '../../src/'`tests/gc_tests.cpp
mv -f tests/.deps/mesos_tests-fetcher_tests.Tpo tests/.deps/mesos_tests-fetcher_tests.Po
g++ -DPACKAGE_NAME=\"mesos\" -DPACKAGE_TARNAME=\"mesos\" -DPACKAGE_VERSION=\"0.24.0\" -DPACKAGE_STRING=\"mesos\ 0.24.0\" -DPACKAGE_BUGREPORT=\"\" -DPACKAGE_URL=\"\" -DPACKAGE=\"mesos\" -DVERSION=\"0.24.0\" -DSTDC_HEADERS=1 -DHAVE_SYS_TYPES_H=1 -DHAVE_SYS_STAT_H=1 -DHAVE_STDLIB_H=1 -DHAVE_STRING_H=1 -DHAVE_MEMORY_H=1 -DHAVE_STRINGS_H=1 -DHAVE_INTTYPES_H=1 -DHAVE_STDINT_H=1 -DHAVE_UNISTD_H=1 -DHAVE_DLFCN_H=1 -DLT_OBJDIR=\".libs/\" -DHAVE_PTHREAD_PRIO_INHERIT=1 -DHAVE_PTHREAD=1 -DHAVE_LIBZ=1 -DHAVE_LIBCURL=1 -DHAVE_APR_POOLS_H=1 -DHAVE_LIBAPR_1=1 -DHAVE_SVN_VERSION_H=1 -DHAVE_LIBSVN_SUBR_1=1 -DHAVE_SVN_DELTA_H=1 -DHAVE_LIBSVN_DELTA_1=1 -DHAVE_LIBSASL2=1 -DMESOS_HAS_JAVA=1 -DHAVE_PYTHON=\"2.7\" -DMESOS_HAS_PYTHON=1 -I. -I../../src   -Wall -Werror -DLIBDIR=\"/mesos/mesos-0.24.0/_inst/lib\" -DPKGLIBEXECDIR=\"/mesos/mesos-0.24.0/_inst/libexec/mesos\" -DPKGDATADIR=\"/mesos/mesos-0.24.0/_inst/share/mesos\" -I../../include -I../../3rdparty/libprocess/include -I../../3rdparty/libprocess/3rdparty/stout/include -I../include -I../include/mesos -I../3rdparty/libprocess/3rdparty/boost-1.53.0 -I../3rdparty/libprocess/3rdparty/picojson-4f93734 -I../3rdparty/libprocess/3rdparty/protobuf-2.5.0/src -I../3rdparty/libprocess/3rdparty/glog-0.3.3/src -I../3rdparty/libprocess/3rdparty/glog-0.3.3/src -I../3rdparty/leveldb/include -I../3rdparty/zookeeper-3.4.5/src/c/include -I../3rdparty/zookeeper-3.4.5/src/c/generated -I../3rdparty/libprocess/3rdparty/protobuf-2.5.0/src -DSOURCE_DIR=\"/mesos/mesos-0.24.0/_build/..\" -DBUILD_DIR=\"/mesos/mesos-0.24.0/_build\" -I../3rdparty/libprocess/3rdparty/gmock-1.6.0/gtest/include -I../3rdparty/libprocess/3rdparty/gmock-1.6.0/include -I/usr/lib/jvm/java-7-openjdk-amd64/include -I/usr/lib/jvm/java-7-openjdk-amd64/include/linux -DZOOKEEPER_VERSION=\"3.4.5\" -I/usr/include/subversion-1 -I/usr/include/apr-1 -I/usr/include/apr-1.0  -pthread -g1 -O0 -Wno-unused-local-typedefs -std=c++11 -MT tests/mesos_tests-hierarchical_allocator_tests.o -MD -MP -MF tests/.deps/mesos_tests-hierarchical_allocator_tests.Tpo -c -o tests/mesos_tests-hierarchical_allocator_tests.o `test -f 'tests/hierarchical_allocator_tests.cpp' || echo '../../src/'`tests/hierarchical_allocator_tests.cpp
mv -f tests/.deps/mesos_tests-exception_tests.Tpo tests/.deps/mesos_tests-exception_tests.Po
g++ -DPACKAGE_NAME=\"mesos\" -DPACKAGE_TARNAME=\"mesos\" -DPACKAGE_VERSION=\"0.24.0\" -DPACKAGE_STRING=\"mesos\ 0.24.0\" -DPACKAGE_BUGREPORT=\"\" -DPACKAGE_URL=\"\" -DPACKAGE=\"mesos\" -DVERSION=\"0.24.0\" -DSTDC_HEADERS=1 -DHAVE_SYS_TYPES_H=1 -DHAVE_SYS_STAT_H=1 -DHAVE_STDLIB_H=1 -DHAVE_STRING_H=1 -DHAVE_MEMORY_H=1 -DHAVE_STRINGS_H=1 -DHAVE_INTTYPES_H=1 -DHAVE_STDINT_H=1 -DHAVE_UNISTD_H=1 -DHAVE_DLFCN_H=1 -DLT_OBJDIR=\".libs/\" -DHAVE_PTHREAD_PRIO_INHERIT=1 -DHAVE_PTHREAD=1 -DHAVE_LIBZ=1 -DHAVE_LIBCURL=1 -DHAVE_APR_POOLS_H=1 -DHAVE_LIBAPR_1=1 -DHAVE_SVN_VERSION_H=1 -DHAVE_LIBSVN_SUBR_1=1 -DHAVE_SVN_DELTA_H=1 -DHAVE_LIBSVN_DELTA_1=1 -DHAVE_LIBSASL2=1 -DMESOS_HAS_JAVA=1 -DHAVE_PYTHON=\"2.7\" -DMESOS_HAS_PYTHON=1 -I. -I../../src   -Wall -Werror -DLIBDIR=\"/mesos/mesos-0.24.0/_inst/lib\" -DPKGLIBEXECDIR=\"/mesos/mesos-0.24.0/_inst/libexec/mesos\" -DPKGDATADIR=\"/mesos/mesos-0.24.0/_inst/share/mesos\" -I../../include -I../../3rdparty/libprocess/include -I../../3rdparty/libprocess/3rdparty/stout/include -I../include -I../include/mesos -I../3rdparty/libprocess/3rdparty/boost-1.53.0 -I../3rdparty/libprocess/3rdparty/picojson-4f93734 -I../3rdparty/libprocess/3rdparty/protobuf-2.5.0/src -I../3rdparty/libprocess/3rdparty/glog-0.3.3/src -I../3rdparty/libprocess/3rdparty/glog-0.3.3/src -I../3rdparty/leveldb/include -I../3rdparty/zookeeper-3.4.5/src/c/include -I../3rdparty/zookeeper-3.4.5/src/c/generated -I../3rdparty/libprocess/3rdparty/protobuf-2.5.0/src -DSOURCE_DIR=\"/mesos/mesos-0.24.0/_build/..\" -DBUILD_DIR=\"/mesos/mesos-0.24.0/_build\" -I../3rdparty/libprocess/3rdparty/gmock-1.6.0/gtest/include -I../3rdparty/libprocess/3rdparty/gmock-1.6.0/include -I/usr/lib/jvm/java-7-openjdk-amd64/include -I/usr/lib/jvm/java-7-openjdk-amd64/include/linux -DZOOKEEPER_VERSION=\"3.4.5\" -I/usr/include/subversion-1 -I/usr/include/apr-1 -I/usr/include/apr-1.0  -pthread -g1 -O0 -Wno-unused-local-typedefs -std=c++11 -MT tests/mesos_tests-hook_tests.o -MD -MP -MF tests/.deps/mesos_tests-hook_tests.Tpo -c -o tests/mesos_tests-hook_tests.o `test -f 'tests/hook_tests.cpp' || echo '../../src/'`tests/hook_tests.cpp
mv -f tests/.deps/mesos_tests-health_check_tests.Tpo tests/.deps/mesos_tests-health_check_tests.Po
g++ -DPACKAGE_NAME=\"mesos\" -DPACKAGE_TARNAME=\"mesos\" -DPACKAGE_VERSION=\"0.24.0\" -DPACKAGE_STRING=\"mesos\ 0.24.0\" -DPACKAGE_BUGREPORT=\"\" -DPACKAGE_URL=\"\" -DPACKAGE=\"mesos\" -DVERSION=\"0.24.0\" -DSTDC_HEADERS=1 -DHAVE_SYS_TYPES_H=1 -DHAVE_SYS_STAT_H=1 -DHAVE_STDLIB_H=1 -DHAVE_STRING_H=1 -DHAVE_MEMORY_H=1 -DHAVE_STRINGS_H=1 -DHAVE_INTTYPES_H=1 -DHAVE_STDINT_H=1 -DHAVE_UNISTD_H=1 -DHAVE_DLFCN_H=1 -DLT_OBJDIR=\".libs/\" -DHAVE_PTHREAD_PRIO_INHERIT=1 -DHAVE_PTHREAD=1 -DHAVE_LIBZ=1 -DHAVE_LIBCURL=1 -DHAVE_APR_POOLS_H=1 -DHAVE_LIBAPR_1=1 -DHAVE_SVN_VERSION_H=1 -DHAVE_LIBSVN_SUBR_1=1 -DHAVE_SVN_DELTA_H=1 -DHAVE_LIBSVN_DELTA_1=1 -DHAVE_LIBSASL2=1 -DMESOS_HAS_JAVA=1 -DHAVE_PYTHON=\"2.7\" -DMESOS_HAS_PYTHON=1 -I. -I../../src   -Wall -Werror -DLIBDIR=\"/mesos/mesos-0.24.0/_inst/lib\" -DPKGLIBEXECDIR=\"/mesos/mesos-0.24.0/_inst/libexec/mesos\" -DPKGDATADIR=\"/mesos/mesos-0.24.0/_inst/share/mesos\" -I../../include -I../../3rdparty/libprocess/include -I../../3rdparty/libprocess/3rdparty/stout/include -I../include -I../include/mesos -I../3rdparty/libprocess/3rdparty/boost-1.53.0 -I../3rdparty/libprocess/3rdparty/picojson-4f93734 -I../3rdparty/libprocess/3rdparty/protobuf-2.5.0/src -I../3rdparty/libprocess/3rdparty/glog-0.3.3/src -I../3rdparty/libprocess/3rdparty/glog-0.3.3/src -I../3rdparty/leveldb/include -I../3rdparty/zookeeper-3.4.5/src/c/include -I../3rdparty/zookeeper-3.4.5/src/c/generated -I../3rdparty/libprocess/3rdparty/protobuf-2.5.0/src -DSOURCE_DIR=\"/mesos/mesos-0.24.0/_build/..\" -DBUILD_DIR=\"/mesos/mesos-0.24.0/_build\" -I../3rdparty/libprocess/3rdparty/gmock-1.6.0/gtest/include -I../3rdparty/libprocess/3rdparty/gmock-1.6.0/include -I/usr/lib/jvm/java-7-openjdk-amd64/include -I/usr/lib/jvm/java-7-openjdk-amd64/include/linux -DZOOKEEPER_VERSION=\"3.4.5\" -I/usr/include/subversion-1 -I/usr/include/apr-1 -I/usr/include/apr-1.0  -pthread -g1 -O0 -Wno-unused-local-typedefs -std=c++11 -MT tests/mesos_tests-http_api_tests.o -MD -MP -MF tests/.deps/mesos_tests-http_api_tests.Tpo -c -o tests/mesos_tests-http_api_tests.o `test -f 'tests/http_api_tests.cpp' || echo '../../src/'`tests/http_api_tests.cpp
cc1plus: all warnings being treated as errors
Makefile:5337: recipe for target 'tests/mesos_tests-docker_containerizer_tests.o' failed
make[4]: *** [tests/mesos_tests-docker_containerizer_tests.o] Error 1
make[4]: *** Waiting for unfinished jobs....
mv -f tests/.deps/mesos_tests-external_containerizer_test.Tpo tests/.deps/mesos_tests-external_containerizer_test.Po
mv -f tests/.deps/mesos_tests-fetcher_cache_tests.Tpo tests/.deps/mesos_tests-fetcher_cache_tests.Po
mv -f tests/.deps/mesos_tests-http_api_tests.Tpo tests/.deps/mesos_tests-http_api_tests.Po
mv -f tests/.deps/mesos_tests-gc_tests.Tpo tests/.deps/mesos_tests-gc_tests.Po
mv -f tests/.deps/mesos_tests-fault_tolerance_tests.Tpo tests/.deps/mesos_tests-fault_tolerance_tests.Po
mv -f tests/.deps/mesos_tests-hook_tests.Tpo tests/.deps/mesos_tests-hook_tests.Po
mv -f tests/.deps/mesos_tests-hierarchical_allocator_tests.Tpo tests/.deps/mesos_tests-hierarchical_allocator_tests.Po
make[4]: Leaving directory '/mesos/mesos-0.24.0/_build/src'
Makefile:7009: recipe for target 'check-am' failed
make[3]: *** [check-am] Error 2
make[3]: Leaving directory '/mesos/mesos-0.24.0/_build/src'
Makefile:7013: recipe for target 'check' failed
make[2]: *** [check] Error 2
make[2]: Leaving directory '/mesos/mesos-0.24.0/_build/src'
Makefile:667: recipe for target 'check-recursive' failed
make[1]: Leaving directory '/mesos/mesos-0.24.0/_build'
make[1]: *** [check-recursive] Error 1
Makefile:873: recipe for target 'distcheck' failed
make: *** [distcheck] Error 1
+ docker rmi mesos-1436922092-8596
Untagged: mesos-1436922092-8596:latest
Deleted: 70c178872abd73cb66b32aea738d40650609e8776f5b154f826ce2c9172cc8ed
Deleted: a9cc5acca43b26a91e08e01b6c3c24735cb16881771a5bd9909de102446334bb
Deleted: c0354e5b75ffffd5666500017926441c1bca5bd67da93586bf280f9a29c1c583
Deleted: 0a565e404efb12798145495a97a42f993bdacb82e6c5c0ae2516eae334e0abd4
Build step 'Execute shell' marked build as failure

Mime
View raw message