mesos-builds mailing list archives

Site index · List index
Message view « Date » · « Thread »
Top « Date » · « Thread »
From Apache Jenkins Server <jenk...@builds.apache.org>
Subject Build failed in Jenkins: Mesos » clang,docker||Hadoop,ubuntu:14.10 #285
Date Mon, 01 Jun 2015 23:18:51 GMT
See <https://builds.apache.org/job/Mesos/COMPILER=clang,LABEL=docker%7C%7CHadoop,OS=ubuntu%3A14.10/285/changes>

Changes:

[benjamin.hindman] Refactored common functionality into FlagsBase.

[benjamin.hindman] Refactoring to use FlagsBase common functionality.

------------------------------------------
[...truncated 35454 lines...]
I0601 23:18:33.443423 23646 whitelist_watcher.cpp:79] No whitelist given
I0601 23:18:33.443640 23654 recover.cpp:566] Updating replica status to VOTING
I0601 23:18:33.444238 23651 leveldb.cpp:306] Persisting metadata (8 bytes) to leveldb took
424653ns
I0601 23:18:33.444270 23651 replica.cpp:323] Persisted replica status to VOTING
I0601 23:18:33.444408 23647 recover.cpp:580] Successfully joined the Paxos group
I0601 23:18:33.444766 23647 recover.cpp:464] Recover process terminated
I0601 23:18:33.444818 23660 master.cpp:1474] The newly elected leader is master@172.17.0.229:33639
with id 20150601-231833-3841986988-33639-23628
I0601 23:18:33.444854 23660 master.cpp:1487] Elected as the leading master!
I0601 23:18:33.444866 23660 master.cpp:1257] Recovering from registrar
I0601 23:18:33.444999 23647 registrar.cpp:313] Recovering registrar
I0601 23:18:33.445840 23651 log.cpp:661] Attempting to start the writer
I0601 23:18:33.447228 23654 replica.cpp:477] Replica received implicit promise request with
proposal 1
I0601 23:18:33.447688 23654 leveldb.cpp:306] Persisting metadata (8 bytes) to leveldb took
443892ns
I0601 23:18:33.447721 23654 replica.cpp:345] Persisted promised to 1
I0601 23:18:33.448483 23654 coordinator.cpp:230] Coordinator attemping to fill missing position
I0601 23:18:33.449774 23656 replica.cpp:378] Replica received explicit promise request for
position 0 with proposal 2
I0601 23:18:33.450120 23656 leveldb.cpp:343] Persisting action (8 bytes) to leveldb took 318094ns
I0601 23:18:33.450150 23656 replica.cpp:679] Persisted action at 0
I0601 23:18:33.451249 23656 replica.cpp:511] Replica received write request for position 0
I0601 23:18:33.451315 23656 leveldb.cpp:438] Reading position from leveldb took 46431ns
I0601 23:18:33.451761 23656 leveldb.cpp:343] Persisting action (14 bytes) to leveldb took
413554ns
I0601 23:18:33.451792 23656 replica.cpp:679] Persisted action at 0
I0601 23:18:33.452528 23661 replica.cpp:658] Replica received learned notice for position
0
I0601 23:18:33.452975 23661 leveldb.cpp:343] Persisting action (16 bytes) to leveldb took
431581ns
I0601 23:18:33.453006 23661 replica.cpp:679] Persisted action at 0
I0601 23:18:33.453027 23661 replica.cpp:664] Replica learned NOP action at position 0
I0601 23:18:33.453658 23652 log.cpp:677] Writer started with ending position 0
I0601 23:18:33.454710 23646 leveldb.cpp:438] Reading position from leveldb took 51153ns
I0601 23:18:33.457772 23657 registrar.cpp:346] Successfully fetched the registry (0B) in 12.698368ms
I0601 23:18:33.457885 23657 registrar.cpp:445] Applied 1 operations in 39526ns; attempting
to update the 'registry'
I0601 23:18:33.460654 23659 log.cpp:685] Attempting to append 131 bytes to the log
I0601 23:18:33.460798 23648 coordinator.cpp:340] Coordinator attempting to write APPEND action
at position 1
I0601 23:18:33.461787 23652 replica.cpp:511] Replica received write request for position 1
I0601 23:18:33.462450 23652 leveldb.cpp:343] Persisting action (150 bytes) to leveldb took
635971ns
I0601 23:18:33.462481 23652 replica.cpp:679] Persisted action at 1
I0601 23:18:33.463102 23649 replica.cpp:658] Replica received learned notice for position
1
I0601 23:18:33.463740 23649 leveldb.cpp:343] Persisting action (152 bytes) to leveldb took
558997ns
I0601 23:18:33.463765 23649 replica.cpp:679] Persisted action at 1
I0601 23:18:33.463783 23649 replica.cpp:664] Replica learned APPEND action at position 1
I0601 23:18:33.464645 23652 registrar.cpp:490] Successfully updated the 'registry' in 6.69312ms
I0601 23:18:33.464809 23652 registrar.cpp:376] Successfully recovered registrar
I0601 23:18:33.464881 23647 log.cpp:704] Attempting to truncate the log to 1
I0601 23:18:33.465112 23656 coordinator.cpp:340] Coordinator attempting to write TRUNCATE
action at position 2
I0601 23:18:33.465143 23660 master.cpp:1284] Recovered 0 slaves from the Registry (95B) ;
allowing 10mins for slaves to re-register
I0601 23:18:33.465996 23652 replica.cpp:511] Replica received write request for position 2
I0601 23:18:33.466536 23652 leveldb.cpp:343] Persisting action (16 bytes) to leveldb took
518173ns
I0601 23:18:33.466567 23652 replica.cpp:679] Persisted action at 2
I0601 23:18:33.467200 23651 replica.cpp:658] Replica received learned notice for position
2
I0601 23:18:33.467731 23651 leveldb.cpp:343] Persisting action (18 bytes) to leveldb took
512800ns
I0601 23:18:33.467803 23651 leveldb.cpp:401] Deleting ~1 keys from leveldb took 51978ns
I0601 23:18:33.467824 23651 replica.cpp:679] Persisted action at 2
I0601 23:18:33.467846 23651 replica.cpp:664] Replica learned TRUNCATE action at position 2
I0601 23:18:33.478749 23628 containerizer.cpp:111] Using isolation: posix/cpu,posix/mem
I0601 23:18:33.484251 23658 slave.cpp:185] Slave started on 40)@172.17.0.229:33639
I0601 23:18:33.484297 23658 slave.cpp:186] Flags at startup: --authenticatee="crammd5" --cgroups_cpu_enable_pids_and_tids_count="false"
--cgroups_enable_cfs="false" --cgroups_hierarchy="/sys/fs/cgroup" --cgroups_limit_swap="false"
--cgroups_root="mesos" --container_disk_watch_interval="15secs" --containerizers="mesos" --credential="/tmp/FetcherCacheTest_CachedFallback_6uSUGY/credential"
--default_role="*" --disk_watch_interval="1mins" --docker="docker" --docker_kill_orphans="true"
--docker_remove_delay="6hrs" --docker_sandbox_directory="/mnt/mesos/sandbox" --docker_socket="/var/run/docker.sock"
--docker_stop_timeout="0ns" --enforce_container_disk_quota="false" --executor_registration_timeout="1mins"
--executor_shutdown_grace_period="5secs" --fetcher_cache_dir="/tmp/FetcherCacheTest_CachedFallback_6uSUGY/fetch"
--fetcher_cache_size="2GB" --frameworks_home="" --gc_delay="1weeks" --gc_disk_headroom="0.1"
--hadoop_home="" --help="false" --initialize_driver_logging="true" --isolation="posix/cpu,posix/mem"
--launcher_dir="/mesos/mesos-0.23.0/_build/src" --logbufsecs="0" --logging_level="INFO" --oversubscribed_resources_interval="15secs"
--perf_duration="10secs" --perf_interval="1mins" --quiet="false" --recover="reconnect" --recovery_timeout="15mins"
--registration_backoff_factor="10ms" --resource_monitoring_interval="1secs" --resources="cpus(*):1000;
mem(*):1000" --revocable_cpu_low_priority="true" --strict="true" --switch_user="true" --version="false"
--work_dir="/tmp/FetcherCacheTest_CachedFallback_6uSUGY"
I0601 23:18:33.484762 23658 credentials.hpp:85] Loading credential for authentication from
'/tmp/FetcherCacheTest_CachedFallback_6uSUGY/credential'
I0601 23:18:33.484982 23658 slave.cpp:316] Slave using credential for: test-principal
I0601 23:18:33.485399 23658 slave.cpp:341] Slave resources: cpus(*):1000; mem(*):1000; disk(*):3.70122e+06;
ports(*):[31000-32000]
I0601 23:18:33.485610 23658 slave.cpp:371] Slave hostname: 8499babc420b
I0601 23:18:33.485625 23658 slave.cpp:376] Slave checkpoint: true
I0601 23:18:33.486348 23648 state.cpp:35] Recovering state from '/tmp/FetcherCacheTest_CachedFallback_6uSUGY/meta'
I0601 23:18:33.486737 23655 status_update_manager.cpp:197] Recovering status update manager
I0601 23:18:33.486928 23648 containerizer.cpp:312] Recovering containerizer
I0601 23:18:33.487792 23660 slave.cpp:3939] Finished recovery
I0601 23:18:33.488417 23660 slave.cpp:4096] Received a new estimation of the oversubscribable
resources 
I0601 23:18:33.488777 23660 slave.cpp:667] New master detected at master@172.17.0.229:33639
I0601 23:18:33.488782 23650 status_update_manager.cpp:171] Pausing sending status updates
I0601 23:18:33.488873 23660 slave.cpp:730] Authenticating with master master@172.17.0.229:33639
I0601 23:18:33.488899 23660 slave.cpp:735] Using default CRAM-MD5 authenticatee
I0601 23:18:33.489019 23660 slave.cpp:703] Detecting new master
I0601 23:18:33.489132 23647 authenticatee.hpp:139] Creating new client SASL connection
I0601 23:18:33.489487 23650 master.cpp:4165] Authenticating slave(40)@172.17.0.229:33639
I0601 23:18:33.489579 23659 authenticator.cpp:406] Starting authentication session for crammd5_authenticatee(126)@172.17.0.229:33639
I0601 23:18:33.489816 23648 authenticator.cpp:92] Creating new server SASL connection
I0601 23:18:33.489984 23647 authenticatee.hpp:230] Received SASL authentication mechanisms:
CRAM-MD5
I0601 23:18:33.490011 23647 authenticatee.hpp:256] Attempting to authenticate with mechanism
'CRAM-MD5'
I0601 23:18:33.490108 23653 authenticator.cpp:197] Received SASL authentication start
I0601 23:18:33.490164 23653 authenticator.cpp:319] Authentication requires more steps
I0601 23:18:33.490257 23661 authenticatee.hpp:276] Received SASL authentication step
I0601 23:18:33.490355 23661 authenticator.cpp:225] Received SASL authentication step
I0601 23:18:33.490388 23661 auxprop.cpp:101] Request to lookup properties for user: 'test-principal'
realm: '8499babc420b' server FQDN: '8499babc420b' SASL_AUXPROP_VERIFY_AGAINST_HASH: false
SASL_AUXPROP_OVERRIDE: false SASL_AUXPROP_AUTHZID: false 
I0601 23:18:33.490406 23661 auxprop.cpp:173] Looking up auxiliary property '*userPassword'
I0601 23:18:33.490458 23661 auxprop.cpp:173] Looking up auxiliary property '*cmusaslsecretCRAM-MD5'
I0601 23:18:33.490490 23661 auxprop.cpp:101] Request to lookup properties for user: 'test-principal'
realm: '8499babc420b' server FQDN: '8499babc420b' SASL_AUXPROP_VERIFY_AGAINST_HASH: false
SASL_AUXPROP_OVERRIDE: false SASL_AUXPROP_AUTHZID: true 
I0601 23:18:33.490505 23661 auxprop.cpp:123] Skipping auxiliary property '*userPassword' since
SASL_AUXPROP_AUTHZID == true
I0601 23:18:33.490514 23661 auxprop.cpp:123] Skipping auxiliary property '*cmusaslsecretCRAM-MD5'
since SASL_AUXPROP_AUTHZID == true
I0601 23:18:33.490531 23661 authenticator.cpp:311] Authentication success
I0601 23:18:33.490608 23653 authenticatee.hpp:316] Authentication success
I0601 23:18:33.490646 23661 master.cpp:4195] Successfully authenticated principal 'test-principal'
at slave(40)@172.17.0.229:33639
I0601 23:18:33.490682 23653 authenticator.cpp:424] Authentication session cleanup for crammd5_authenticatee(126)@172.17.0.229:33639
I0601 23:18:33.490870 23661 slave.cpp:801] Successfully authenticated with master master@172.17.0.229:33639
I0601 23:18:33.490978 23661 slave.cpp:1135] Will retry registration in 3.673502ms if necessary
I0601 23:18:33.491122 23657 master.cpp:3147] Registering slave at slave(40)@172.17.0.229:33639
(8499babc420b) with id 20150601-231833-3841986988-33639-23628-S0
I0601 23:18:33.491389 23648 registrar.cpp:445] Applied 1 operations in 56892ns; attempting
to update the 'registry'
I0601 23:18:33.493276 23651 log.cpp:685] Attempting to append 305 bytes to the log
I0601 23:18:33.493419 23660 coordinator.cpp:340] Coordinator attempting to write APPEND action
at position 3
I0601 23:18:33.493984 23657 replica.cpp:511] Replica received write request for position 3
I0601 23:18:33.494460 23657 leveldb.cpp:343] Persisting action (324 bytes) to leveldb took
457849ns
I0601 23:18:33.494484 23657 replica.cpp:679] Persisted action at 3
I0601 23:18:33.494899 23648 replica.cpp:658] Replica received learned notice for position
3
I0601 23:18:33.495309 23648 leveldb.cpp:343] Persisting action (326 bytes) to leveldb took
402233ns
I0601 23:18:33.495337 23648 replica.cpp:679] Persisted action at 3
I0601 23:18:33.495358 23648 replica.cpp:664] Replica learned APPEND action at position 3
I0601 23:18:33.495384 23649 slave.cpp:1135] Will retry registration in 31.778612ms if necessary
I0601 23:18:33.495524 23654 master.cpp:3135] Ignoring register slave message from slave(40)@172.17.0.229:33639
(8499babc420b) as admission is already in progress
I0601 23:18:33.496431 23646 registrar.cpp:490] Successfully updated the 'registry' in 4.987136ms
I0601 23:18:33.496657 23660 log.cpp:704] Attempting to truncate the log to 3
I0601 23:18:33.496891 23647 coordinator.cpp:340] Coordinator attempting to write TRUNCATE
action at position 4
I0601 23:18:33.497247 23646 slave.cpp:2884] Received ping from slave-observer(39)@172.17.0.229:33639
I0601 23:18:33.497408 23652 master.cpp:3204] Registered slave 20150601-231833-3841986988-33639-23628-S0
at slave(40)@172.17.0.229:33639 (8499babc420b) with cpus(*):1000; mem(*):1000; disk(*):3.70122e+06;
ports(*):[31000-32000]
I0601 23:18:33.497642 23659 slave.cpp:835] Registered with master master@172.17.0.229:33639;
given slave ID 20150601-231833-3841986988-33639-23628-S0
I0601 23:18:33.497809 23659 fetcher.cpp:77] Clearing fetcher cache
I0601 23:18:33.497653 23661 hierarchical.hpp:473] Added slave 20150601-231833-3841986988-33639-23628-S0
(8499babc420b) with cpus(*):1000; mem(*):1000; disk(*):3.70122e+06; ports(*):[31000-32000]
(and cpus(*):1000; mem(*):1000; disk(*):3.70122e+06; ports(*):[31000-32000] available)
I0601 23:18:33.497923 23652 replica.cpp:511] Replica received write request for position 4
I0601 23:18:33.498003 23647 status_update_manager.cpp:178] Resuming sending status updates
I0601 23:18:33.498232 23661 hierarchical.hpp:910] No resources available to allocate!
I0601 23:18:33.498342 23661 hierarchical.hpp:829] Performed allocation for slave 20150601-231833-3841986988-33639-23628-S0
in 300584ns
I0601 23:18:33.500880 23628 sched.cpp:157] Version: 0.23.0
I0601 23:18:33.501344 23653 sched.cpp:254] New master detected at master@172.17.0.229:33639
I0601 23:18:33.501433 23653 sched.cpp:310] Authenticating with master master@172.17.0.229:33639
I0601 23:18:33.501483 23653 sched.cpp:317] Using default CRAM-MD5 authenticatee
I0601 23:18:33.501641 23650 authenticatee.hpp:139] Creating new client SASL connection
I0601 23:18:33.501971 23646 master.cpp:4165] Authenticating scheduler-aea6854a-3d0b-47c2-98bd-4c74b6614fc9@172.17.0.229:33639
I0601 23:18:33.502086 23656 authenticator.cpp:406] Starting authentication session for crammd5_authenticatee(127)@172.17.0.229:33639
I0601 23:18:33.502348 23650 authenticator.cpp:92] Creating new server SASL connection
I0601 23:18:33.502601 23654 authenticatee.hpp:230] Received SASL authentication mechanisms:
CRAM-MD5
I0601 23:18:33.502707 23654 authenticatee.hpp:256] Attempting to authenticate with mechanism
'CRAM-MD5'
I0601 23:18:33.502833 23660 authenticator.cpp:197] Received SASL authentication start
I0601 23:18:33.502893 23660 authenticator.cpp:319] Authentication requires more steps
I0601 23:18:33.503007 23648 authenticatee.hpp:276] Received SASL authentication step
I0601 23:18:33.503123 23648 authenticator.cpp:225] Received SASL authentication step
I0601 23:18:33.503164 23648 auxprop.cpp:101] Request to lookup properties for user: 'test-principal'
realm: '8499babc420b' server FQDN: '8499babc420b' SASL_AUXPROP_VERIFY_AGAINST_HASH: false
SASL_AUXPROP_OVERRIDE: false SASL_AUXPROP_AUTHZID: false 
I0601 23:18:33.503180 23648 auxprop.cpp:173] Looking up auxiliary property '*userPassword'
I0601 23:18:33.503221 23648 auxprop.cpp:173] Looking up auxiliary property '*cmusaslsecretCRAM-MD5'
I0601 23:18:33.503255 23648 auxprop.cpp:101] Request to lookup properties for user: 'test-principal'
realm: '8499babc420b' server FQDN: '8499babc420b' SASL_AUXPROP_VERIFY_AGAINST_HASH: false
SASL_AUXPROP_OVERRIDE: false SASL_AUXPROP_AUTHZID: true 
I0601 23:18:33.503269 23648 auxprop.cpp:123] Skipping auxiliary property '*userPassword' since
SASL_AUXPROP_AUTHZID == true
I0601 23:18:33.503278 23648 auxprop.cpp:123] Skipping auxiliary property '*cmusaslsecretCRAM-MD5'
since SASL_AUXPROP_AUTHZID == true
I0601 23:18:33.503293 23648 authenticator.cpp:311] Authentication success
I0601 23:18:33.503410 23660 authenticatee.hpp:316] Authentication success
I0601 23:18:33.503417 23651 master.cpp:4195] Successfully authenticated principal 'test-principal'
at scheduler-aea6854a-3d0b-47c2-98bd-4c74b6614fc9@172.17.0.229:33639
I0601 23:18:33.503510 23655 authenticator.cpp:424] Authentication session cleanup for crammd5_authenticatee(127)@172.17.0.229:33639
I0601 23:18:33.503886 23660 sched.cpp:398] Successfully authenticated with master master@172.17.0.229:33639
I0601 23:18:33.503917 23660 sched.cpp:521] Sending registration request to master@172.17.0.229:33639
I0601 23:18:33.503998 23660 sched.cpp:554] Will retry registration in 1.778726068secs if necessary
I0601 23:18:33.504079 23656 master.cpp:1714] Received registration request for framework 'default'
at scheduler-aea6854a-3d0b-47c2-98bd-4c74b6614fc9@172.17.0.229:33639
W0601 23:18:33.504115 23656 master.cpp:1537] Framework at scheduler-aea6854a-3d0b-47c2-98bd-4c74b6614fc9@172.17.0.229:33639
(authenticated as 'test-principal') does not specify principal in its FrameworkInfo
I0601 23:18:33.504140 23656 master.cpp:1553] Authorizing framework principal '' to receive
offers for role '*'
I0601 23:18:33.504549 23647 master.cpp:1781] Registering framework 20150601-231833-3841986988-33639-23628-0000
(default) at scheduler-aea6854a-3d0b-47c2-98bd-4c74b6614fc9@172.17.0.229:33639
I0601 23:18:33.504855 23654 hierarchical.hpp:350] Added framework 20150601-231833-3841986988-33639-23628-0000
I0601 23:18:33.505015 23660 sched.cpp:448] Framework registered with 20150601-231833-3841986988-33639-23628-0000
I0601 23:18:33.505070 23660 sched.cpp:462] Scheduler::registered took 31019ns
I0601 23:18:33.505419 23654 hierarchical.hpp:811] Performed allocation for 1 slaves in 546251ns
I0601 23:18:33.505816 23653 master.cpp:4084] Sending 1 offers to framework 20150601-231833-3841986988-33639-23628-0000
(default) at scheduler-aea6854a-3d0b-47c2-98bd-4c74b6614fc9@172.17.0.229:33639

GMOCK WARNING:
Uninteresting mock function call - returning directly.
    Function call: resourceOffers(0x4055030, @0x7f1cd8240898 { 128-byte object <D0-E7 AE-E4
1C-7F 00-00 00-00 00-00 00-00 00-00 40-C0 00-B4 1C-7F 00-00 E0-C0 00-B4 1C-7F 00-00 80-C1
00-B4 1C-7F 00-00 20-C2 00-B4 1C-7F 00-00 30-AD 00-B4 1C-7F 00-00 04-00 00-00 04-00 00-00
04-00 00-00 2C-20 66-69 00-00 00-00 00-00 00-00 00-00 00-00 00-00 00-00 00-00 00-00 74-20
4D-65 00-00 00-00 00-00 00-00 00-00 00-00 00-00 00-00 00-00 00-00 00-00 00-00 00-00 00-00
0F-00 00-00> })
Stack trace:
I0601 23:18:33.506299 23647 sched.cpp:611] Scheduler::resourceOffers took 164865ns
I0601 23:18:33.523567 23659 slave.cpp:858] Checkpointing SlaveInfo to '/tmp/FetcherCacheTest_CachedFallback_6uSUGY/meta/slaves/20150601-231833-3841986988-33639-23628-S0/slave.info'
I0601 23:18:33.523746 23652 leveldb.cpp:343] Persisting action (16 bytes) to leveldb took
25.669801ms
I0601 23:18:33.523792 23652 replica.cpp:679] Persisted action at 4
I0601 23:18:33.524544 23652 replica.cpp:658] Replica received learned notice for position
4
I0601 23:18:33.525272 23652 leveldb.cpp:343] Persisting action (18 bytes) to leveldb took
577790ns
I0601 23:18:33.525343 23652 leveldb.cpp:401] Deleting ~2 keys from leveldb took 51743ns
I0601 23:18:33.525369 23652 replica.cpp:679] Persisted action at 4
I0601 23:18:33.525393 23652 replica.cpp:664] Replica learned TRUNCATE action at position 4
I0601 23:18:34.444985 23649 hierarchical.hpp:910] No resources available to allocate!
I0601 23:18:34.445019 23649 hierarchical.hpp:811] Performed allocation for 1 slaves in 326556ns
I0601 23:18:34.488967 23656 slave.cpp:4131] Not forwarding total oversubscribed resources
because the previous estimate  hasn't changed
I0601 23:18:35.446511 23647 hierarchical.hpp:910] No resources available to allocate!
I0601 23:18:35.446547 23647 hierarchical.hpp:811] Performed allocation for 1 slaves in 322592ns
I0601 23:18:36.447365 23661 hierarchical.hpp:910] No resources available to allocate!
I0601 23:18:36.447399 23661 hierarchical.hpp:811] Performed allocation for 1 slaves in 321283ns
I0601 23:18:37.448477 23658 hierarchical.hpp:910] No resources available to allocate!
I0601 23:18:37.448506 23658 hierarchical.hpp:811] Performed allocation for 1 slaves in 338977ns
I0601 23:18:38.448999 23656 hierarchical.hpp:910] No resources available to allocate!
I0601 23:18:38.449029 23656 hierarchical.hpp:811] Performed allocation for 1 slaves in 296100ns
I0601 23:18:39.449547 23649 hierarchical.hpp:910] No resources available to allocate!
I0601 23:18:39.449578 23649 hierarchical.hpp:811] Performed allocation for 1 slaves in 289451ns
I0601 23:18:40.450809 23661 hierarchical.hpp:910] No resources available to allocate!
I0601 23:18:40.450841 23661 hierarchical.hpp:811] Performed allocation for 1 slaves in 272557ns
I0601 23:18:41.452006 23647 hierarchical.hpp:910] No resources available to allocate!
I0601 23:18:41.452039 23647 hierarchical.hpp:811] Performed allocation for 1 slaves in 274187ns
I0601 23:18:42.452952 23652 hierarchical.hpp:910] No resources available to allocate!
I0601 23:18:42.452985 23652 hierarchical.hpp:811] Performed allocation for 1 slaves in 271964ns
I0601 23:18:43.453703 23649 hierarchical.hpp:910] No resources available to allocate!
I0601 23:18:43.453737 23649 hierarchical.hpp:811] Performed allocation for 1 slaves in 287624ns
I0601 23:18:44.454516 23655 hierarchical.hpp:910] No resources available to allocate!
I0601 23:18:44.454548 23655 hierarchical.hpp:811] Performed allocation for 1 slaves in 312918ns
I0601 23:18:45.455715 23661 hierarchical.hpp:910] No resources available to allocate!
I0601 23:18:45.455747 23661 hierarchical.hpp:811] Performed allocation for 1 slaves in 272841ns
I0601 23:18:46.457003 23647 hierarchical.hpp:910] No resources available to allocate!
I0601 23:18:46.457036 23647 hierarchical.hpp:811] Performed allocation for 1 slaves in 273341ns
I0601 23:18:47.458050 23660 hierarchical.hpp:910] No resources available to allocate!
I0601 23:18:47.458081 23660 hierarchical.hpp:811] Performed allocation for 1 slaves in 274474ns
I0601 23:18:48.459115 23658 hierarchical.hpp:910] No resources available to allocate!
I0601 23:18:48.459146 23658 hierarchical.hpp:811] Performed allocation for 1 slaves in 287611ns
I0601 23:18:48.497587 23647 slave.cpp:2884] Received ping from slave-observer(39)@172.17.0.229:33639
F0601 23:18:48.524276 23628 fetcher_cache_tests.cpp:354] CHECK_READY(offers): is PENDING Failed
to wait for resource offers
*** Check failure stack trace: ***
    @     0x7f1ce3dadbfd  google::LogMessage::Fail()
    @     0x7f1ce3dacfde  google::LogMessage::SendToLog()
    @     0x7f1ce3dad8bd  google::LogMessage::Flush()
    @     0x7f1ce3db0d28  google::LogMessageFatal::~LogMessageFatal()
    @           0x88a5c7  _CheckFatal::~_CheckFatal()
    @           0xad2c41  mesos::internal::tests::FetcherCacheTest::launchTask()
    @           0xad71a9  mesos::internal::tests::FetcherCacheTest_CachedFallback_Test::TestBody()
    @          0x124fb53  testing::internal::HandleSehExceptionsInMethodIfSupported<>()
    @          0x123a7b7  testing::internal::HandleExceptionsInMethodIfSupported<>()
    @          0x1221c15  testing::Test::Run()
    @          0x122284b  testing::TestInfo::Run()
    @          0x1222e97  testing::TestCase::Run()
    @          0x122851a  testing::internal::UnitTestImpl::RunAllTests()
    @          0x124c133  testing::internal::HandleSehExceptionsInMethodIfSupported<>()
    @          0x123c7e7  testing::internal::HandleExceptionsInMethodIfSupported<>()
    @          0x1228217  testing::UnitTest::Run()
    @           0xc949fe  main
    @     0x7f1cdfcb3ec5  (unknown)
    @           0x74168c  (unknown)
Makefile:7294: recipe for target 'check-local' failed
make[4]: Leaving directory '/mesos/mesos-0.23.0/_build/src'
make[4]: *** [check-local] Aborted
Makefile:6767: recipe for target 'check-am' failed
make[3]: Leaving directory '/mesos/mesos-0.23.0/_build/src'
make[3]: *** [check-am] Error 2
make[2]: *** [check] Error 2
Makefile:6771: recipe for target 'check' failed
make[2]: Leaving directory '/mesos/mesos-0.23.0/_build/src'
Makefile:667: recipe for target 'check-recursive' failed
make[1]: Leaving directory '/mesos/mesos-0.23.0/_build'
make[1]: *** [check-recursive] Error 1
Makefile:873: recipe for target 'distcheck' failed
make: *** [distcheck] Error 1
+ docker rmi mesos-1433199698-27373
Untagged: mesos-1433199698-27373:latest
Deleted: 1f6d4dacbec094613a306c147ffbdbb722b6b41ffcaf447dc0ac5e392d974788
Deleted: e1aede1ddf46f14ac34819a0bb0d1d92d278a9c5ab944bde2204eb1078abac6d
Deleted: 048ba830b5c7a7ab19968cec5ee4c84ea55a8e983b781197b5fc53d8c94889d0
Deleted: d291fa2d9c82f7db9b958833b68c8e0bcc5d3f3245dfe2baf43d46dc6784ead1
Deleted: 5d9f5bb8c6dad143fe3d4668cb36c5a934f71ab0f8e7663cc5d166ed847c897a
Deleted: f0573689502640a19aeb4a1726fcbaa97bc10db90c6d6267c78c41f6d5f9bc23
Deleted: 51873518d85768c6f9703ce58c77203f82acc289ed5132fb317b93c505da31d0
Deleted: 24283b0972e3ac3d4c1004aead44b7f931da7578141f4def2c1e94d81d1a2d8d
Deleted: 7bb3c76d4604ec5bf064c882e5b063e75649ef034d46e1f4cd29b9ef3f105c34
Deleted: e209f64164bba2afa90caf7bf7d06f499fe927bb55bd106a2577f781da0ebe6a
Deleted: 884ff3674bdc3e8cc2e30d09eca03f0f637b0603d0503d80ea8da74e56ddc84b
Deleted: 70c537c1635e17ade14bc41550909cf0a9e7bf87f42ce9f5527eb4c312801b29
Build step 'Execute shell' marked build as failure

Mime
View raw message