mesos-builds mailing list archives

Site index · List index
Message view « Date » · « Thread »
Top « Date » · « Thread »
From Apache Jenkins Server <jenk...@builds.apache.org>
Subject Build failed in Jenkins: mesos-reviewbot #6502
Date Sat, 20 Jun 2015 09:57:12 GMT
See <https://builds.apache.org/job/mesos-reviewbot/6502/>

------------------------------------------
[...truncated 10074 lines...]
mv -f tests/.deps/mesos_tests-environment.Tpo tests/.deps/mesos_tests-environment.Po
g++ -DPACKAGE_NAME=\"mesos\" -DPACKAGE_TARNAME=\"mesos\" -DPACKAGE_VERSION=\"0.23.0\" -DPACKAGE_STRING=\"mesos\ 0.23.0\" -DPACKAGE_BUGREPORT=\"\" -DPACKAGE_URL=\"\" -DPACKAGE=\"mesos\" -DVERSION=\"0.23.0\" -DSTDC_HEADERS=1 -DHAVE_SYS_TYPES_H=1 -DHAVE_SYS_STAT_H=1 -DHAVE_STDLIB_H=1 -DHAVE_STRING_H=1 -DHAVE_MEMORY_H=1 -DHAVE_STRINGS_H=1 -DHAVE_INTTYPES_H=1 -DHAVE_STDINT_H=1 -DHAVE_UNISTD_H=1 -DHAVE_DLFCN_H=1 -DLT_OBJDIR=\".libs/\" -DHAVE_PTHREAD_PRIO_INHERIT=1 -DHAVE_PTHREAD=1 -DHAVE_LIBZ=1 -DHAVE_LIBCURL=1 -DHAVE_APR_POOLS_H=1 -DHAVE_LIBAPR_1=1 -DHAVE_SVN_VERSION_H=1 -DHAVE_LIBSVN_SUBR_1=1 -DHAVE_SVN_DELTA_H=1 -DHAVE_LIBSVN_DELTA_1=1 -DHAVE_LIBSASL2=1 -DMESOS_HAS_JAVA=1 -DHAVE_PYTHON=\"2.7\" -DMESOS_HAS_PYTHON=1 -I. -I../../src   -Wall -Werror -DLIBDIR=\"<https://builds.apache.org/job/mesos-reviewbot/ws/mesos-0.23.0/_inst/lib\"> -DPKGLIBEXECDIR=\"<https://builds.apache.org/job/mesos-reviewbot/ws/mesos-0.23.0/_inst/libexec/mesos\"> -DPKGDATADIR=\"<https://builds.apache.org/job/mesos-reviewbot/ws/mesos-0.23.0/_inst/share/mesos\"> -I../../include -I../../3rdparty/libprocess/include -I../../3rdparty/libprocess/3rdparty/stout/include -I../include -I../include/mesos -I../3rdparty/libprocess/3rdparty/boost-1.53.0 -I../3rdparty/libprocess/3rdparty/picojson-4f93734 -I../3rdparty/libprocess/3rdparty/protobuf-2.5.0/src -I../3rdparty/libprocess/3rdparty/glog-0.3.3/src -I../3rdparty/libprocess/3rdparty/glog-0.3.3/src -I../3rdparty/leveldb/include -I../3rdparty/zookeeper-3.4.5/src/c/include -I../3rdparty/zookeeper-3.4.5/src/c/generated  -I../3rdparty/libprocess/3rdparty/protobuf-2.5.0/src -DSOURCE_DIR=\"<https://builds.apache.org/job/mesos-reviewbot/ws/mesos-0.23.0/_build/..\"> -DBUILD_DIR=\"<https://builds.apache.org/job/mesos-reviewbot/ws/mesos-0.23.0/_build\"> -I../3rdparty/libprocess/3rdparty/gmock-1.6.0/gtest/include -I../3rdparty/libprocess/3rdparty/gmock-1.6.0/include -I/home/jenkins/tools/java/jdk1.6.0_20-64/include -I/home/jenkins/tools/java/jdk1.6.0_20-64/include/linux -DZOOKEEPER_VERSION=\"3.4.5\" -I/usr/include/subversion-1 -I/usr/include/apr-1 -I/usr/include/apr-1.0  -pthread -g1 -O0 -Wno-unused-local-typedefs -std=c++11 -MT tests/mesos_tests-external_containerizer_test.o -MD -MP -MF tests/.deps/mesos_tests-external_containerizer_test.Tpo -c -o tests/mesos_tests-external_containerizer_test.o `test -f 'tests/external_containerizer_test.cpp' || echo '../../src/'`tests/external_containerizer_test.cpp
mv -f tests/.deps/mesos_tests-docker_containerizer_tests.Tpo tests/.deps/mesos_tests-docker_containerizer_tests.Po
g++ -DPACKAGE_NAME=\"mesos\" -DPACKAGE_TARNAME=\"mesos\" -DPACKAGE_VERSION=\"0.23.0\" -DPACKAGE_STRING=\"mesos\ 0.23.0\" -DPACKAGE_BUGREPORT=\"\" -DPACKAGE_URL=\"\" -DPACKAGE=\"mesos\" -DVERSION=\"0.23.0\" -DSTDC_HEADERS=1 -DHAVE_SYS_TYPES_H=1 -DHAVE_SYS_STAT_H=1 -DHAVE_STDLIB_H=1 -DHAVE_STRING_H=1 -DHAVE_MEMORY_H=1 -DHAVE_STRINGS_H=1 -DHAVE_INTTYPES_H=1 -DHAVE_STDINT_H=1 -DHAVE_UNISTD_H=1 -DHAVE_DLFCN_H=1 -DLT_OBJDIR=\".libs/\" -DHAVE_PTHREAD_PRIO_INHERIT=1 -DHAVE_PTHREAD=1 -DHAVE_LIBZ=1 -DHAVE_LIBCURL=1 -DHAVE_APR_POOLS_H=1 -DHAVE_LIBAPR_1=1 -DHAVE_SVN_VERSION_H=1 -DHAVE_LIBSVN_SUBR_1=1 -DHAVE_SVN_DELTA_H=1 -DHAVE_LIBSVN_DELTA_1=1 -DHAVE_LIBSASL2=1 -DMESOS_HAS_JAVA=1 -DHAVE_PYTHON=\"2.7\" -DMESOS_HAS_PYTHON=1 -I. -I../../src   -Wall -Werror -DLIBDIR=\"<https://builds.apache.org/job/mesos-reviewbot/ws/mesos-0.23.0/_inst/lib\"> -DPKGLIBEXECDIR=\"<https://builds.apache.org/job/mesos-reviewbot/ws/mesos-0.23.0/_inst/libexec/mesos\"> -DPKGDATADIR=\"<https://builds.apache.org/job/mesos-reviewbot/ws/mesos-0.23.0/_inst/share/mesos\"> -I../../include -I../../3rdparty/libprocess/include -I../../3rdparty/libprocess/3rdparty/stout/include -I../include -I../include/mesos -I../3rdparty/libprocess/3rdparty/boost-1.53.0 -I../3rdparty/libprocess/3rdparty/picojson-4f93734 -I../3rdparty/libprocess/3rdparty/protobuf-2.5.0/src -I../3rdparty/libprocess/3rdparty/glog-0.3.3/src -I../3rdparty/libprocess/3rdparty/glog-0.3.3/src -I../3rdparty/leveldb/include -I../3rdparty/zookeeper-3.4.5/src/c/include -I../3rdparty/zookeeper-3.4.5/src/c/generated  -I../3rdparty/libprocess/3rdparty/protobuf-2.5.0/src -DSOURCE_DIR=\"<https://builds.apache.org/job/mesos-reviewbot/ws/mesos-0.23.0/_build/..\"> -DBUILD_DIR=\"<https://builds.apache.org/job/mesos-reviewbot/ws/mesos-0.23.0/_build\"> -I../3rdparty/libprocess/3rdparty/gmock-1.6.0/gtest/include -I../3rdparty/libprocess/3rdparty/gmock-1.6.0/include -I/home/jenkins/tools/java/jdk1.6.0_20-64/include -I/home/jenkins/tools/java/jdk1.6.0_20-64/include/linux -DZOOKEEPER_VERSION=\"3.4.5\" -I/usr/include/subversion-1 -I/usr/include/apr-1 -I/usr/include/apr-1.0  -pthread -g1 -O0 -Wno-unused-local-typedefs -std=c++11 -MT tests/mesos_tests-health_check_tests.o -MD -MP -MF tests/.deps/mesos_tests-health_check_tests.Tpo -c -o tests/mesos_tests-health_check_tests.o `test -f 'tests/health_check_tests.cpp' || echo '../../src/'`tests/health_check_tests.cpp
mv -f tests/.deps/mesos_tests-exception_tests.Tpo tests/.deps/mesos_tests-exception_tests.Po
g++ -DPACKAGE_NAME=\"mesos\" -DPACKAGE_TARNAME=\"mesos\" -DPACKAGE_VERSION=\"0.23.0\" -DPACKAGE_STRING=\"mesos\ 0.23.0\" -DPACKAGE_BUGREPORT=\"\" -DPACKAGE_URL=\"\" -DPACKAGE=\"mesos\" -DVERSION=\"0.23.0\" -DSTDC_HEADERS=1 -DHAVE_SYS_TYPES_H=1 -DHAVE_SYS_STAT_H=1 -DHAVE_STDLIB_H=1 -DHAVE_STRING_H=1 -DHAVE_MEMORY_H=1 -DHAVE_STRINGS_H=1 -DHAVE_INTTYPES_H=1 -DHAVE_STDINT_H=1 -DHAVE_UNISTD_H=1 -DHAVE_DLFCN_H=1 -DLT_OBJDIR=\".libs/\" -DHAVE_PTHREAD_PRIO_INHERIT=1 -DHAVE_PTHREAD=1 -DHAVE_LIBZ=1 -DHAVE_LIBCURL=1 -DHAVE_APR_POOLS_H=1 -DHAVE_LIBAPR_1=1 -DHAVE_SVN_VERSION_H=1 -DHAVE_LIBSVN_SUBR_1=1 -DHAVE_SVN_DELTA_H=1 -DHAVE_LIBSVN_DELTA_1=1 -DHAVE_LIBSASL2=1 -DMESOS_HAS_JAVA=1 -DHAVE_PYTHON=\"2.7\" -DMESOS_HAS_PYTHON=1 -I. -I../../src   -Wall -Werror -DLIBDIR=\"<https://builds.apache.org/job/mesos-reviewbot/ws/mesos-0.23.0/_inst/lib\"> -DPKGLIBEXECDIR=\"<https://builds.apache.org/job/mesos-reviewbot/ws/mesos-0.23.0/_inst/libexec/mesos\"> -DPKGDATADIR=\"<https://builds.apache.org/job/mesos-reviewbot/ws/mesos-0.23.0/_inst/share/mesos\"> -I../../include -I../../3rdparty/libprocess/include -I../../3rdparty/libprocess/3rdparty/stout/include -I../include -I../include/mesos -I../3rdparty/libprocess/3rdparty/boost-1.53.0 -I../3rdparty/libprocess/3rdparty/picojson-4f93734 -I../3rdparty/libprocess/3rdparty/protobuf-2.5.0/src -I../3rdparty/libprocess/3rdparty/glog-0.3.3/src -I../3rdparty/libprocess/3rdparty/glog-0.3.3/src -I../3rdparty/leveldb/include -I../3rdparty/zookeeper-3.4.5/src/c/include -I../3rdparty/zookeeper-3.4.5/src/c/generated  -I../3rdparty/libprocess/3rdparty/protobuf-2.5.0/src -DSOURCE_DIR=\"<https://builds.apache.org/job/mesos-reviewbot/ws/mesos-0.23.0/_build/..\"> -DBUILD_DIR=\"<https://builds.apache.org/job/mesos-reviewbot/ws/mesos-0.23.0/_build\"> -I../3rdparty/libprocess/3rdparty/gmock-1.6.0/gtest/include -I../3rdparty/libprocess/3rdparty/gmock-1.6.0/include -I/home/jenkins/tools/java/jdk1.6.0_20-64/include -I/home/jenkins/tools/java/jdk1.6.0_20-64/include/linux -DZOOKEEPER_VERSION=\"3.4.5\" -I/usr/include/subversion-1 -I/usr/include/apr-1 -I/usr/include/apr-1.0  -pthread -g1 -O0 -Wno-unused-local-typedefs -std=c++11 -MT tests/mesos_tests-fault_tolerance_tests.o -MD -MP -MF tests/.deps/mesos_tests-fault_tolerance_tests.Tpo -c -o tests/mesos_tests-fault_tolerance_tests.o `test -f 'tests/fault_tolerance_tests.cpp' || echo '../../src/'`tests/fault_tolerance_tests.cpp
mv -f tests/.deps/mesos_tests-external_containerizer_test.Tpo tests/.deps/mesos_tests-external_containerizer_test.Po
g++ -DPACKAGE_NAME=\"mesos\" -DPACKAGE_TARNAME=\"mesos\" -DPACKAGE_VERSION=\"0.23.0\" -DPACKAGE_STRING=\"mesos\ 0.23.0\" -DPACKAGE_BUGREPORT=\"\" -DPACKAGE_URL=\"\" -DPACKAGE=\"mesos\" -DVERSION=\"0.23.0\" -DSTDC_HEADERS=1 -DHAVE_SYS_TYPES_H=1 -DHAVE_SYS_STAT_H=1 -DHAVE_STDLIB_H=1 -DHAVE_STRING_H=1 -DHAVE_MEMORY_H=1 -DHAVE_STRINGS_H=1 -DHAVE_INTTYPES_H=1 -DHAVE_STDINT_H=1 -DHAVE_UNISTD_H=1 -DHAVE_DLFCN_H=1 -DLT_OBJDIR=\".libs/\" -DHAVE_PTHREAD_PRIO_INHERIT=1 -DHAVE_PTHREAD=1 -DHAVE_LIBZ=1 -DHAVE_LIBCURL=1 -DHAVE_APR_POOLS_H=1 -DHAVE_LIBAPR_1=1 -DHAVE_SVN_VERSION_H=1 -DHAVE_LIBSVN_SUBR_1=1 -DHAVE_SVN_DELTA_H=1 -DHAVE_LIBSVN_DELTA_1=1 -DHAVE_LIBSASL2=1 -DMESOS_HAS_JAVA=1 -DHAVE_PYTHON=\"2.7\" -DMESOS_HAS_PYTHON=1 -I. -I../../src   -Wall -Werror -DLIBDIR=\"<https://builds.apache.org/job/mesos-reviewbot/ws/mesos-0.23.0/_inst/lib\"> -DPKGLIBEXECDIR=\"<https://builds.apache.org/job/mesos-reviewbot/ws/mesos-0.23.0/_inst/libexec/mesos\"> -DPKGDATADIR=\"<https://builds.apache.org/job/mesos-reviewbot/ws/mesos-0.23.0/_inst/share/mesos\"> -I../../include -I../../3rdparty/libprocess/include -I../../3rdparty/libprocess/3rdparty/stout/include -I../include -I../include/mesos -I../3rdparty/libprocess/3rdparty/boost-1.53.0 -I../3rdparty/libprocess/3rdparty/picojson-4f93734 -I../3rdparty/libprocess/3rdparty/protobuf-2.5.0/src -I../3rdparty/libprocess/3rdparty/glog-0.3.3/src -I../3rdparty/libprocess/3rdparty/glog-0.3.3/src -I../3rdparty/leveldb/include -I../3rdparty/zookeeper-3.4.5/src/c/include -I../3rdparty/zookeeper-3.4.5/src/c/generated  -I../3rdparty/libprocess/3rdparty/protobuf-2.5.0/src -DSOURCE_DIR=\"<https://builds.apache.org/job/mesos-reviewbot/ws/mesos-0.23.0/_build/..\"> -DBUILD_DIR=\"<https://builds.apache.org/job/mesos-reviewbot/ws/mesos-0.23.0/_build\"> -I../3rdparty/libprocess/3rdparty/gmock-1.6.0/gtest/include -I../3rdparty/libprocess/3rdparty/gmock-1.6.0/include -I/home/jenkins/tools/java/jdk1.6.0_20-64/include -I/home/jenkins/tools/java/jdk1.6.0_20-64/include/linux -DZOOKEEPER_VERSION=\"3.4.5\" -I/usr/include/subversion-1 -I/usr/include/apr-1 -I/usr/include/apr-1.0  -pthread -g1 -O0 -Wno-unused-local-typedefs -std=c++11 -MT tests/mesos_tests-fetcher_cache_tests.o -MD -MP -MF tests/.deps/mesos_tests-fetcher_cache_tests.Tpo -c -o tests/mesos_tests-fetcher_cache_tests.o `test -f 'tests/fetcher_cache_tests.cpp' || echo '../../src/'`tests/fetcher_cache_tests.cpp
mv -f tests/.deps/mesos_tests-health_check_tests.Tpo tests/.deps/mesos_tests-health_check_tests.Po
g++ -DPACKAGE_NAME=\"mesos\" -DPACKAGE_TARNAME=\"mesos\" -DPACKAGE_VERSION=\"0.23.0\" -DPACKAGE_STRING=\"mesos\ 0.23.0\" -DPACKAGE_BUGREPORT=\"\" -DPACKAGE_URL=\"\" -DPACKAGE=\"mesos\" -DVERSION=\"0.23.0\" -DSTDC_HEADERS=1 -DHAVE_SYS_TYPES_H=1 -DHAVE_SYS_STAT_H=1 -DHAVE_STDLIB_H=1 -DHAVE_STRING_H=1 -DHAVE_MEMORY_H=1 -DHAVE_STRINGS_H=1 -DHAVE_INTTYPES_H=1 -DHAVE_STDINT_H=1 -DHAVE_UNISTD_H=1 -DHAVE_DLFCN_H=1 -DLT_OBJDIR=\".libs/\" -DHAVE_PTHREAD_PRIO_INHERIT=1 -DHAVE_PTHREAD=1 -DHAVE_LIBZ=1 -DHAVE_LIBCURL=1 -DHAVE_APR_POOLS_H=1 -DHAVE_LIBAPR_1=1 -DHAVE_SVN_VERSION_H=1 -DHAVE_LIBSVN_SUBR_1=1 -DHAVE_SVN_DELTA_H=1 -DHAVE_LIBSVN_DELTA_1=1 -DHAVE_LIBSASL2=1 -DMESOS_HAS_JAVA=1 -DHAVE_PYTHON=\"2.7\" -DMESOS_HAS_PYTHON=1 -I. -I../../src   -Wall -Werror -DLIBDIR=\"<https://builds.apache.org/job/mesos-reviewbot/ws/mesos-0.23.0/_inst/lib\"> -DPKGLIBEXECDIR=\"<https://builds.apache.org/job/mesos-reviewbot/ws/mesos-0.23.0/_inst/libexec/mesos\"> -DPKGDATADIR=\"<https://builds.apache.org/job/mesos-reviewbot/ws/mesos-0.23.0/_inst/share/mesos\"> -I../../include -I../../3rdparty/libprocess/include -I../../3rdparty/libprocess/3rdparty/stout/include -I../include -I../include/mesos -I../3rdparty/libprocess/3rdparty/boost-1.53.0 -I../3rdparty/libprocess/3rdparty/picojson-4f93734 -I../3rdparty/libprocess/3rdparty/protobuf-2.5.0/src -I../3rdparty/libprocess/3rdparty/glog-0.3.3/src -I../3rdparty/libprocess/3rdparty/glog-0.3.3/src -I../3rdparty/leveldb/include -I../3rdparty/zookeeper-3.4.5/src/c/include -I../3rdparty/zookeeper-3.4.5/src/c/generated  -I../3rdparty/libprocess/3rdparty/protobuf-2.5.0/src -DSOURCE_DIR=\"<https://builds.apache.org/job/mesos-reviewbot/ws/mesos-0.23.0/_build/..\"> -DBUILD_DIR=\"<https://builds.apache.org/job/mesos-reviewbot/ws/mesos-0.23.0/_build\"> -I../3rdparty/libprocess/3rdparty/gmock-1.6.0/gtest/include -I../3rdparty/libprocess/3rdparty/gmock-1.6.0/include -I/home/jenkins/tools/java/jdk1.6.0_20-64/include -I/home/jenkins/tools/java/jdk1.6.0_20-64/include/linux -DZOOKEEPER_VERSION=\"3.4.5\" -I/usr/include/subversion-1 -I/usr/include/apr-1 -I/usr/include/apr-1.0  -pthread -g1 -O0 -Wno-unused-local-typedefs -std=c++11 -MT tests/mesos_tests-fetcher_tests.o -MD -MP -MF tests/.deps/mesos_tests-fetcher_tests.Tpo -c -o tests/mesos_tests-fetcher_tests.o `test -f 'tests/fetcher_tests.cpp' || echo '../../src/'`tests/fetcher_tests.cpp
mv -f tests/.deps/mesos_tests-fetcher_cache_tests.Tpo tests/.deps/mesos_tests-fetcher_cache_tests.Po
g++ -DPACKAGE_NAME=\"mesos\" -DPACKAGE_TARNAME=\"mesos\" -DPACKAGE_VERSION=\"0.23.0\" -DPACKAGE_STRING=\"mesos\ 0.23.0\" -DPACKAGE_BUGREPORT=\"\" -DPACKAGE_URL=\"\" -DPACKAGE=\"mesos\" -DVERSION=\"0.23.0\" -DSTDC_HEADERS=1 -DHAVE_SYS_TYPES_H=1 -DHAVE_SYS_STAT_H=1 -DHAVE_STDLIB_H=1 -DHAVE_STRING_H=1 -DHAVE_MEMORY_H=1 -DHAVE_STRINGS_H=1 -DHAVE_INTTYPES_H=1 -DHAVE_STDINT_H=1 -DHAVE_UNISTD_H=1 -DHAVE_DLFCN_H=1 -DLT_OBJDIR=\".libs/\" -DHAVE_PTHREAD_PRIO_INHERIT=1 -DHAVE_PTHREAD=1 -DHAVE_LIBZ=1 -DHAVE_LIBCURL=1 -DHAVE_APR_POOLS_H=1 -DHAVE_LIBAPR_1=1 -DHAVE_SVN_VERSION_H=1 -DHAVE_LIBSVN_SUBR_1=1 -DHAVE_SVN_DELTA_H=1 -DHAVE_LIBSVN_DELTA_1=1 -DHAVE_LIBSASL2=1 -DMESOS_HAS_JAVA=1 -DHAVE_PYTHON=\"2.7\" -DMESOS_HAS_PYTHON=1 -I. -I../../src   -Wall -Werror -DLIBDIR=\"<https://builds.apache.org/job/mesos-reviewbot/ws/mesos-0.23.0/_inst/lib\"> -DPKGLIBEXECDIR=\"<https://builds.apache.org/job/mesos-reviewbot/ws/mesos-0.23.0/_inst/libexec/mesos\"> -DPKGDATADIR=\"<https://builds.apache.org/job/mesos-reviewbot/ws/mesos-0.23.0/_inst/share/mesos\"> -I../../include -I../../3rdparty/libprocess/include -I../../3rdparty/libprocess/3rdparty/stout/include -I../include -I../include/mesos -I../3rdparty/libprocess/3rdparty/boost-1.53.0 -I../3rdparty/libprocess/3rdparty/picojson-4f93734 -I../3rdparty/libprocess/3rdparty/protobuf-2.5.0/src -I../3rdparty/libprocess/3rdparty/glog-0.3.3/src -I../3rdparty/libprocess/3rdparty/glog-0.3.3/src -I../3rdparty/leveldb/include -I../3rdparty/zookeeper-3.4.5/src/c/include -I../3rdparty/zookeeper-3.4.5/src/c/generated  -I../3rdparty/libprocess/3rdparty/protobuf-2.5.0/src -DSOURCE_DIR=\"<https://builds.apache.org/job/mesos-reviewbot/ws/mesos-0.23.0/_build/..\"> -DBUILD_DIR=\"<https://builds.apache.org/job/mesos-reviewbot/ws/mesos-0.23.0/_build\"> -I../3rdparty/libprocess/3rdparty/gmock-1.6.0/gtest/include -I../3rdparty/libprocess/3rdparty/gmock-1.6.0/include -I/home/jenkins/tools/java/jdk1.6.0_20-64/include -I/home/jenkins/tools/java/jdk1.6.0_20-64/include/linux -DZOOKEEPER_VERSION=\"3.4.5\" -I/usr/include/subversion-1 -I/usr/include/apr-1 -I/usr/include/apr-1.0  -pthread -g1 -O0 -Wno-unused-local-typedefs -std=c++11 -MT tests/mesos_tests-files_tests.o -MD -MP -MF tests/.deps/mesos_tests-files_tests.Tpo -c -o tests/mesos_tests-files_tests.o `test -f 'tests/files_tests.cpp' || echo '../../src/'`tests/files_tests.cpp
mv -f tests/.deps/mesos_tests-fetcher_tests.Tpo tests/.deps/mesos_tests-fetcher_tests.Po
g++ -DPACKAGE_NAME=\"mesos\" -DPACKAGE_TARNAME=\"mesos\" -DPACKAGE_VERSION=\"0.23.0\" -DPACKAGE_STRING=\"mesos\ 0.23.0\" -DPACKAGE_BUGREPORT=\"\" -DPACKAGE_URL=\"\" -DPACKAGE=\"mesos\" -DVERSION=\"0.23.0\" -DSTDC_HEADERS=1 -DHAVE_SYS_TYPES_H=1 -DHAVE_SYS_STAT_H=1 -DHAVE_STDLIB_H=1 -DHAVE_STRING_H=1 -DHAVE_MEMORY_H=1 -DHAVE_STRINGS_H=1 -DHAVE_INTTYPES_H=1 -DHAVE_STDINT_H=1 -DHAVE_UNISTD_H=1 -DHAVE_DLFCN_H=1 -DLT_OBJDIR=\".libs/\" -DHAVE_PTHREAD_PRIO_INHERIT=1 -DHAVE_PTHREAD=1 -DHAVE_LIBZ=1 -DHAVE_LIBCURL=1 -DHAVE_APR_POOLS_H=1 -DHAVE_LIBAPR_1=1 -DHAVE_SVN_VERSION_H=1 -DHAVE_LIBSVN_SUBR_1=1 -DHAVE_SVN_DELTA_H=1 -DHAVE_LIBSVN_DELTA_1=1 -DHAVE_LIBSASL2=1 -DMESOS_HAS_JAVA=1 -DHAVE_PYTHON=\"2.7\" -DMESOS_HAS_PYTHON=1 -I. -I../../src   -Wall -Werror -DLIBDIR=\"<https://builds.apache.org/job/mesos-reviewbot/ws/mesos-0.23.0/_inst/lib\"> -DPKGLIBEXECDIR=\"<https://builds.apache.org/job/mesos-reviewbot/ws/mesos-0.23.0/_inst/libexec/mesos\"> -DPKGDATADIR=\"<https://builds.apache.org/job/mesos-reviewbot/ws/mesos-0.23.0/_inst/share/mesos\"> -I../../include -I../../3rdparty/libprocess/include -I../../3rdparty/libprocess/3rdparty/stout/include -I../include -I../include/mesos -I../3rdparty/libprocess/3rdparty/boost-1.53.0 -I../3rdparty/libprocess/3rdparty/picojson-4f93734 -I../3rdparty/libprocess/3rdparty/protobuf-2.5.0/src -I../3rdparty/libprocess/3rdparty/glog-0.3.3/src -I../3rdparty/libprocess/3rdparty/glog-0.3.3/src -I../3rdparty/leveldb/include -I../3rdparty/zookeeper-3.4.5/src/c/include -I../3rdparty/zookeeper-3.4.5/src/c/generated  -I../3rdparty/libprocess/3rdparty/protobuf-2.5.0/src -DSOURCE_DIR=\"<https://builds.apache.org/job/mesos-reviewbot/ws/mesos-0.23.0/_build/..\"> -DBUILD_DIR=\"<https://builds.apache.org/job/mesos-reviewbot/ws/mesos-0.23.0/_build\"> -I../3rdparty/libprocess/3rdparty/gmock-1.6.0/gtest/include -I../3rdparty/libprocess/3rdparty/gmock-1.6.0/include -I/home/jenkins/tools/java/jdk1.6.0_20-64/include -I/home/jenkins/tools/java/jdk1.6.0_20-64/include/linux -DZOOKEEPER_VERSION=\"3.4.5\" -I/usr/include/subversion-1 -I/usr/include/apr-1 -I/usr/include/apr-1.0  -pthread -g1 -O0 -Wno-unused-local-typedefs -std=c++11 -MT tests/mesos_tests-flags.o -MD -MP -MF tests/.deps/mesos_tests-flags.Tpo -c -o tests/mesos_tests-flags.o `test -f 'tests/flags.cpp' || echo '../../src/'`tests/flags.cpp
mv -f tests/.deps/mesos_tests-files_tests.Tpo tests/.deps/mesos_tests-files_tests.Po
g++ -DPACKAGE_NAME=\"mesos\" -DPACKAGE_TARNAME=\"mesos\" -DPACKAGE_VERSION=\"0.23.0\" -DPACKAGE_STRING=\"mesos\ 0.23.0\" -DPACKAGE_BUGREPORT=\"\" -DPACKAGE_URL=\"\" -DPACKAGE=\"mesos\" -DVERSION=\"0.23.0\" -DSTDC_HEADERS=1 -DHAVE_SYS_TYPES_H=1 -DHAVE_SYS_STAT_H=1 -DHAVE_STDLIB_H=1 -DHAVE_STRING_H=1 -DHAVE_MEMORY_H=1 -DHAVE_STRINGS_H=1 -DHAVE_INTTYPES_H=1 -DHAVE_STDINT_H=1 -DHAVE_UNISTD_H=1 -DHAVE_DLFCN_H=1 -DLT_OBJDIR=\".libs/\" -DHAVE_PTHREAD_PRIO_INHERIT=1 -DHAVE_PTHREAD=1 -DHAVE_LIBZ=1 -DHAVE_LIBCURL=1 -DHAVE_APR_POOLS_H=1 -DHAVE_LIBAPR_1=1 -DHAVE_SVN_VERSION_H=1 -DHAVE_LIBSVN_SUBR_1=1 -DHAVE_SVN_DELTA_H=1 -DHAVE_LIBSVN_DELTA_1=1 -DHAVE_LIBSASL2=1 -DMESOS_HAS_JAVA=1 -DHAVE_PYTHON=\"2.7\" -DMESOS_HAS_PYTHON=1 -I. -I../../src   -Wall -Werror -DLIBDIR=\"<https://builds.apache.org/job/mesos-reviewbot/ws/mesos-0.23.0/_inst/lib\"> -DPKGLIBEXECDIR=\"<https://builds.apache.org/job/mesos-reviewbot/ws/mesos-0.23.0/_inst/libexec/mesos\"> -DPKGDATADIR=\"<https://builds.apache.org/job/mesos-reviewbot/ws/mesos-0.23.0/_inst/share/mesos\"> -I../../include -I../../3rdparty/libprocess/include -I../../3rdparty/libprocess/3rdparty/stout/include -I../include -I../include/mesos -I../3rdparty/libprocess/3rdparty/boost-1.53.0 -I../3rdparty/libprocess/3rdparty/picojson-4f93734 -I../3rdparty/libprocess/3rdparty/protobuf-2.5.0/src -I../3rdparty/libprocess/3rdparty/glog-0.3.3/src -I../3rdparty/libprocess/3rdparty/glog-0.3.3/src -I../3rdparty/leveldb/include -I../3rdparty/zookeeper-3.4.5/src/c/include -I../3rdparty/zookeeper-3.4.5/src/c/generated  -I../3rdparty/libprocess/3rdparty/protobuf-2.5.0/src -DSOURCE_DIR=\"<https://builds.apache.org/job/mesos-reviewbot/ws/mesos-0.23.0/_build/..\"> -DBUILD_DIR=\"<https://builds.apache.org/job/mesos-reviewbot/ws/mesos-0.23.0/_build\"> -I../3rdparty/libprocess/3rdparty/gmock-1.6.0/gtest/include -I../3rdparty/libprocess/3rdparty/gmock-1.6.0/include -I/home/jenkins/tools/java/jdk1.6.0_20-64/include -I/home/jenkins/tools/java/jdk1.6.0_20-64/include/linux -DZOOKEEPER_VERSION=\"3.4.5\" -I/usr/include/subversion-1 -I/usr/include/apr-1 -I/usr/include/apr-1.0  -pthread -g1 -O0 -Wno-unused-local-typedefs -std=c++11 -MT tests/mesos_tests-gc_tests.o -MD -MP -MF tests/.deps/mesos_tests-gc_tests.Tpo -c -o tests/mesos_tests-gc_tests.o `test -f 'tests/gc_tests.cpp' || echo '../../src/'`tests/gc_tests.cpp
mv -f tests/.deps/mesos_tests-fault_tolerance_tests.Tpo tests/.deps/mesos_tests-fault_tolerance_tests.Po
g++ -DPACKAGE_NAME=\"mesos\" -DPACKAGE_TARNAME=\"mesos\" -DPACKAGE_VERSION=\"0.23.0\" -DPACKAGE_STRING=\"mesos\ 0.23.0\" -DPACKAGE_BUGREPORT=\"\" -DPACKAGE_URL=\"\" -DPACKAGE=\"mesos\" -DVERSION=\"0.23.0\" -DSTDC_HEADERS=1 -DHAVE_SYS_TYPES_H=1 -DHAVE_SYS_STAT_H=1 -DHAVE_STDLIB_H=1 -DHAVE_STRING_H=1 -DHAVE_MEMORY_H=1 -DHAVE_STRINGS_H=1 -DHAVE_INTTYPES_H=1 -DHAVE_STDINT_H=1 -DHAVE_UNISTD_H=1 -DHAVE_DLFCN_H=1 -DLT_OBJDIR=\".libs/\" -DHAVE_PTHREAD_PRIO_INHERIT=1 -DHAVE_PTHREAD=1 -DHAVE_LIBZ=1 -DHAVE_LIBCURL=1 -DHAVE_APR_POOLS_H=1 -DHAVE_LIBAPR_1=1 -DHAVE_SVN_VERSION_H=1 -DHAVE_LIBSVN_SUBR_1=1 -DHAVE_SVN_DELTA_H=1 -DHAVE_LIBSVN_DELTA_1=1 -DHAVE_LIBSASL2=1 -DMESOS_HAS_JAVA=1 -DHAVE_PYTHON=\"2.7\" -DMESOS_HAS_PYTHON=1 -I. -I../../src   -Wall -Werror -DLIBDIR=\"<https://builds.apache.org/job/mesos-reviewbot/ws/mesos-0.23.0/_inst/lib\"> -DPKGLIBEXECDIR=\"<https://builds.apache.org/job/mesos-reviewbot/ws/mesos-0.23.0/_inst/libexec/mesos\"> -DPKGDATADIR=\"<https://builds.apache.org/job/mesos-reviewbot/ws/mesos-0.23.0/_inst/share/mesos\"> -I../../include -I../../3rdparty/libprocess/include -I../../3rdparty/libprocess/3rdparty/stout/include -I../include -I../include/mesos -I../3rdparty/libprocess/3rdparty/boost-1.53.0 -I../3rdparty/libprocess/3rdparty/picojson-4f93734 -I../3rdparty/libprocess/3rdparty/protobuf-2.5.0/src -I../3rdparty/libprocess/3rdparty/glog-0.3.3/src -I../3rdparty/libprocess/3rdparty/glog-0.3.3/src -I../3rdparty/leveldb/include -I../3rdparty/zookeeper-3.4.5/src/c/include -I../3rdparty/zookeeper-3.4.5/src/c/generated  -I../3rdparty/libprocess/3rdparty/protobuf-2.5.0/src -DSOURCE_DIR=\"<https://builds.apache.org/job/mesos-reviewbot/ws/mesos-0.23.0/_build/..\"> -DBUILD_DIR=\"<https://builds.apache.org/job/mesos-reviewbot/ws/mesos-0.23.0/_build\"> -I../3rdparty/libprocess/3rdparty/gmock-1.6.0/gtest/include -I../3rdparty/libprocess/3rdparty/gmock-1.6.0/include -I/home/jenkins/tools/java/jdk1.6.0_20-64/include -I/home/jenkins/tools/java/jdk1.6.0_20-64/include/linux -DZOOKEEPER_VERSION=\"3.4.5\" -I/usr/include/subversion-1 -I/usr/include/apr-1 -I/usr/include/apr-1.0  -pthread -g1 -O0 -Wno-unused-local-typedefs -std=c++11 -MT tests/mesos_tests-hierarchical_allocator_tests.o -MD -MP -MF tests/.deps/mesos_tests-hierarchical_allocator_tests.Tpo -c -o tests/mesos_tests-hierarchical_allocator_tests.o `test -f 'tests/hierarchical_allocator_tests.cpp' || echo '../../src/'`tests/hierarchical_allocator_tests.cpp
mv -f tests/.deps/mesos_tests-flags.Tpo tests/.deps/mesos_tests-flags.Po
g++ -DPACKAGE_NAME=\"mesos\" -DPACKAGE_TARNAME=\"mesos\" -DPACKAGE_VERSION=\"0.23.0\" -DPACKAGE_STRING=\"mesos\ 0.23.0\" -DPACKAGE_BUGREPORT=\"\" -DPACKAGE_URL=\"\" -DPACKAGE=\"mesos\" -DVERSION=\"0.23.0\" -DSTDC_HEADERS=1 -DHAVE_SYS_TYPES_H=1 -DHAVE_SYS_STAT_H=1 -DHAVE_STDLIB_H=1 -DHAVE_STRING_H=1 -DHAVE_MEMORY_H=1 -DHAVE_STRINGS_H=1 -DHAVE_INTTYPES_H=1 -DHAVE_STDINT_H=1 -DHAVE_UNISTD_H=1 -DHAVE_DLFCN_H=1 -DLT_OBJDIR=\".libs/\" -DHAVE_PTHREAD_PRIO_INHERIT=1 -DHAVE_PTHREAD=1 -DHAVE_LIBZ=1 -DHAVE_LIBCURL=1 -DHAVE_APR_POOLS_H=1 -DHAVE_LIBAPR_1=1 -DHAVE_SVN_VERSION_H=1 -DHAVE_LIBSVN_SUBR_1=1 -DHAVE_SVN_DELTA_H=1 -DHAVE_LIBSVN_DELTA_1=1 -DHAVE_LIBSASL2=1 -DMESOS_HAS_JAVA=1 -DHAVE_PYTHON=\"2.7\" -DMESOS_HAS_PYTHON=1 -I. -I../../src   -Wall -Werror -DLIBDIR=\"<https://builds.apache.org/job/mesos-reviewbot/ws/mesos-0.23.0/_inst/lib\"> -DPKGLIBEXECDIR=\"<https://builds.apache.org/job/mesos-reviewbot/ws/mesos-0.23.0/_inst/libexec/mesos\"> -DPKGDATADIR=\"<https://builds.apache.org/job/mesos-reviewbot/ws/mesos-0.23.0/_inst/share/mesos\"> -I../../include -I../../3rdparty/libprocess/include -I../../3rdparty/libprocess/3rdparty/stout/include -I../include -I../include/mesos -I../3rdparty/libprocess/3rdparty/boost-1.53.0 -I../3rdparty/libprocess/3rdparty/picojson-4f93734 -I../3rdparty/libprocess/3rdparty/protobuf-2.5.0/src -I../3rdparty/libprocess/3rdparty/glog-0.3.3/src -I../3rdparty/libprocess/3rdparty/glog-0.3.3/src -I../3rdparty/leveldb/include -I../3rdparty/zookeeper-3.4.5/src/c/include -I../3rdparty/zookeeper-3.4.5/src/c/generated  -I../3rdparty/libprocess/3rdparty/protobuf-2.5.0/src -DSOURCE_DIR=\"<https://builds.apache.org/job/mesos-reviewbot/ws/mesos-0.23.0/_build/..\"> -DBUILD_DIR=\"<https://builds.apache.org/job/mesos-reviewbot/ws/mesos-0.23.0/_build\"> -I../3rdparty/libprocess/3rdparty/gmock-1.6.0/gtest/include -I../3rdparty/libprocess/3rdparty/gmock-1.6.0/include -I/home/jenkins/tools/java/jdk1.6.0_20-64/include -I/home/jenkins/tools/java/jdk1.6.0_20-64/include/linux -DZOOKEEPER_VERSION=\"3.4.5\" -I/usr/include/subversion-1 -I/usr/include/apr-1 -I/usr/include/apr-1.0  -pthread -g1 -O0 -Wno-unused-local-typedefs -std=c++11 -MT tests/mesos_tests-hook_tests.o -MD -MP -MF tests/.deps/mesos_tests-hook_tests.Tpo -c -o tests/mesos_tests-hook_tests.o `test -f 'tests/hook_tests.cpp' || echo '../../src/'`tests/hook_tests.cpp
mv -f tests/.deps/mesos_tests-hierarchical_allocator_tests.Tpo tests/.deps/mesos_tests-hierarchical_allocator_tests.Po
g++ -DPACKAGE_NAME=\"mesos\" -DPACKAGE_TARNAME=\"mesos\" -DPACKAGE_VERSION=\"0.23.0\" -DPACKAGE_STRING=\"mesos\ 0.23.0\" -DPACKAGE_BUGREPORT=\"\" -DPACKAGE_URL=\"\" -DPACKAGE=\"mesos\" -DVERSION=\"0.23.0\" -DSTDC_HEADERS=1 -DHAVE_SYS_TYPES_H=1 -DHAVE_SYS_STAT_H=1 -DHAVE_STDLIB_H=1 -DHAVE_STRING_H=1 -DHAVE_MEMORY_H=1 -DHAVE_STRINGS_H=1 -DHAVE_INTTYPES_H=1 -DHAVE_STDINT_H=1 -DHAVE_UNISTD_H=1 -DHAVE_DLFCN_H=1 -DLT_OBJDIR=\".libs/\" -DHAVE_PTHREAD_PRIO_INHERIT=1 -DHAVE_PTHREAD=1 -DHAVE_LIBZ=1 -DHAVE_LIBCURL=1 -DHAVE_APR_POOLS_H=1 -DHAVE_LIBAPR_1=1 -DHAVE_SVN_VERSION_H=1 -DHAVE_LIBSVN_SUBR_1=1 -DHAVE_SVN_DELTA_H=1 -DHAVE_LIBSVN_DELTA_1=1 -DHAVE_LIBSASL2=1 -DMESOS_HAS_JAVA=1 -DHAVE_PYTHON=\"2.7\" -DMESOS_HAS_PYTHON=1 -I. -I../../src   -Wall -Werror -DLIBDIR=\"<https://builds.apache.org/job/mesos-reviewbot/ws/mesos-0.23.0/_inst/lib\"> -DPKGLIBEXECDIR=\"<https://builds.apache.org/job/mesos-reviewbot/ws/mesos-0.23.0/_inst/libexec/mesos\"> -DPKGDATADIR=\"<https://builds.apache.org/job/mesos-reviewbot/ws/mesos-0.23.0/_inst/share/mesos\"> -I../../include -I../../3rdparty/libprocess/include -I../../3rdparty/libprocess/3rdparty/stout/include -I../include -I../include/mesos -I../3rdparty/libprocess/3rdparty/boost-1.53.0 -I../3rdparty/libprocess/3rdparty/picojson-4f93734 -I../3rdparty/libprocess/3rdparty/protobuf-2.5.0/src -I../3rdparty/libprocess/3rdparty/glog-0.3.3/src -I../3rdparty/libprocess/3rdparty/glog-0.3.3/src -I../3rdparty/leveldb/include -I../3rdparty/zookeeper-3.4.5/src/c/include -I../3rdparty/zookeeper-3.4.5/src/c/generated  -I../3rdparty/libprocess/3rdparty/protobuf-2.5.0/src -DSOURCE_DIR=\"<https://builds.apache.org/job/mesos-reviewbot/ws/mesos-0.23.0/_build/..\"> -DBUILD_DIR=\"<https://builds.apache.org/job/mesos-reviewbot/ws/mesos-0.23.0/_build\"> -I../3rdparty/libprocess/3rdparty/gmock-1.6.0/gtest/include -I../3rdparty/libprocess/3rdparty/gmock-1.6.0/include -I/home/jenkins/tools/java/jdk1.6.0_20-64/include -I/home/jenkins/tools/java/jdk1.6.0_20-64/include/linux -DZOOKEEPER_VERSION=\"3.4.5\" -I/usr/include/subversion-1 -I/usr/include/apr-1 -I/usr/include/apr-1.0  -pthread -g1 -O0 -Wno-unused-local-typedefs -std=c++11 -MT tests/mesos_tests-isolator_tests.o -MD -MP -MF tests/.deps/mesos_tests-isolator_tests.Tpo -c -o tests/mesos_tests-isolator_tests.o `test -f 'tests/isolator_tests.cpp' || echo '../../src/'`tests/isolator_tests.cpp
mv -f tests/.deps/mesos_tests-gc_tests.Tpo tests/.deps/mesos_tests-gc_tests.Po
g++ -DPACKAGE_NAME=\"mesos\" -DPACKAGE_TARNAME=\"mesos\" -DPACKAGE_VERSION=\"0.23.0\" -DPACKAGE_STRING=\"mesos\ 0.23.0\" -DPACKAGE_BUGREPORT=\"\" -DPACKAGE_URL=\"\" -DPACKAGE=\"mesos\" -DVERSION=\"0.23.0\" -DSTDC_HEADERS=1 -DHAVE_SYS_TYPES_H=1 -DHAVE_SYS_STAT_H=1 -DHAVE_STDLIB_H=1 -DHAVE_STRING_H=1 -DHAVE_MEMORY_H=1 -DHAVE_STRINGS_H=1 -DHAVE_INTTYPES_H=1 -DHAVE_STDINT_H=1 -DHAVE_UNISTD_H=1 -DHAVE_DLFCN_H=1 -DLT_OBJDIR=\".libs/\" -DHAVE_PTHREAD_PRIO_INHERIT=1 -DHAVE_PTHREAD=1 -DHAVE_LIBZ=1 -DHAVE_LIBCURL=1 -DHAVE_APR_POOLS_H=1 -DHAVE_LIBAPR_1=1 -DHAVE_SVN_VERSION_H=1 -DHAVE_LIBSVN_SUBR_1=1 -DHAVE_SVN_DELTA_H=1 -DHAVE_LIBSVN_DELTA_1=1 -DHAVE_LIBSASL2=1 -DMESOS_HAS_JAVA=1 -DHAVE_PYTHON=\"2.7\" -DMESOS_HAS_PYTHON=1 -I. -I../../src   -Wall -Werror -DLIBDIR=\"<https://builds.apache.org/job/mesos-reviewbot/ws/mesos-0.23.0/_inst/lib\"> -DPKGLIBEXECDIR=\"<https://builds.apache.org/job/mesos-reviewbot/ws/mesos-0.23.0/_inst/libexec/mesos\"> -DPKGDATADIR=\"<https://builds.apache.org/job/mesos-reviewbot/ws/mesos-0.23.0/_inst/share/mesos\"> -I../../include -I../../3rdparty/libprocess/include -I../../3rdparty/libprocess/3rdparty/stout/include -I../include -I../include/mesos -I../3rdparty/libprocess/3rdparty/boost-1.53.0 -I../3rdparty/libprocess/3rdparty/picojson-4f93734 -I../3rdparty/libprocess/3rdparty/protobuf-2.5.0/src -I../3rdparty/libprocess/3rdparty/glog-0.3.3/src -I../3rdparty/libprocess/3rdparty/glog-0.3.3/src -I../3rdparty/leveldb/include -I../3rdparty/zookeeper-3.4.5/src/c/include -I../3rdparty/zookeeper-3.4.5/src/c/generated  -I../3rdparty/libprocess/3rdparty/protobuf-2.5.0/src -DSOURCE_DIR=\"<https://builds.apache.org/job/mesos-reviewbot/ws/mesos-0.23.0/_build/..\"> -DBUILD_DIR=\"<https://builds.apache.org/job/mesos-reviewbot/ws/mesos-0.23.0/_build\"> -I../3rdparty/libprocess/3rdparty/gmock-1.6.0/gtest/include -I../3rdparty/libprocess/3rdparty/gmock-1.6.0/include -I/home/jenkins/tools/java/jdk1.6.0_20-64/include -I/home/jenkins/tools/java/jdk1.6.0_20-64/include/linux -DZOOKEEPER_VERSION=\"3.4.5\" -I/usr/include/subversion-1 -I/usr/include/apr-1 -I/usr/include/apr-1.0  -pthread -g1 -O0 -Wno-unused-local-typedefs -std=c++11 -MT tests/mesos_tests-log_tests.o -MD -MP -MF tests/.deps/mesos_tests-log_tests.Tpo -c -o tests/mesos_tests-log_tests.o `test -f 'tests/log_tests.cpp' || echo '../../src/'`tests/log_tests.cpp
mv -f tests/.deps/mesos_tests-hook_tests.Tpo tests/.deps/mesos_tests-hook_tests.Po
g++ -DPACKAGE_NAME=\"mesos\" -DPACKAGE_TARNAME=\"mesos\" -DPACKAGE_VERSION=\"0.23.0\" -DPACKAGE_STRING=\"mesos\ 0.23.0\" -DPACKAGE_BUGREPORT=\"\" -DPACKAGE_URL=\"\" -DPACKAGE=\"mesos\" -DVERSION=\"0.23.0\" -DSTDC_HEADERS=1 -DHAVE_SYS_TYPES_H=1 -DHAVE_SYS_STAT_H=1 -DHAVE_STDLIB_H=1 -DHAVE_STRING_H=1 -DHAVE_MEMORY_H=1 -DHAVE_STRINGS_H=1 -DHAVE_INTTYPES_H=1 -DHAVE_STDINT_H=1 -DHAVE_UNISTD_H=1 -DHAVE_DLFCN_H=1 -DLT_OBJDIR=\".libs/\" -DHAVE_PTHREAD_PRIO_INHERIT=1 -DHAVE_PTHREAD=1 -DHAVE_LIBZ=1 -DHAVE_LIBCURL=1 -DHAVE_APR_POOLS_H=1 -DHAVE_LIBAPR_1=1 -DHAVE_SVN_VERSION_H=1 -DHAVE_LIBSVN_SUBR_1=1 -DHAVE_SVN_DELTA_H=1 -DHAVE_LIBSVN_DELTA_1=1 -DHAVE_LIBSASL2=1 -DMESOS_HAS_JAVA=1 -DHAVE_PYTHON=\"2.7\" -DMESOS_HAS_PYTHON=1 -I. -I../../src   -Wall -Werror -DLIBDIR=\"<https://builds.apache.org/job/mesos-reviewbot/ws/mesos-0.23.0/_inst/lib\"> -DPKGLIBEXECDIR=\"<https://builds.apache.org/job/mesos-reviewbot/ws/mesos-0.23.0/_inst/libexec/mesos\"> -DPKGDATADIR=\"<https://builds.apache.org/job/mesos-reviewbot/ws/mesos-0.23.0/_inst/share/mesos\"> -I../../include -I../../3rdparty/libprocess/include -I../../3rdparty/libprocess/3rdparty/stout/include -I../include -I../include/mesos -I../3rdparty/libprocess/3rdparty/boost-1.53.0 -I../3rdparty/libprocess/3rdparty/picojson-4f93734 -I../3rdparty/libprocess/3rdparty/protobuf-2.5.0/src -I../3rdparty/libprocess/3rdparty/glog-0.3.3/src -I../3rdparty/libprocess/3rdparty/glog-0.3.3/src -I../3rdparty/leveldb/include -I../3rdparty/zookeeper-3.4.5/src/c/include -I../3rdparty/zookeeper-3.4.5/src/c/generated  -I../3rdparty/libprocess/3rdparty/protobuf-2.5.0/src -DSOURCE_DIR=\"<https://builds.apache.org/job/mesos-reviewbot/ws/mesos-0.23.0/_build/..\"> -DBUILD_DIR=\"<https://builds.apache.org/job/mesos-reviewbot/ws/mesos-0.23.0/_build\"> -I../3rdparty/libprocess/3rdparty/gmock-1.6.0/gtest/include -I../3rdparty/libprocess/3rdparty/gmock-1.6.0/include -I/home/jenkins/tools/java/jdk1.6.0_20-64/include -I/home/jenkins/tools/java/jdk1.6.0_20-64/include/linux -DZOOKEEPER_VERSION=\"3.4.5\" -I/usr/include/subversion-1 -I/usr/include/apr-1 -I/usr/include/apr-1.0  -pthread -g1 -O0 -Wno-unused-local-typedefs -std=c++11 -MT tests/mesos_tests-logging_tests.o -MD -MP -MF tests/.deps/mesos_tests-logging_tests.Tpo -c -o tests/mesos_tests-logging_tests.o `test -f 'tests/logging_tests.cpp' || echo '../../src/'`tests/logging_tests.cpp
mv -f tests/.deps/mesos_tests-logging_tests.Tpo tests/.deps/mesos_tests-logging_tests.Po
g++ -DPACKAGE_NAME=\"mesos\" -DPACKAGE_TARNAME=\"mesos\" -DPACKAGE_VERSION=\"0.23.0\" -DPACKAGE_STRING=\"mesos\ 0.23.0\" -DPACKAGE_BUGREPORT=\"\" -DPACKAGE_URL=\"\" -DPACKAGE=\"mesos\" -DVERSION=\"0.23.0\" -DSTDC_HEADERS=1 -DHAVE_SYS_TYPES_H=1 -DHAVE_SYS_STAT_H=1 -DHAVE_STDLIB_H=1 -DHAVE_STRING_H=1 -DHAVE_MEMORY_H=1 -DHAVE_STRINGS_H=1 -DHAVE_INTTYPES_H=1 -DHAVE_STDINT_H=1 -DHAVE_UNISTD_H=1 -DHAVE_DLFCN_H=1 -DLT_OBJDIR=\".libs/\" -DHAVE_PTHREAD_PRIO_INHERIT=1 -DHAVE_PTHREAD=1 -DHAVE_LIBZ=1 -DHAVE_LIBCURL=1 -DHAVE_APR_POOLS_H=1 -DHAVE_LIBAPR_1=1 -DHAVE_SVN_VERSION_H=1 -DHAVE_LIBSVN_SUBR_1=1 -DHAVE_SVN_DELTA_H=1 -DHAVE_LIBSVN_DELTA_1=1 -DHAVE_LIBSASL2=1 -DMESOS_HAS_JAVA=1 -DHAVE_PYTHON=\"2.7\" -DMESOS_HAS_PYTHON=1 -I. -I../../src   -Wall -Werror -DLIBDIR=\"<https://builds.apache.org/job/mesos-reviewbot/ws/mesos-0.23.0/_inst/lib\"> -DPKGLIBEXECDIR=\"<https://builds.apache.org/job/mesos-reviewbot/ws/mesos-0.23.0/_inst/libexec/mesos\"> -DPKGDATADIR=\"<https://builds.apache.org/job/mesos-reviewbot/ws/mesos-0.23.0/_inst/share/mesos\"> -I../../include -I../../3rdparty/libprocess/include -I../../3rdparty/libprocess/3rdparty/stout/include -I../include -I../include/mesos -I../3rdparty/libprocess/3rdparty/boost-1.53.0 -I../3rdparty/libprocess/3rdparty/picojson-4f93734 -I../3rdparty/libprocess/3rdparty/protobuf-2.5.0/src -I../3rdparty/libprocess/3rdparty/glog-0.3.3/src -I../3rdparty/libprocess/3rdparty/glog-0.3.3/src -I../3rdparty/leveldb/include -I../3rdparty/zookeeper-3.4.5/src/c/include -I../3rdparty/zookeeper-3.4.5/src/c/generated  -I../3rdparty/libprocess/3rdparty/protobuf-2.5.0/src -DSOURCE_DIR=\"<https://builds.apache.org/job/mesos-reviewbot/ws/mesos-0.23.0/_build/..\"> -DBUILD_DIR=\"<https://builds.apache.org/job/mesos-reviewbot/ws/mesos-0.23.0/_build\"> -I../3rdparty/libprocess/3rdparty/gmock-1.6.0/gtest/include -I../3rdparty/libprocess/3rdparty/gmock-1.6.0/include -I/home/jenkins/tools/java/jdk1.6.0_20-64/include -I/home/jenkins/tools/java/jdk1.6.0_20-64/include/linux -DZOOKEEPER_VERSION=\"3.4.5\" -I/usr/include/subversion-1 -I/usr/include/apr-1 -I/usr/include/apr-1.0  -pthread -g1 -O0 -Wno-unused-local-typedefs -std=c++11 -MT tests/mesos_tests-main.o -MD -MP -MF tests/.deps/mesos_tests-main.Tpo -c -o tests/mesos_tests-main.o `test -f 'tests/main.cpp' || echo '../../src/'`tests/main.cpp
mv -f tests/.deps/mesos_tests-log_tests.Tpo tests/.deps/mesos_tests-log_tests.Po
g++ -DPACKAGE_NAME=\"mesos\" -DPACKAGE_TARNAME=\"mesos\" -DPACKAGE_VERSION=\"0.23.0\" -DPACKAGE_STRING=\"mesos\ 0.23.0\" -DPACKAGE_BUGREPORT=\"\" -DPACKAGE_URL=\"\" -DPACKAGE=\"mesos\" -DVERSION=\"0.23.0\" -DSTDC_HEADERS=1 -DHAVE_SYS_TYPES_H=1 -DHAVE_SYS_STAT_H=1 -DHAVE_STDLIB_H=1 -DHAVE_STRING_H=1 -DHAVE_MEMORY_H=1 -DHAVE_STRINGS_H=1 -DHAVE_INTTYPES_H=1 -DHAVE_STDINT_H=1 -DHAVE_UNISTD_H=1 -DHAVE_DLFCN_H=1 -DLT_OBJDIR=\".libs/\" -DHAVE_PTHREAD_PRIO_INHERIT=1 -DHAVE_PTHREAD=1 -DHAVE_LIBZ=1 -DHAVE_LIBCURL=1 -DHAVE_APR_POOLS_H=1 -DHAVE_LIBAPR_1=1 -DHAVE_SVN_VERSION_H=1 -DHAVE_LIBSVN_SUBR_1=1 -DHAVE_SVN_DELTA_H=1 -DHAVE_LIBSVN_DELTA_1=1 -DHAVE_LIBSASL2=1 -DMESOS_HAS_JAVA=1 -DHAVE_PYTHON=\"2.7\" -DMESOS_HAS_PYTHON=1 -I. -I../../src   -Wall -Werror -DLIBDIR=\"<https://builds.apache.org/job/mesos-reviewbot/ws/mesos-0.23.0/_inst/lib\"> -DPKGLIBEXECDIR=\"<https://builds.apache.org/job/mesos-reviewbot/ws/mesos-0.23.0/_inst/libexec/mesos\"> -DPKGDATADIR=\"<https://builds.apache.org/job/mesos-reviewbot/ws/mesos-0.23.0/_inst/share/mesos\"> -I../../include -I../../3rdparty/libprocess/include -I../../3rdparty/libprocess/3rdparty/stout/include -I../include -I../include/mesos -I../3rdparty/libprocess/3rdparty/boost-1.53.0 -I../3rdparty/libprocess/3rdparty/picojson-4f93734 -I../3rdparty/libprocess/3rdparty/protobuf-2.5.0/src -I../3rdparty/libprocess/3rdparty/glog-0.3.3/src -I../3rdparty/libprocess/3rdparty/glog-0.3.3/src -I../3rdparty/leveldb/include -I../3rdparty/zookeeper-3.4.5/src/c/include -I../3rdparty/zookeeper-3.4.5/src/c/generated  -I../3rdparty/libprocess/3rdparty/protobuf-2.5.0/src -DSOURCE_DIR=\"<https://builds.apache.org/job/mesos-reviewbot/ws/mesos-0.23.0/_build/..\"> -DBUILD_DIR=\"<https://builds.apache.org/job/mesos-reviewbot/ws/mesos-0.23.0/_build\"> -I../3rdparty/libprocess/3rdparty/gmock-1.6.0/gtest/include -I../3rdparty/libprocess/3rdparty/gmock-1.6.0/include -I/home/jenkins/tools/java/jdk1.6.0_20-64/include -I/home/jenkins/tools/java/jdk1.6.0_20-64/include/linux -DZOOKEEPER_VERSION=\"3.4.5\" -I/usr/include/subversion-1 -I/usr/include/apr-1 -I/usr/include/apr-1.0  -pthread -g1 -O0 -Wno-unused-local-typedefs -std=c++11 -MT tests/mesos_tests-master_allocator_tests.o -MD -MP -MF tests/.deps/mesos_tests-master_allocator_tests.Tpo -c -o tests/mesos_tests-master_allocator_tests.o `test -f 'tests/master_allocator_tests.cpp' || echo '../../src/'`tests/master_allocator_tests.cpp
mv -f tests/.deps/mesos_tests-isolator_tests.Tpo tests/.deps/mesos_tests-isolator_tests.Po
g++ -DPACKAGE_NAME=\"mesos\" -DPACKAGE_TARNAME=\"mesos\" -DPACKAGE_VERSION=\"0.23.0\" -DPACKAGE_STRING=\"mesos\ 0.23.0\" -DPACKAGE_BUGREPORT=\"\" -DPACKAGE_URL=\"\" -DPACKAGE=\"mesos\" -DVERSION=\"0.23.0\" -DSTDC_HEADERS=1 -DHAVE_SYS_TYPES_H=1 -DHAVE_SYS_STAT_H=1 -DHAVE_STDLIB_H=1 -DHAVE_STRING_H=1 -DHAVE_MEMORY_H=1 -DHAVE_STRINGS_H=1 -DHAVE_INTTYPES_H=1 -DHAVE_STDINT_H=1 -DHAVE_UNISTD_H=1 -DHAVE_DLFCN_H=1 -DLT_OBJDIR=\".libs/\" -DHAVE_PTHREAD_PRIO_INHERIT=1 -DHAVE_PTHREAD=1 -DHAVE_LIBZ=1 -DHAVE_LIBCURL=1 -DHAVE_APR_POOLS_H=1 -DHAVE_LIBAPR_1=1 -DHAVE_SVN_VERSION_H=1 -DHAVE_LIBSVN_SUBR_1=1 -DHAVE_SVN_DELTA_H=1 -DHAVE_LIBSVN_DELTA_1=1 -DHAVE_LIBSASL2=1 -DMESOS_HAS_JAVA=1 -DHAVE_PYTHON=\"2.7\" -DMESOS_HAS_PYTHON=1 -I. -I../../src   -Wall -Werror -DLIBDIR=\"<https://builds.apache.org/job/mesos-reviewbot/ws/mesos-0.23.0/_inst/lib\"> -DPKGLIBEXECDIR=\"<https://builds.apache.org/job/mesos-reviewbot/ws/mesos-0.23.0/_inst/libexec/mesos\"> -DPKGDATADIR=\"<https://builds.apache.org/job/mesos-reviewbot/ws/mesos-0.23.0/_inst/share/mesos\"> -I../../include -I../../3rdparty/libprocess/include -I../../3rdparty/libprocess/3rdparty/stout/include -I../include -I../include/mesos -I../3rdparty/libprocess/3rdparty/boost-1.53.0 -I../3rdparty/libprocess/3rdparty/picojson-4f93734 -I../3rdparty/libprocess/3rdparty/protobuf-2.5.0/src -I../3rdparty/libprocess/3rdparty/glog-0.3.3/src -I../3rdparty/libprocess/3rdparty/glog-0.3.3/src -I../3rdparty/leveldb/include -I../3rdparty/zookeeper-3.4.5/src/c/include -I../3rdparty/zookeeper-3.4.5/src/c/generated  -I../3rdparty/libprocess/3rdparty/protobuf-2.5.0/src -DSOURCE_DIR=\"<https://builds.apache.org/job/mesos-reviewbot/ws/mesos-0.23.0/_build/..\"> -DBUILD_DIR=\"<https://builds.apache.org/job/mesos-reviewbot/ws/mesos-0.23.0/_build\"> -I../3rdparty/libprocess/3rdparty/gmock-1.6.0/gtest/include -I../3rdparty/libprocess/3rdparty/gmock-1.6.0/include -I/home/jenkins/tools/java/jdk1.6.0_20-64/include -I/home/jenkins/tools/java/jdk1.6.0_20-64/include/linux -DZOOKEEPER_VERSION=\"3.4.5\" -I/usr/include/subversion-1 -I/usr/include/apr-1 -I/usr/include/apr-1.0  -pthread -g1 -O0 -Wno-unused-local-typedefs -std=c++11 -MT tests/mesos_tests-master_authorization_tests.o -MD -MP -MF tests/.deps/mesos_tests-master_authorization_tests.Tpo -c -o tests/mesos_tests-master_authorization_tests.o `test -f 'tests/master_authorization_tests.cpp' || echo '../../src/'`tests/master_authorization_tests.cpp
mv -f tests/.deps/mesos_tests-main.Tpo tests/.deps/mesos_tests-main.Po
g++ -DPACKAGE_NAME=\"mesos\" -DPACKAGE_TARNAME=\"mesos\" -DPACKAGE_VERSION=\"0.23.0\" -DPACKAGE_STRING=\"mesos\ 0.23.0\" -DPACKAGE_BUGREPORT=\"\" -DPACKAGE_URL=\"\" -DPACKAGE=\"mesos\" -DVERSION=\"0.23.0\" -DSTDC_HEADERS=1 -DHAVE_SYS_TYPES_H=1 -DHAVE_SYS_STAT_H=1 -DHAVE_STDLIB_H=1 -DHAVE_STRING_H=1 -DHAVE_MEMORY_H=1 -DHAVE_STRINGS_H=1 -DHAVE_INTTYPES_H=1 -DHAVE_STDINT_H=1 -DHAVE_UNISTD_H=1 -DHAVE_DLFCN_H=1 -DLT_OBJDIR=\".libs/\" -DHAVE_PTHREAD_PRIO_INHERIT=1 -DHAVE_PTHREAD=1 -DHAVE_LIBZ=1 -DHAVE_LIBCURL=1 -DHAVE_APR_POOLS_H=1 -DHAVE_LIBAPR_1=1 -DHAVE_SVN_VERSION_H=1 -DHAVE_LIBSVN_SUBR_1=1 -DHAVE_SVN_DELTA_H=1 -DHAVE_LIBSVN_DELTA_1=1 -DHAVE_LIBSASL2=1 -DMESOS_HAS_JAVA=1 -DHAVE_PYTHON=\"2.7\" -DMESOS_HAS_PYTHON=1 -I. -I../../src   -Wall -Werror -DLIBDIR=\"<https://builds.apache.org/job/mesos-reviewbot/ws/mesos-0.23.0/_inst/lib\"> -DPKGLIBEXECDIR=\"<https://builds.apache.org/job/mesos-reviewbot/ws/mesos-0.23.0/_inst/libexec/mesos\"> -DPKGDATADIR=\"<https://builds.apache.org/job/mesos-reviewbot/ws/mesos-0.23.0/_inst/share/mesos\"> -I../../include -I../../3rdparty/libprocess/include -I../../3rdparty/libprocess/3rdparty/stout/include -I../include -I../include/mesos -I../3rdparty/libprocess/3rdparty/boost-1.53.0 -I../3rdparty/libprocess/3rdparty/picojson-4f93734 -I../3rdparty/libprocess/3rdparty/protobuf-2.5.0/src -I../3rdparty/libprocess/3rdparty/glog-0.3.3/src -I../3rdparty/libprocess/3rdparty/glog-0.3.3/src -I../3rdparty/leveldb/include -I../3rdparty/zookeeper-3.4.5/src/c/include -I../3rdparty/zookeeper-3.4.5/src/c/generated  -I../3rdparty/libprocess/3rdparty/protobuf-2.5.0/src -DSOURCE_DIR=\"<https://builds.apache.org/job/mesos-reviewbot/ws/mesos-0.23.0/_build/..\"> -DBUILD_DIR=\"<https://builds.apache.org/job/mesos-reviewbot/ws/mesos-0.23.0/_build\"> -I../3rdparty/libprocess/3rdparty/gmock-1.6.0/gtest/include -I../3rdparty/libprocess/3rdparty/gmock-1.6.0/include -I/home/jenkins/tools/java/jdk1.6.0_20-64/include -I/home/jenkins/tools/java/jdk1.6.0_20-64/include/linux -DZOOKEEPER_VERSION=\"3.4.5\" -I/usr/include/subversion-1 -I/usr/include/apr-1 -I/usr/include/apr-1.0  -pthread -g1 -O0 -Wno-unused-local-typedefs -std=c++11 -MT tests/mesos_tests-master_contender_detector_tests.o -MD -MP -MF tests/.deps/mesos_tests-master_contender_detector_tests.Tpo -c -o tests/mesos_tests-master_contender_detector_tests.o `test -f 'tests/master_contender_detector_tests.cpp' || echo '../../src/'`tests/master_contender_detector_tests.cpp
mv -f tests/.deps/mesos_tests-master_authorization_tests.Tpo tests/.deps/mesos_tests-master_authorization_tests.Po
g++ -DPACKAGE_NAME=\"mesos\" -DPACKAGE_TARNAME=\"mesos\" -DPACKAGE_VERSION=\"0.23.0\" -DPACKAGE_STRING=\"mesos\ 0.23.0\" -DPACKAGE_BUGREPORT=\"\" -DPACKAGE_URL=\"\" -DPACKAGE=\"mesos\" -DVERSION=\"0.23.0\" -DSTDC_HEADERS=1 -DHAVE_SYS_TYPES_H=1 -DHAVE_SYS_STAT_H=1 -DHAVE_STDLIB_H=1 -DHAVE_STRING_H=1 -DHAVE_MEMORY_H=1 -DHAVE_STRINGS_H=1 -DHAVE_INTTYPES_H=1 -DHAVE_STDINT_H=1 -DHAVE_UNISTD_H=1 -DHAVE_DLFCN_H=1 -DLT_OBJDIR=\".libs/\" -DHAVE_PTHREAD_PRIO_INHERIT=1 -DHAVE_PTHREAD=1 -DHAVE_LIBZ=1 -DHAVE_LIBCURL=1 -DHAVE_APR_POOLS_H=1 -DHAVE_LIBAPR_1=1 -DHAVE_SVN_VERSION_H=1 -DHAVE_LIBSVN_SUBR_1=1 -DHAVE_SVN_DELTA_H=1 -DHAVE_LIBSVN_DELTA_1=1 -DHAVE_LIBSASL2=1 -DMESOS_HAS_JAVA=1 -DHAVE_PYTHON=\"2.7\" -DMESOS_HAS_PYTHON=1 -I. -I../../src   -Wall -Werror -DLIBDIR=\"<https://builds.apache.org/job/mesos-reviewbot/ws/mesos-0.23.0/_inst/lib\"> -DPKGLIBEXECDIR=\"<https://builds.apache.org/job/mesos-reviewbot/ws/mesos-0.23.0/_inst/libexec/mesos\"> -DPKGDATADIR=\"<https://builds.apache.org/job/mesos-reviewbot/ws/mesos-0.23.0/_inst/share/mesos\"> -I../../include -I../../3rdparty/libprocess/include -I../../3rdparty/libprocess/3rdparty/stout/include -I../include -I../include/mesos -I../3rdparty/libprocess/3rdparty/boost-1.53.0 -I../3rdparty/libprocess/3rdparty/picojson-4f93734 -I../3rdparty/libprocess/3rdparty/protobuf-2.5.0/src -I../3rdparty/libprocess/3rdparty/glog-0.3.3/src -I../3rdparty/libprocess/3rdparty/glog-0.3.3/src -I../3rdparty/leveldb/include -I../3rdparty/zookeeper-3.4.5/src/c/include -I../3rdparty/zookeeper-3.4.5/src/c/generated  -I../3rdparty/libprocess/3rdparty/protobuf-2.5.0/src -DSOURCE_DIR=\"<https://builds.apache.org/job/mesos-reviewbot/ws/mesos-0.23.0/_build/..\"> -DBUILD_DIR=\"<https://builds.apache.org/job/mesos-reviewbot/ws/mesos-0.23.0/_build\"> -I../3rdparty/libprocess/3rdparty/gmock-1.6.0/gtest/include -I../3rdparty/libprocess/3rdparty/gmock-1.6.0/include -I/home/jenkins/tools/java/jdk1.6.0_20-64/include -I/home/jenkins/tools/java/jdk1.6.0_20-64/include/linux -DZOOKEEPER_VERSION=\"3.4.5\" -I/usr/include/subversion-1 -I/usr/include/apr-1 -I/usr/include/apr-1.0  -pthread -g1 -O0 -Wno-unused-local-typedefs -std=c++11 -MT tests/mesos_tests-master_slave_reconciliation_tests.o -MD -MP -MF tests/.deps/mesos_tests-master_slave_reconciliation_tests.Tpo -c -o tests/mesos_tests-master_slave_reconciliation_tests.o `test -f 'tests/master_slave_reconciliation_tests.cpp' || echo '../../src/'`tests/master_slave_reconciliation_tests.cpp
mv -f tests/.deps/mesos_tests-master_contender_detector_tests.Tpo tests/.deps/mesos_tests-master_contender_detector_tests.Po
g++ -DPACKAGE_NAME=\"mesos\" -DPACKAGE_TARNAME=\"mesos\" -DPACKAGE_VERSION=\"0.23.0\" -DPACKAGE_STRING=\"mesos\ 0.23.0\" -DPACKAGE_BUGREPORT=\"\" -DPACKAGE_URL=\"\" -DPACKAGE=\"mesos\" -DVERSION=\"0.23.0\" -DSTDC_HEADERS=1 -DHAVE_SYS_TYPES_H=1 -DHAVE_SYS_STAT_H=1 -DHAVE_STDLIB_H=1 -DHAVE_STRING_H=1 -DHAVE_MEMORY_H=1 -DHAVE_STRINGS_H=1 -DHAVE_INTTYPES_H=1 -DHAVE_STDINT_H=1 -DHAVE_UNISTD_H=1 -DHAVE_DLFCN_H=1 -DLT_OBJDIR=\".libs/\" -DHAVE_PTHREAD_PRIO_INHERIT=1 -DHAVE_PTHREAD=1 -DHAVE_LIBZ=1 -DHAVE_LIBCURL=1 -DHAVE_APR_POOLS_H=1 -DHAVE_LIBAPR_1=1 -DHAVE_SVN_VERSION_H=1 -DHAVE_LIBSVN_SUBR_1=1 -DHAVE_SVN_DELTA_H=1 -DHAVE_LIBSVN_DELTA_1=1 -DHAVE_LIBSASL2=1 -DMESOS_HAS_JAVA=1 -DHAVE_PYTHON=\"2.7\" -DMESOS_HAS_PYTHON=1 -I. -I../../src   -Wall -Werror -DLIBDIR=\"<https://builds.apache.org/job/mesos-reviewbot/ws/mesos-0.23.0/_inst/lib\"> -DPKGLIBEXECDIR=\"<https://builds.apache.org/job/mesos-reviewbot/ws/mesos-0.23.0/_inst/libexec/mesos\"> -DPKGDATADIR=\"<https://builds.apache.org/job/mesos-reviewbot/ws/mesos-0.23.0/_inst/share/mesos\"> -I../../include -I../../3rdparty/libprocess/include -I../../3rdparty/libprocess/3rdparty/stout/include -I../include -I../include/mesos -I../3rdparty/libprocess/3rdparty/boost-1.53.0 -I../3rdparty/libprocess/3rdparty/picojson-4f93734 -I../3rdparty/libprocess/3rdparty/protobuf-2.5.0/src -I../3rdparty/libprocess/3rdparty/glog-0.3.3/src -I../3rdparty/libprocess/3rdparty/glog-0.3.3/src -I../3rdparty/leveldb/include -I../3rdparty/zookeeper-3.4.5/src/c/include -I../3rdparty/zookeeper-3.4.5/src/c/generated  -I../3rdparty/libprocess/3rdparty/protobuf-2.5.0/src -DSOURCE_DIR=\"<https://builds.apache.org/job/mesos-reviewbot/ws/mesos-0.23.0/_build/..\"> -DBUILD_DIR=\"<https://builds.apache.org/job/mesos-reviewbot/ws/mesos-0.23.0/_build\"> -I../3rdparty/libprocess/3rdparty/gmock-1.6.0/gtest/include -I../3rdparty/libprocess/3rdparty/gmock-1.6.0/include -I/home/jenkins/tools/java/jdk1.6.0_20-64/include -I/home/jenkins/tools/java/jdk1.6.0_20-64/include/linux -DZOOKEEPER_VERSION=\"3.4.5\" -I/usr/include/subversion-1 -I/usr/include/apr-1 -I/usr/include/apr-1.0  -pthread -g1 -O0 -Wno-unused-local-typedefs -std=c++11 -MT tests/mesos_tests-master_tests.o -MD -MP -MF tests/.deps/mesos_tests-master_tests.Tpo -c -o tests/mesos_tests-master_tests.o `test -f 'tests/master_tests.cpp' || echo '../../src/'`tests/master_tests.cpp
mv -f tests/.deps/mesos_tests-master_allocator_tests.Tpo tests/.deps/mesos_tests-master_allocator_tests.Po
g++ -DPACKAGE_NAME=\"mesos\" -DPACKAGE_TARNAME=\"mesos\" -DPACKAGE_VERSION=\"0.23.0\" -DPACKAGE_STRING=\"mesos\ 0.23.0\" -DPACKAGE_BUGREPORT=\"\" -DPACKAGE_URL=\"\" -DPACKAGE=\"mesos\" -DVERSION=\"0.23.0\" -DSTDC_HEADERS=1 -DHAVE_SYS_TYPES_H=1 -DHAVE_SYS_STAT_H=1 -DHAVE_STDLIB_H=1 -DHAVE_STRING_H=1 -DHAVE_MEMORY_H=1 -DHAVE_STRINGS_H=1 -DHAVE_INTTYPES_H=1 -DHAVE_STDINT_H=1 -DHAVE_UNISTD_H=1 -DHAVE_DLFCN_H=1 -DLT_OBJDIR=\".libs/\" -DHAVE_PTHREAD_PRIO_INHERIT=1 -DHAVE_PTHREAD=1 -DHAVE_LIBZ=1 -DHAVE_LIBCURL=1 -DHAVE_APR_POOLS_H=1 -DHAVE_LIBAPR_1=1 -DHAVE_SVN_VERSION_H=1 -DHAVE_LIBSVN_SUBR_1=1 -DHAVE_SVN_DELTA_H=1 -DHAVE_LIBSVN_DELTA_1=1 -DHAVE_LIBSASL2=1 -DMESOS_HAS_JAVA=1 -DHAVE_PYTHON=\"2.7\" -DMESOS_HAS_PYTHON=1 -I. -I../../src   -Wall -Werror -DLIBDIR=\"<https://builds.apache.org/job/mesos-reviewbot/ws/mesos-0.23.0/_inst/lib\"> -DPKGLIBEXECDIR=\"<https://builds.apache.org/job/mesos-reviewbot/ws/mesos-0.23.0/_inst/libexec/mesos\"> -DPKGDATADIR=\"<https://builds.apache.org/job/mesos-reviewbot/ws/mesos-0.23.0/_inst/share/mesos\"> -I../../include -I../../3rdparty/libprocess/include -I../../3rdparty/libprocess/3rdparty/stout/include -I../include -I../include/mesos -I../3rdparty/libprocess/3rdparty/boost-1.53.0 -I../3rdparty/libprocess/3rdparty/picojson-4f93734 -I../3rdparty/libprocess/3rdparty/protobuf-2.5.0/src -I../3rdparty/libprocess/3rdparty/glog-0.3.3/src -I../3rdparty/libprocess/3rdparty/glog-0.3.3/src -I../3rdparty/leveldb/include -I../3rdparty/zookeeper-3.4.5/src/c/include -I../3rdparty/zookeeper-3.4.5/src/c/generated  -I../3rdparty/libprocess/3rdparty/protobuf-2.5.0/src -DSOURCE_DIR=\"<https://builds.apache.org/job/mesos-reviewbot/ws/mesos-0.23.0/_build/..\"> -DBUILD_DIR=\"<https://builds.apache.org/job/mesos-reviewbot/ws/mesos-0.23.0/_build\"> -I../3rdparty/libprocess/3rdparty/gmock-1.6.0/gtest/include -I../3rdparty/libprocess/3rdparty/gmock-1.6.0/include -I/home/jenkins/tools/java/jdk1.6.0_20-64/include -I/home/jenkins/tools/java/jdk1.6.0_20-64/include/linux -DZOOKEEPER_VERSION=\"3.4.5\" -I/usr/include/subversion-1 -I/usr/include/apr-1 -I/usr/include/apr-1.0  -pthread -g1 -O0 -Wno-unused-local-typedefs -std=c++11 -MT tests/mesos_tests-master_validation_tests.o -MD -MP -MF tests/.deps/mesos_tests-master_validation_tests.Tpo -c -o tests/mesos_tests-master_validation_tests.o `test -f 'tests/master_validation_tests.cpp' || echo '../../src/'`tests/master_validation_tests.cpp
mv -f tests/.deps/mesos_tests-master_validation_tests.Tpo tests/.deps/mesos_tests-master_validation_tests.Po
g++ -DPACKAGE_NAME=\"mesos\" -DPACKAGE_TARNAME=\"mesos\" -DPACKAGE_VERSION=\"0.23.0\" -DPACKAGE_STRING=\"mesos\ 0.23.0\" -DPACKAGE_BUGREPORT=\"\" -DPACKAGE_URL=\"\" -DPACKAGE=\"mesos\" -DVERSION=\"0.23.0\" -DSTDC_HEADERS=1 -DHAVE_SYS_TYPES_H=1 -DHAVE_SYS_STAT_H=1 -DHAVE_STDLIB_H=1 -DHAVE_STRING_H=1 -DHAVE_MEMORY_H=1 -DHAVE_STRINGS_H=1 -DHAVE_INTTYPES_H=1 -DHAVE_STDINT_H=1 -DHAVE_UNISTD_H=1 -DHAVE_DLFCN_H=1 -DLT_OBJDIR=\".libs/\" -DHAVE_PTHREAD_PRIO_INHERIT=1 -DHAVE_PTHREAD=1 -DHAVE_LIBZ=1 -DHAVE_LIBCURL=1 -DHAVE_APR_POOLS_H=1 -DHAVE_LIBAPR_1=1 -DHAVE_SVN_VERSION_H=1 -DHAVE_LIBSVN_SUBR_1=1 -DHAVE_SVN_DELTA_H=1 -DHAVE_LIBSVN_DELTA_1=1 -DHAVE_LIBSASL2=1 -DMESOS_HAS_JAVA=1 -DHAVE_PYTHON=\"2.7\" -DMESOS_HAS_PYTHON=1 -I. -I../../src   -Wall -Werror -DLIBDIR=\"<https://builds.apache.org/job/mesos-reviewbot/ws/mesos-0.23.0/_inst/lib\"> -DPKGLIBEXECDIR=\"<https://builds.apache.org/job/mesos-reviewbot/ws/mesos-0.23.0/_inst/libexec/mesos\"> -DPKGDATADIR=\"<https://builds.apache.org/job/mesos-reviewbot/ws/mesos-0.23.0/_inst/share/mesos\"> -I../../include -I../../3rdparty/libprocess/include -I../../3rdparty/libprocess/3rdparty/stout/include -I../include -I../include/mesos -I../3rdparty/libprocess/3rdparty/boost-1.53.0 -I../3rdparty/libprocess/3rdparty/picojson-4f93734 -I../3rdparty/libprocess/3rdparty/protobuf-2.5.0/src -I../3rdparty/libprocess/3rdparty/glog-0.3.3/src -I../3rdparty/libprocess/3rdparty/glog-0.3.3/src -I../3rdparty/leveldb/include -I../3rdparty/zookeeper-3.4.5/src/c/include -I../3rdparty/zookeeper-3.4.5/src/c/generated  -I../3rdparty/libprocess/3rdparty/protobuf-2.5.0/src -DSOURCE_DIR=\"<https://builds.apache.org/job/mesos-reviewbot/ws/mesos-0.23.0/_build/..\"> -DBUILD_DIR=\"<https://builds.apache.org/job/mesos-reviewbot/ws/mesos-0.23.0/_build\"> -I../3rdparty/libprocess/3rdparty/gmock-1.6.0/gtest/include -I../3rdparty/libprocess/3rdparty/gmock-1.6.0/include -I/home/jenkins/tools/java/jdk1.6.0_20-64/include -I/home/jenkins/tools/java/jdk1.6.0_20-64/include/linux -DZOOKEEPER_VERSION=\"3.4.5\" -I/usr/include/subversion-1 -I/usr/include/apr-1 -I/usr/include/apr-1.0  -pthread -g1 -O0 -Wno-unused-local-typedefs -std=c++11 -MT tests/mesos_tests-memory_test_helper.o -MD -MP -MF tests/.deps/mesos_tests-memory_test_helper.Tpo -c -o tests/mesos_tests-memory_test_helper.o `test -f 'tests/memory_test_helper.cpp' || echo '../../src/'`tests/memory_test_helper.cpp
mv -f tests/.deps/mesos_tests-master_slave_reconciliation_tests.Tpo tests/.deps/mesos_tests-master_slave_reconciliation_tests.Po
g++ -DPACKAGE_NAME=\"mesos\" -DPACKAGE_TARNAME=\"mesos\" -DPACKAGE_VERSION=\"0.23.0\" -DPACKAGE_STRING=\"mesos\ 0.23.0\" -DPACKAGE_BUGREPORT=\"\" -DPACKAGE_URL=\"\" -DPACKAGE=\"mesos\" -DVERSION=\"0.23.0\" -DSTDC_HEADERS=1 -DHAVE_SYS_TYPES_H=1 -DHAVE_SYS_STAT_H=1 -DHAVE_STDLIB_H=1 -DHAVE_STRING_H=1 -DHAVE_MEMORY_H=1 -DHAVE_STRINGS_H=1 -DHAVE_INTTYPES_H=1 -DHAVE_STDINT_H=1 -DHAVE_UNISTD_H=1 -DHAVE_DLFCN_H=1 -DLT_OBJDIR=\".libs/\" -DHAVE_PTHREAD_PRIO_INHERIT=1 -DHAVE_PTHREAD=1 -DHAVE_LIBZ=1 -DHAVE_LIBCURL=1 -DHAVE_APR_POOLS_H=1 -DHAVE_LIBAPR_1=1 -DHAVE_SVN_VERSION_H=1 -DHAVE_LIBSVN_SUBR_1=1 -DHAVE_SVN_DELTA_H=1 -DHAVE_LIBSVN_DELTA_1=1 -DHAVE_LIBSASL2=1 -DMESOS_HAS_JAVA=1 -DHAVE_PYTHON=\"2.7\" -DMESOS_HAS_PYTHON=1 -I. -I../../src   -Wall -Werror -DLIBDIR=\"<https://builds.apache.org/job/mesos-reviewbot/ws/mesos-0.23.0/_inst/lib\"> -DPKGLIBEXECDIR=\"<https://builds.apache.org/job/mesos-reviewbot/ws/mesos-0.23.0/_inst/libexec/mesos\"> -DPKGDATADIR=\"<https://builds.apache.org/job/mesos-reviewbot/ws/mesos-0.23.0/_inst/share/mesos\"> -I../../include -I../../3rdparty/libprocess/include -I../../3rdparty/libprocess/3rdparty/stout/include -I../include -I../include/mesos -I../3rdparty/libprocess/3rdparty/boost-1.53.0 -I../3rdparty/libprocess/3rdparty/picojson-4f93734 -I../3rdparty/libprocess/3rdparty/protobuf-2.5.0/src -I../3rdparty/libprocess/3rdparty/glog-0.3.3/src -I../3rdparty/libprocess/3rdparty/glog-0.3.3/src -I../3rdparty/leveldb/include -I../3rdparty/zookeeper-3.4.5/src/c/include -I../3rdparty/zookeeper-3.4.5/src/c/generated  -I../3rdparty/libprocess/3rdparty/protobuf-2.5.0/src -DSOURCE_DIR=\"<https://builds.apache.org/job/mesos-reviewbot/ws/mesos-0.23.0/_build/..\"> -DBUILD_DIR=\"<https://builds.apache.org/job/mesos-reviewbot/ws/mesos-0.23.0/_build\"> -I../3rdparty/libprocess/3rdparty/gmock-1.6.0/gtest/include -I../3rdparty/libprocess/3rdparty/gmock-1.6.0/include -I/home/jenkins/tools/java/jdk1.6.0_20-64/include -I/home/jenkins/tools/java/jdk1.6.0_20-64/include/linux -DZOOKEEPER_VERSION=\"3.4.5\" -I/usr/include/subversion-1 -I/usr/include/apr-1 -I/usr/include/apr-1.0  -pthread -g1 -O0 -Wno-unused-local-typedefs -std=c++11 -MT tests/mesos_tests-mesos.o -MD -MP -MF tests/.deps/mesos_tests-mesos.Tpo -c -o tests/mesos_tests-mesos.o `test -f 'tests/mesos.cpp' || echo '../../src/'`tests/mesos.cpp
mv -f tests/.deps/mesos_tests-memory_test_helper.Tpo tests/.deps/mesos_tests-memory_test_helper.Po
g++ -DPACKAGE_NAME=\"mesos\" -DPACKAGE_TARNAME=\"mesos\" -DPACKAGE_VERSION=\"0.23.0\" -DPACKAGE_STRING=\"mesos\ 0.23.0\" -DPACKAGE_BUGREPORT=\"\" -DPACKAGE_URL=\"\" -DPACKAGE=\"mesos\" -DVERSION=\"0.23.0\" -DSTDC_HEADERS=1 -DHAVE_SYS_TYPES_H=1 -DHAVE_SYS_STAT_H=1 -DHAVE_STDLIB_H=1 -DHAVE_STRING_H=1 -DHAVE_MEMORY_H=1 -DHAVE_STRINGS_H=1 -DHAVE_INTTYPES_H=1 -DHAVE_STDINT_H=1 -DHAVE_UNISTD_H=1 -DHAVE_DLFCN_H=1 -DLT_OBJDIR=\".libs/\" -DHAVE_PTHREAD_PRIO_INHERIT=1 -DHAVE_PTHREAD=1 -DHAVE_LIBZ=1 -DHAVE_LIBCURL=1 -DHAVE_APR_POOLS_H=1 -DHAVE_LIBAPR_1=1 -DHAVE_SVN_VERSION_H=1 -DHAVE_LIBSVN_SUBR_1=1 -DHAVE_SVN_DELTA_H=1 -DHAVE_LIBSVN_DELTA_1=1 -DHAVE_LIBSASL2=1 -DMESOS_HAS_JAVA=1 -DHAVE_PYTHON=\"2.7\" -DMESOS_HAS_PYTHON=1 -I. -I../../src   -Wall -Werror -DLIBDIR=\"<https://builds.apache.org/job/mesos-reviewbot/ws/mesos-0.23.0/_inst/lib\"> -DPKGLIBEXECDIR=\"<https://builds.apache.org/job/mesos-reviewbot/ws/mesos-0.23.0/_inst/libexec/mesos\"> -DPKGDATADIR=\"<https://builds.apache.org/job/mesos-reviewbot/ws/mesos-0.23.0/_inst/share/mesos\"> -I../../include -I../../3rdparty/libprocess/include -I../../3rdparty/libprocess/3rdparty/stout/include -I../include -I../include/mesos -I../3rdparty/libprocess/3rdparty/boost-1.53.0 -I../3rdparty/libprocess/3rdparty/picojson-4f93734 -I../3rdparty/libprocess/3rdparty/protobuf-2.5.0/src -I../3rdparty/libprocess/3rdparty/glog-0.3.3/src -I../3rdparty/libprocess/3rdparty/glog-0.3.3/src -I../3rdparty/leveldb/include -I../3rdparty/zookeeper-3.4.5/src/c/include -I../3rdparty/zookeeper-3.4.5/src/c/generated  -I../3rdparty/libprocess/3rdparty/protobuf-2.5.0/src -DSOURCE_DIR=\"<https://builds.apache.org/job/mesos-reviewbot/ws/mesos-0.23.0/_build/..\"> -DBUILD_DIR=\"<https://builds.apache.org/job/mesos-reviewbot/ws/mesos-0.23.0/_build\"> -I../3rdparty/libprocess/3rdparty/gmock-1.6.0/gtest/include -I../3rdparty/libprocess/3rdparty/gmock-1.6.0/include -I/home/jenkins/tools/java/jdk1.6.0_20-64/include -I/home/jenkins/tools/java/jdk1.6.0_20-64/include/linux -DZOOKEEPER_VERSION=\"3.4.5\" -I/usr/include/subversion-1 -I/usr/include/apr-1 -I/usr/include/apr-1.0  -pthread -g1 -O0 -Wno-unused-local-typedefs -std=c++11 -MT tests/mesos_tests-metrics_tests.o -MD -MP -MF tests/.deps/mesos_tests-metrics_tests.Tpo -c -o tests/mesos_tests-metrics_tests.o `test -f 'tests/metrics_tests.cpp' || echo '../../src/'`tests/metrics_tests.cpp
mv -f tests/.deps/mesos_tests-master_tests.Tpo tests/.deps/mesos_tests-master_tests.Po
g++ -DPACKAGE_NAME=\"mesos\" -DPACKAGE_TARNAME=\"mesos\" -DPACKAGE_VERSION=\"0.23.0\" -DPACKAGE_STRING=\"mesos\ 0.23.0\" -DPACKAGE_BUGREPORT=\"\" -DPACKAGE_URL=\"\" -DPACKAGE=\"mesos\" -DVERSION=\"0.23.0\" -DSTDC_HEADERS=1 -DHAVE_SYS_TYPES_H=1 -DHAVE_SYS_STAT_H=1 -DHAVE_STDLIB_H=1 -DHAVE_STRING_H=1 -DHAVE_MEMORY_H=1 -DHAVE_STRINGS_H=1 -DHAVE_INTTYPES_H=1 -DHAVE_STDINT_H=1 -DHAVE_UNISTD_H=1 -DHAVE_DLFCN_H=1 -DLT_OBJDIR=\".libs/\" -DHAVE_PTHREAD_PRIO_INHERIT=1 -DHAVE_PTHREAD=1 -DHAVE_LIBZ=1 -DHAVE_LIBCURL=1 -DHAVE_APR_POOLS_H=1 -DHAVE_LIBAPR_1=1 -DHAVE_SVN_VERSION_H=1 -DHAVE_LIBSVN_SUBR_1=1 -DHAVE_SVN_DELTA_H=1 -DHAVE_LIBSVN_DELTA_1=1 -DHAVE_LIBSASL2=1 -DMESOS_HAS_JAVA=1 -DHAVE_PYTHON=\"2.7\" -DMESOS_HAS_PYTHON=1 -I. -I../../src   -Wall -Werror -DLIBDIR=\"<https://builds.apache.org/job/mesos-reviewbot/ws/mesos-0.23.0/_inst/lib\"> -DPKGLIBEXECDIR=\"<https://builds.apache.org/job/mesos-reviewbot/ws/mesos-0.23.0/_inst/libexec/mesos\"> -DPKGDATADIR=\"<https://builds.apache.org/job/mesos-reviewbot/ws/mesos-0.23.0/_inst/share/mesos\"> -I../../include -I../../3rdparty/libprocess/include -I../../3rdparty/libprocess/3rdparty/stout/include -I../include -I../include/mesos -I../3rdparty/libprocess/3rdparty/boost-1.53.0 -I../3rdparty/libprocess/3rdparty/picojson-4f93734 -I../3rdparty/libprocess/3rdparty/protobuf-2.5.0/src -I../3rdparty/libprocess/3rdparty/glog-0.3.3/src -I../3rdparty/libprocess/3rdparty/glog-0.3.3/src -I../3rdparty/leveldb/include -I../3rdparty/zookeeper-3.4.5/src/c/include -I../3rdparty/zookeeper-3.4.5/src/c/generated  -I../3rdparty/libprocess/3rdparty/protobuf-2.5.0/src -DSOURCE_DIR=\"<https://builds.apache.org/job/mesos-reviewbot/ws/mesos-0.23.0/_build/..\"> -DBUILD_DIR=\"<https://builds.apache.org/job/mesos-reviewbot/ws/mesos-0.23.0/_build\"> -I../3rdparty/libprocess/3rdparty/gmock-1.6.0/gtest/include -I../3rdparty/libprocess/3rdparty/gmock-1.6.0/include -I/home/jenkins/tools/java/jdk1.6.0_20-64/include -I/home/jenkins/tools/java/jdk1.6.0_20-64/include/linux -DZOOKEEPER_VERSION=\"3.4.5\" -I/usr/include/subversion-1 -I/usr/include/apr-1 -I/usr/include/apr-1.0  -pthread -g1 -O0 -Wno-unused-local-typedefs -std=c++11 -MT tests/mesos_tests-module.o -MD -MP -MF tests/.deps/mesos_tests-module.Tpo -c -o tests/mesos_tests-module.o `test -f 'tests/module.cpp' || echo '../../src/'`tests/module.cpp
mv -f tests/.deps/mesos_tests-metrics_tests.Tpo tests/.deps/mesos_tests-metrics_tests.Po
g++ -DPACKAGE_NAME=\"mesos\" -DPACKAGE_TARNAME=\"mesos\" -DPACKAGE_VERSION=\"0.23.0\" -DPACKAGE_STRING=\"mesos\ 0.23.0\" -DPACKAGE_BUGREPORT=\"\" -DPACKAGE_URL=\"\" -DPACKAGE=\"mesos\" -DVERSION=\"0.23.0\" -DSTDC_HEADERS=1 -DHAVE_SYS_TYPES_H=1 -DHAVE_SYS_STAT_H=1 -DHAVE_STDLIB_H=1 -DHAVE_STRING_H=1 -DHAVE_MEMORY_H=1 -DHAVE_STRINGS_H=1 -DHAVE_INTTYPES_H=1 -DHAVE_STDINT_H=1 -DHAVE_UNISTD_H=1 -DHAVE_DLFCN_H=1 -DLT_OBJDIR=\".libs/\" -DHAVE_PTHREAD_PRIO_INHERIT=1 -DHAVE_PTHREAD=1 -DHAVE_LIBZ=1 -DHAVE_LIBCURL=1 -DHAVE_APR_POOLS_H=1 -DHAVE_LIBAPR_1=1 -DHAVE_SVN_VERSION_H=1 -DHAVE_LIBSVN_SUBR_1=1 -DHAVE_SVN_DELTA_H=1 -DHAVE_LIBSVN_DELTA_1=1 -DHAVE_LIBSASL2=1 -DMESOS_HAS_JAVA=1 -DHAVE_PYTHON=\"2.7\" -DMESOS_HAS_PYTHON=1 -I. -I../../src   -Wall -Werror -DLIBDIR=\"<https://builds.apache.org/job/mesos-reviewbot/ws/mesos-0.23.0/_inst/lib\"> -DPKGLIBEXECDIR=\"<https://builds.apache.org/job/mesos-reviewbot/ws/mesos-0.23.0/_inst/libexec/mesos\"> -DPKGDATADIR=\"<https://builds.apache.org/job/mesos-reviewbot/ws/mesos-0.23.0/_inst/share/mesos\"> -I../../include -I../../3rdparty/libprocess/include -I../../3rdparty/libprocess/3rdparty/stout/include -I../include -I../include/mesos -I../3rdparty/libprocess/3rdparty/boost-1.53.0 -I../3rdparty/libprocess/3rdparty/picojson-4f93734 -I../3rdparty/libprocess/3rdparty/protobuf-2.5.0/src -I../3rdparty/libprocess/3rdparty/glog-0.3.3/src -I../3rdparty/libprocess/3rdparty/glog-0.3.3/src -I../3rdparty/leveldb/include -I../3rdparty/zookeeper-3.4.5/src/c/include -I../3rdparty/zookeeper-3.4.5/src/c/generated  -I../3rdparty/libprocess/3rdparty/protobuf-2.5.0/src -DSOURCE_DIR=\"<https://builds.apache.org/job/mesos-reviewbot/ws/mesos-0.23.0/_build/..\"> -DBUILD_DIR=\"<https://builds.apache.org/job/mesos-reviewbot/ws/mesos-0.23.0/_build\"> -I../3rdparty/libprocess/3rdparty/gmock-1.6.0/gtest/include -I../3rdparty/libprocess/3rdparty/gmock-1.6.0/include -I/home/jenkins/tools/java/jdk1.6.0_20-64/include -I/home/jenkins/tools/java/jdk1.6.0_20-64/include/linux -DZOOKEEPER_VERSION=\"3.4.5\" -I/usr/include/subversion-1 -I/usr/include/apr-1 -I/usr/include/apr-1.0  -pthread -g1 -O0 -Wno-unused-local-typedefs -std=c++11 -MT tests/mesos_tests-module_tests.o -MD -MP -MF tests/.deps/mesos_tests-module_tests.Tpo -c -o tests/mesos_tests-module_tests.o `test -f 'tests/module_tests.cpp' || echo '../../src/'`tests/module_tests.cpp
mv -f tests/.deps/mesos_tests-module.Tpo tests/.deps/mesos_tests-module.Po
g++ -DPACKAGE_NAME=\"mesos\" -DPACKAGE_TARNAME=\"mesos\" -DPACKAGE_VERSION=\"0.23.0\" -DPACKAGE_STRING=\"mesos\ 0.23.0\" -DPACKAGE_BUGREPORT=\"\" -DPACKAGE_URL=\"\" -DPACKAGE=\"mesos\" -DVERSION=\"0.23.0\" -DSTDC_HEADERS=1 -DHAVE_SYS_TYPES_H=1 -DHAVE_SYS_STAT_H=1 -DHAVE_STDLIB_H=1 -DHAVE_STRING_H=1 -DHAVE_MEMORY_H=1 -DHAVE_STRINGS_H=1 -DHAVE_INTTYPES_H=1 -DHAVE_STDINT_H=1 -DHAVE_UNISTD_H=1 -DHAVE_DLFCN_H=1 -DLT_OBJDIR=\".libs/\" -DHAVE_PTHREAD_PRIO_INHERIT=1 -DHAVE_PTHREAD=1 -DHAVE_LIBZ=1 -DHAVE_LIBCURL=1 -DHAVE_APR_POOLS_H=1 -DHAVE_LIBAPR_1=1 -DHAVE_SVN_VERSION_H=1 -DHAVE_LIBSVN_SUBR_1=1 -DHAVE_SVN_DELTA_H=1 -DHAVE_LIBSVN_DELTA_1=1 -DHAVE_LIBSASL2=1 -DMESOS_HAS_JAVA=1 -DHAVE_PYTHON=\"2.7\" -DMESOS_HAS_PYTHON=1 -I. -I../../src   -Wall -Werror -DLIBDIR=\"<https://builds.apache.org/job/mesos-reviewbot/ws/mesos-0.23.0/_inst/lib\"> -DPKGLIBEXECDIR=\"<https://builds.apache.org/job/mesos-reviewbot/ws/mesos-0.23.0/_inst/libexec/mesos\"> -DPKGDATADIR=\"<https://builds.apache.org/job/mesos-reviewbot/ws/mesos-0.23.0/_inst/share/mesos\"> -I../../include -I../../3rdparty/libprocess/include -I../../3rdparty/libprocess/3rdparty/stout/include -I../include -I../include/mesos -I../3rdparty/libprocess/3rdparty/boost-1.53.0 -I../3rdparty/libprocess/3rdparty/picojson-4f93734 -I../3rdparty/libprocess/3rdparty/protobuf-2.5.0/src -I../3rdparty/libprocess/3rdparty/glog-0.3.3/src -I../3rdparty/libprocess/3rdparty/glog-0.3.3/src -I../3rdparty/leveldb/include -I../3rdparty/zookeeper-3.4.5/src/c/include -I../3rdparty/zookeeper-3.4.5/src/c/generated  -I../3rdparty/libprocess/3rdparty/protobuf-2.5.0/src -DSOURCE_DIR=\"<https://builds.apache.org/job/mesos-reviewbot/ws/mesos-0.23.0/_build/..\"> -DBUILD_DIR=\"<https://builds.apache.org/job/mesos-reviewbot/ws/mesos-0.23.0/_build\"> -I../3rdparty/libprocess/3rdparty/gmock-1.6.0/gtest/include -I../3rdparty/libprocess/3rdparty/gmock-1.6.0/include -I/home/jenkins/tools/java/jdk1.6.0_20-64/include -I/home/jenkins/tools/java/jdk1.6.0_20-64/include/linux -DZOOKEEPER_VERSION=\"3.4.5\" -I/usr/include/subversion-1 -I/usr/include/apr-1 -I/usr/include/apr-1.0  -pthread -g1 -O0 -Wno-unused-local-typedefs -std=c++11 -MT tests/mesos_tests-monitor_tests.o -MD -MP -MF tests/.deps/mesos_tests-monitor_tests.Tpo -c -o tests/mesos_tests-monitor_tests.o `test -f 'tests/monitor_tests.cpp' || echo '../../src/'`tests/monitor_tests.cpp
mv -f tests/.deps/mesos_tests-mesos.Tpo tests/.deps/mesos_tests-mesos.Po
g++ -DPACKAGE_NAME=\"mesos\" -DPACKAGE_TARNAME=\"mesos\" -DPACKAGE_VERSION=\"0.23.0\" -DPACKAGE_STRING=\"mesos\ 0.23.0\" -DPACKAGE_BUGREPORT=\"\" -DPACKAGE_URL=\"\" -DPACKAGE=\"mesos\" -DVERSION=\"0.23.0\" -DSTDC_HEADERS=1 -DHAVE_SYS_TYPES_H=1 -DHAVE_SYS_STAT_H=1 -DHAVE_STDLIB_H=1 -DHAVE_STRING_H=1 -DHAVE_MEMORY_H=1 -DHAVE_STRINGS_H=1 -DHAVE_INTTYPES_H=1 -DHAVE_STDINT_H=1 -DHAVE_UNISTD_H=1 -DHAVE_DLFCN_H=1 -DLT_OBJDIR=\".libs/\" -DHAVE_PTHREAD_PRIO_INHERIT=1 -DHAVE_PTHREAD=1 -DHAVE_LIBZ=1 -DHAVE_LIBCURL=1 -DHAVE_APR_POOLS_H=1 -DHAVE_LIBAPR_1=1 -DHAVE_SVN_VERSION_H=1 -DHAVE_LIBSVN_SUBR_1=1 -DHAVE_SVN_DELTA_H=1 -DHAVE_LIBSVN_DELTA_1=1 -DHAVE_LIBSASL2=1 -DMESOS_HAS_JAVA=1 -DHAVE_PYTHON=\"2.7\" -DMESOS_HAS_PYTHON=1 -I. -I../../src   -Wall -Werror -DLIBDIR=\"<https://builds.apache.org/job/mesos-reviewbot/ws/mesos-0.23.0/_inst/lib\"> -DPKGLIBEXECDIR=\"<https://builds.apache.org/job/mesos-reviewbot/ws/mesos-0.23.0/_inst/libexec/mesos\"> -DPKGDATADIR=\"<https://builds.apache.org/job/mesos-reviewbot/ws/mesos-0.23.0/_inst/share/mesos\"> -I../../include -I../../3rdparty/libprocess/include -I../../3rdparty/libprocess/3rdparty/stout/include -I../include -I../include/mesos -I../3rdparty/libprocess/3rdparty/boost-1.53.0 -I../3rdparty/libprocess/3rdparty/picojson-4f93734 -I../3rdparty/libprocess/3rdparty/protobuf-2.5.0/src -I../3rdparty/libprocess/3rdparty/glog-0.3.3/src -I../3rdparty/libprocess/3rdparty/glog-0.3.3/src -I../3rdparty/leveldb/include -I../3rdparty/zookeeper-3.4.5/src/c/include -I../3rdparty/zookeeper-3.4.5/src/c/generated  -I../3rdparty/libprocess/3rdparty/protobuf-2.5.0/src -DSOURCE_DIR=\"<https://builds.apache.org/job/mesos-reviewbot/ws/mesos-0.23.0/_build/..\"> -DBUILD_DIR=\"<https://builds.apache.org/job/mesos-reviewbot/ws/mesos-0.23.0/_build\"> -I../3rdparty/libprocess/3rdparty/gmock-1.6.0/gtest/include -I../3rdparty/libprocess/3rdparty/gmock-1.6.0/include -I/home/jenkins/tools/java/jdk1.6.0_20-64/include -I/home/jenkins/tools/java/jdk1.6.0_20-64/include/linux -DZOOKEEPER_VERSION=\"3.4.5\" -I/usr/include/subversion-1 -I/usr/include/apr-1 -I/usr/include/apr-1.0  -pthread -g1 -O0 -Wno-unused-local-typedefs -std=c++11 -MT tests/mesos_tests-oversubscription_tests.o -MD -MP -MF tests/.deps/mesos_tests-oversubscription_tests.Tpo -c -o tests/mesos_tests-oversubscription_tests.o `test -f 'tests/oversubscription_tests.cpp' || echo '../../src/'`tests/oversubscription_tests.cpp
mv -f tests/.deps/mesos_tests-module_tests.Tpo tests/.deps/mesos_tests-module_tests.Po
g++ -DPACKAGE_NAME=\"mesos\" -DPACKAGE_TARNAME=\"mesos\" -DPACKAGE_VERSION=\"0.23.0\" -DPACKAGE_STRING=\"mesos\ 0.23.0\" -DPACKAGE_BUGREPORT=\"\" -DPACKAGE_URL=\"\" -DPACKAGE=\"mesos\" -DVERSION=\"0.23.0\" -DSTDC_HEADERS=1 -DHAVE_SYS_TYPES_H=1 -DHAVE_SYS_STAT_H=1 -DHAVE_STDLIB_H=1 -DHAVE_STRING_H=1 -DHAVE_MEMORY_H=1 -DHAVE_STRINGS_H=1 -DHAVE_INTTYPES_H=1 -DHAVE_STDINT_H=1 -DHAVE_UNISTD_H=1 -DHAVE_DLFCN_H=1 -DLT_OBJDIR=\".libs/\" -DHAVE_PTHREAD_PRIO_INHERIT=1 -DHAVE_PTHREAD=1 -DHAVE_LIBZ=1 -DHAVE_LIBCURL=1 -DHAVE_APR_POOLS_H=1 -DHAVE_LIBAPR_1=1 -DHAVE_SVN_VERSION_H=1 -DHAVE_LIBSVN_SUBR_1=1 -DHAVE_SVN_DELTA_H=1 -DHAVE_LIBSVN_DELTA_1=1 -DHAVE_LIBSASL2=1 -DMESOS_HAS_JAVA=1 -DHAVE_PYTHON=\"2.7\" -DMESOS_HAS_PYTHON=1 -I. -I../../src   -Wall -Werror -DLIBDIR=\"<https://builds.apache.org/job/mesos-reviewbot/ws/mesos-0.23.0/_inst/lib\"> -DPKGLIBEXECDIR=\"<https://builds.apache.org/job/mesos-reviewbot/ws/mesos-0.23.0/_inst/libexec/mesos\"> -DPKGDATADIR=\"<https://builds.apache.org/job/mesos-reviewbot/ws/mesos-0.23.0/_inst/share/mesos\"> -I../../include -I../../3rdparty/libprocess/include -I../../3rdparty/libprocess/3rdparty/stout/include -I../include -I../include/mesos -I../3rdparty/libprocess/3rdparty/boost-1.53.0 -I../3rdparty/libprocess/3rdparty/picojson-4f93734 -I../3rdparty/libprocess/3rdparty/protobuf-2.5.0/src -I../3rdparty/libprocess/3rdparty/glog-0.3.3/src -I../3rdparty/libprocess/3rdparty/glog-0.3.3/src -I../3rdparty/leveldb/include -I../3rdparty/zookeeper-3.4.5/src/c/include -I../3rdparty/zookeeper-3.4.5/src/c/generated  -I../3rdparty/libprocess/3rdparty/protobuf-2.5.0/src -DSOURCE_DIR=\"<https://builds.apache.org/job/mesos-reviewbot/ws/mesos-0.23.0/_build/..\"> -DBUILD_DIR=\"<https://builds.apache.org/job/mesos-reviewbot/ws/mesos-0.23.0/_build\"> -I../3rdparty/libprocess/3rdparty/gmock-1.6.0/gtest/include -I../3rdparty/libprocess/3rdparty/gmock-1.6.0/include -I/home/jenkins/tools/java/jdk1.6.0_20-64/include -I/home/jenkins/tools/java/jdk1.6.0_20-64/include/linux -DZOOKEEPER_VERSION=\"3.4.5\" -I/usr/include/subversion-1 -I/usr/include/apr-1 -I/usr/include/apr-1.0  -pthread -g1 -O0 -Wno-unused-local-typedefs -std=c++11 -MT tests/mesos_tests-partition_tests.o -MD -MP -MF tests/.deps/mesos_tests-partition_tests.Tpo -c -o tests/mesos_tests-partition_tests.o `test -f 'tests/partition_tests.cpp' || echo '../../src/'`tests/partition_tests.cpp
mv -f tests/.deps/mesos_tests-monitor_tests.Tpo tests/.deps/mesos_tests-monitor_tests.Po
g++ -DPACKAGE_NAME=\"mesos\" -DPACKAGE_TARNAME=\"mesos\" -DPACKAGE_VERSION=\"0.23.0\" -DPACKAGE_STRING=\"mesos\ 0.23.0\" -DPACKAGE_BUGREPORT=\"\" -DPACKAGE_URL=\"\" -DPACKAGE=\"mesos\" -DVERSION=\"0.23.0\" -DSTDC_HEADERS=1 -DHAVE_SYS_TYPES_H=1 -DHAVE_SYS_STAT_H=1 -DHAVE_STDLIB_H=1 -DHAVE_STRING_H=1 -DHAVE_MEMORY_H=1 -DHAVE_STRINGS_H=1 -DHAVE_INTTYPES_H=1 -DHAVE_STDINT_H=1 -DHAVE_UNISTD_H=1 -DHAVE_DLFCN_H=1 -DLT_OBJDIR=\".libs/\" -DHAVE_PTHREAD_PRIO_INHERIT=1 -DHAVE_PTHREAD=1 -DHAVE_LIBZ=1 -DHAVE_LIBCURL=1 -DHAVE_APR_POOLS_H=1 -DHAVE_LIBAPR_1=1 -DHAVE_SVN_VERSION_H=1 -DHAVE_LIBSVN_SUBR_1=1 -DHAVE_SVN_DELTA_H=1 -DHAVE_LIBSVN_DELTA_1=1 -DHAVE_LIBSASL2=1 -DMESOS_HAS_JAVA=1 -DHAVE_PYTHON=\"2.7\" -DMESOS_HAS_PYTHON=1 -I. -I../../src   -Wall -Werror -DLIBDIR=\"<https://builds.apache.org/job/mesos-reviewbot/ws/mesos-0.23.0/_inst/lib\"> -DPKGLIBEXECDIR=\"<https://builds.apache.org/job/mesos-reviewbot/ws/mesos-0.23.0/_inst/libexec/mesos\"> -DPKGDATADIR=\"<https://builds.apache.org/job/mesos-reviewbot/ws/mesos-0.23.0/_inst/share/mesos\"> -I../../include -I../../3rdparty/libprocess/include -I../../3rdparty/libprocess/3rdparty/stout/include -I../include -I../include/mesos -I../3rdparty/libprocess/3rdparty/boost-1.53.0 -I../3rdparty/libprocess/3rdparty/picojson-4f93734 -I../3rdparty/libprocess/3rdparty/protobuf-2.5.0/src -I../3rdparty/libprocess/3rdparty/glog-0.3.3/src -I../3rdparty/libprocess/3rdparty/glog-0.3.3/src -I../3rdparty/leveldb/include -I../3rdparty/zookeeper-3.4.5/src/c/include -I../3rdparty/zookeeper-3.4.5/src/c/generated  -I../3rdparty/libprocess/3rdparty/protobuf-2.5.0/src -DSOURCE_DIR=\"<https://builds.apache.org/job/mesos-reviewbot/ws/mesos-0.23.0/_build/..\"> -DBUILD_DIR=\"<https://builds.apache.org/job/mesos-reviewbot/ws/mesos-0.23.0/_build\"> -I../3rdparty/libprocess/3rdparty/gmock-1.6.0/gtest/include -I../3rdparty/libprocess/3rdparty/gmock-1.6.0/include -I/home/jenkins/tools/java/jdk1.6.0_20-64/include -I/home/jenkins/tools/java/jdk1.6.0_20-64/include/linux -DZOOKEEPER_VERSION=\"3.4.5\" -I/usr/include/subversion-1 -I/usr/include/apr-1 -I/usr/include/apr-1.0  -pthread -g1 -O0 -Wno-unused-local-typedefs -std=c++11 -MT tests/mesos_tests-paths_tests.o -MD -MP -MF tests/.deps/mesos_tests-paths_tests.Tpo -c -o tests/mesos_tests-paths_tests.o `test -f 'tests/paths_tests.cpp' || echo '../../src/'`tests/paths_tests.cpp
mv -f tests/.deps/mesos_tests-paths_tests.Tpo tests/.deps/mesos_tests-paths_tests.Po
g++ -DPACKAGE_NAME=\"mesos\" -DPACKAGE_TARNAME=\"mesos\" -DPACKAGE_VERSION=\"0.23.0\" -DPACKAGE_STRING=\"mesos\ 0.23.0\" -DPACKAGE_BUGREPORT=\"\" -DPACKAGE_URL=\"\" -DPACKAGE=\"mesos\" -DVERSION=\"0.23.0\" -DSTDC_HEADERS=1 -DHAVE_SYS_TYPES_H=1 -DHAVE_SYS_STAT_H=1 -DHAVE_STDLIB_H=1 -DHAVE_STRING_H=1 -DHAVE_MEMORY_H=1 -DHAVE_STRINGS_H=1 -DHAVE_INTTYPES_H=1 -DHAVE_STDINT_H=1 -DHAVE_UNISTD_H=1 -DHAVE_DLFCN_H=1 -DLT_OBJDIR=\".libs/\" -DHAVE_PTHREAD_PRIO_INHERIT=1 -DHAVE_PTHREAD=1 -DHAVE_LIBZ=1 -DHAVE_LIBCURL=1 -DHAVE_APR_POOLS_H=1 -DHAVE_LIBAPR_1=1 -DHAVE_SVN_VERSION_H=1 -DHAVE_LIBSVN_SUBR_1=1 -DHAVE_SVN_DELTA_H=1 -DHAVE_LIBSVN_DELTA_1=1 -DHAVE_LIBSASL2=1 -DMESOS_HAS_JAVA=1 -DHAVE_PYTHON=\"2.7\" -DMESOS_HAS_PYTHON=1 -I. -I../../src   -Wall -Werror -DLIBDIR=\"<https://builds.apache.org/job/mesos-reviewbot/ws/mesos-0.23.0/_inst/lib\"> -DPKGLIBEXECDIR=\"<https://builds.apache.org/job/mesos-reviewbot/ws/mesos-0.23.0/_inst/libexec/mesos\"> -DPKGDATADIR=\"<https://builds.apache.org/job/mesos-reviewbot/ws/mesos-0.23.0/_inst/share/mesos\"> -I../../include -I../../3rdparty/libprocess/include -I../../3rdparty/libprocess/3rdparty/stout/include -I../include -I../include/mesos -I../3rdparty/libprocess/3rdparty/boost-1.53.0 -I../3rdparty/libprocess/3rdparty/picojson-4f93734 -I../3rdparty/libprocess/3rdparty/protobuf-2.5.0/src -I../3rdparty/libprocess/3rdparty/glog-0.3.3/src -I../3rdparty/libprocess/3rdparty/glog-0.3.3/src -I../3rdparty/leveldb/include -I../3rdparty/zookeeper-3.4.5/src/c/include -I../3rdparty/zookeeper-3.4.5/src/c/generated  -I../3rdparty/libprocess/3rdparty/protobuf-2.5.0/src -DSOURCE_DIR=\"<https://builds.apache.org/job/mesos-reviewbot/ws/mesos-0.23.0/_build/..\"> -DBUILD_DIR=\"<https://builds.apache.org/job/mesos-reviewbot/ws/mesos-0.23.0/_build\"> -I../3rdparty/libprocess/3rdparty/gmock-1.6.0/gtest/include -I../3rdparty/libprocess/3rdparty/gmock-1.6.0/include -I/home/jenkins/tools/java/jdk1.6.0_20-64/include -I/home/jenkins/tools/java/jdk1.6.0_20-64/include/linux -DZOOKEEPER_VERSION=\"3.4.5\" -I/usr/include/subversion-1 -I/usr/include/apr-1 -I/usr/include/apr-1.0  -pthread -g1 -O0 -Wno-unused-local-typedefs -std=c++11 -MT tests/mesos_tests-persistent_volume_tests.o -MD -MP -MF tests/.deps/mesos_tests-persistent_volume_tests.Tpo -c -o tests/mesos_tests-persistent_volume_tests.o `test -f 'tests/persistent_volume_tests.cpp' || echo '../../src/'`tests/persistent_volume_tests.cpp
mv -f tests/.deps/mesos_tests-oversubscription_tests.Tpo tests/.deps/mesos_tests-oversubscription_tests.Po
g++ -DPACKAGE_NAME=\"mesos\" -DPACKAGE_TARNAME=\"mesos\" -DPACKAGE_VERSION=\"0.23.0\" -DPACKAGE_STRING=\"mesos\ 0.23.0\" -DPACKAGE_BUGREPORT=\"\" -DPACKAGE_URL=\"\" -DPACKAGE=\"mesos\" -DVERSION=\"0.23.0\" -DSTDC_HEADERS=1 -DHAVE_SYS_TYPES_H=1 -DHAVE_SYS_STAT_H=1 -DHAVE_STDLIB_H=1 -DHAVE_STRING_H=1 -DHAVE_MEMORY_H=1 -DHAVE_STRINGS_H=1 -DHAVE_INTTYPES_H=1 -DHAVE_STDINT_H=1 -DHAVE_UNISTD_H=1 -DHAVE_DLFCN_H=1 -DLT_OBJDIR=\".libs/\" -DHAVE_PTHREAD_PRIO_INHERIT=1 -DHAVE_PTHREAD=1 -DHAVE_LIBZ=1 -DHAVE_LIBCURL=1 -DHAVE_APR_POOLS_H=1 -DHAVE_LIBAPR_1=1 -DHAVE_SVN_VERSION_H=1 -DHAVE_LIBSVN_SUBR_1=1 -DHAVE_SVN_DELTA_H=1 -DHAVE_LIBSVN_DELTA_1=1 -DHAVE_LIBSASL2=1 -DMESOS_HAS_JAVA=1 -DHAVE_PYTHON=\"2.7\" -DMESOS_HAS_PYTHON=1 -I. -I../../src   -Wall -Werror -DLIBDIR=\"<https://builds.apache.org/job/mesos-reviewbot/ws/mesos-0.23.0/_inst/lib\"> -DPKGLIBEXECDIR=\"<https://builds.apache.org/job/mesos-reviewbot/ws/mesos-0.23.0/_inst/libexec/mesos\"> -DPKGDATADIR=\"<https://builds.apache.org/job/mesos-reviewbot/ws/mesos-0.23.0/_inst/share/mesos\"> -I../../include -I../../3rdparty/libprocess/include -I../../3rdparty/libprocess/3rdparty/stout/include -I../include -I../include/mesos -I../3rdparty/libprocess/3rdparty/boost-1.53.0 -I../3rdparty/libprocess/3rdparty/picojson-4f93734 -I../3rdparty/libprocess/3rdparty/protobuf-2.5.0/src -I../3rdparty/libprocess/3rdparty/glog-0.3.3/src -I../3rdparty/libprocess/3rdparty/glog-0.3.3/src -I../3rdparty/leveldb/include -I../3rdparty/zookeeper-3.4.5/src/c/include -I../3rdparty/zookeeper-3.4.5/src/c/generated  -I../3rdparty/libprocess/3rdparty/protobuf-2.5.0/src -DSOURCE_DIR=\"<https://builds.apache.org/job/mesos-reviewbot/ws/mesos-0.23.0/_build/..\"> -DBUILD_DIR=\"<https://builds.apache.org/job/mesos-reviewbot/ws/mesos-0.23.0/_build\"> -I../3rdparty/libprocess/3rdparty/gmock-1.6.0/gtest/include -I../3rdparty/libprocess/3rdparty/gmock-1.6.0/include -I/home/jenkins/tools/java/jdk1.6.0_20-64/include -I/home/jenkins/tools/java/jdk1.6.0_20-64/include/linux -DZOOKEEPER_VERSION=\"3.4.5\" -I/usr/include/subversion-1 -I/usr/include/apr-1 -I/usr/include/apr-1.0  -pthread -g1 -O0 -Wno-unused-local-typedefs -std=c++11 -MT tests/mesos_tests-protobuf_io_tests.o -MD -MP -MF tests/.deps/mesos_tests-protobuf_io_tests.Tpo -c -o tests/mesos_tests-protobuf_io_tests.o `test -f 'tests/protobuf_io_tests.cpp' || echo '../../src/'`tests/protobuf_io_tests.cpp
mv -f tests/.deps/mesos_tests-protobuf_io_tests.Tpo tests/.deps/mesos_tests-protobuf_io_tests.Po
g++ -DPACKAGE_NAME=\"mesos\" -DPACKAGE_TARNAME=\"mesos\" -DPACKAGE_VERSION=\"0.23.0\" -DPACKAGE_STRING=\"mesos\ 0.23.0\" -DPACKAGE_BUGREPORT=\"\" -DPACKAGE_URL=\"\" -DPACKAGE=\"mesos\" -DVERSION=\"0.23.0\" -DSTDC_HEADERS=1 -DHAVE_SYS_TYPES_H=1 -DHAVE_SYS_STAT_H=1 -DHAVE_STDLIB_H=1 -DHAVE_STRING_H=1 -DHAVE_MEMORY_H=1 -DHAVE_STRINGS_H=1 -DHAVE_INTTYPES_H=1 -DHAVE_STDINT_H=1 -DHAVE_UNISTD_H=1 -DHAVE_DLFCN_H=1 -DLT_OBJDIR=\".libs/\" -DHAVE_PTHREAD_PRIO_INHERIT=1 -DHAVE_PTHREAD=1 -DHAVE_LIBZ=1 -DHAVE_LIBCURL=1 -DHAVE_APR_POOLS_H=1 -DHAVE_LIBAPR_1=1 -DHAVE_SVN_VERSION_H=1 -DHAVE_LIBSVN_SUBR_1=1 -DHAVE_SVN_DELTA_H=1 -DHAVE_LIBSVN_DELTA_1=1 -DHAVE_LIBSASL2=1 -DMESOS_HAS_JAVA=1 -DHAVE_PYTHON=\"2.7\" -DMESOS_HAS_PYTHON=1 -I. -I../../src   -Wall -Werror -DLIBDIR=\"<https://builds.apache.org/job/mesos-reviewbot/ws/mesos-0.23.0/_inst/lib\"> -DPKGLIBEXECDIR=\"<https://builds.apache.org/job/mesos-reviewbot/ws/mesos-0.23.0/_inst/libexec/mesos\"> -DPKGDATADIR=\"<https://builds.apache.org/job/mesos-reviewbot/ws/mesos-0.23.0/_inst/share/mesos\"> -I../../include -I../../3rdparty/libprocess/include -I../../3rdparty/libprocess/3rdparty/stout/include -I../include -I../include/mesos -I../3rdparty/libprocess/3rdparty/boost-1.53.0 -I../3rdparty/libprocess/3rdparty/picojson-4f93734 -I../3rdparty/libprocess/3rdparty/protobuf-2.5.0/src -I../3rdparty/libprocess/3rdparty/glog-0.3.3/src -I../3rdparty/libprocess/3rdparty/glog-0.3.3/src -I../3rdparty/leveldb/include -I../3rdparty/zookeeper-3.4.5/src/c/include -I../3rdparty/zookeeper-3.4.5/src/c/generated  -I../3rdparty/libprocess/3rdparty/protobuf-2.5.0/src -DSOURCE_DIR=\"<https://builds.apache.org/job/mesos-reviewbot/ws/mesos-0.23.0/_build/..\"> -DBUILD_DIR=\"<https://builds.apache.org/job/mesos-reviewbot/ws/mesos-0.23.0/_build\"> -I../3rdparty/libprocess/3rdparty/gmock-1.6.0/gtest/include -I../3rdparty/libprocess/3rdparty/gmock-1.6.0/include -I/home/jenkins/tools/java/jdk1.6.0_20-64/include -I/home/jenkins/tools/java/jdk1.6.0_20-64/include/linux -DZOOKEEPER_VERSION=\"3.4.5\" -I/usr/include/subversion-1 -I/usr/include/apr-1 -I/usr/include/apr-1.0  -pthread -g1 -O0 -Wno-unused-local-typedefs -std=c++11 -MT tests/mesos_tests-rate_limiting_tests.o -MD -MP -MF tests/.deps/mesos_tests-rate_limiting_tests.Tpo -c -o tests/mesos_tests-rate_limiting_tests.o `test -f 'tests/rate_limiting_tests.cpp' || echo '../../src/'`tests/rate_limiting_tests.cpp
mv -f tests/.deps/mesos_tests-partition_tests.Tpo tests/.deps/mesos_tests-partition_tests.Po
g++ -DPACKAGE_NAME=\"mesos\" -DPACKAGE_TARNAME=\"mesos\" -DPACKAGE_VERSION=\"0.23.0\" -DPACKAGE_STRING=\"mesos\ 0.23.0\" -DPACKAGE_BUGREPORT=\"\" -DPACKAGE_URL=\"\" -DPACKAGE=\"mesos\" -DVERSION=\"0.23.0\" -DSTDC_HEADERS=1 -DHAVE_SYS_TYPES_H=1 -DHAVE_SYS_STAT_H=1 -DHAVE_STDLIB_H=1 -DHAVE_STRING_H=1 -DHAVE_MEMORY_H=1 -DHAVE_STRINGS_H=1 -DHAVE_INTTYPES_H=1 -DHAVE_STDINT_H=1 -DHAVE_UNISTD_H=1 -DHAVE_DLFCN_H=1 -DLT_OBJDIR=\".libs/\" -DHAVE_PTHREAD_PRIO_INHERIT=1 -DHAVE_PTHREAD=1 -DHAVE_LIBZ=1 -DHAVE_LIBCURL=1 -DHAVE_APR_POOLS_H=1 -DHAVE_LIBAPR_1=1 -DHAVE_SVN_VERSION_H=1 -DHAVE_LIBSVN_SUBR_1=1 -DHAVE_SVN_DELTA_H=1 -DHAVE_LIBSVN_DELTA_1=1 -DHAVE_LIBSASL2=1 -DMESOS_HAS_JAVA=1 -DHAVE_PYTHON=\"2.7\" -DMESOS_HAS_PYTHON=1 -I. -I../../src   -Wall -Werror -DLIBDIR=\"<https://builds.apache.org/job/mesos-reviewbot/ws/mesos-0.23.0/_inst/lib\"> -DPKGLIBEXECDIR=\"<https://builds.apache.org/job/mesos-reviewbot/ws/mesos-0.23.0/_inst/libexec/mesos\"> -DPKGDATADIR=\"<https://builds.apache.org/job/mesos-reviewbot/ws/mesos-0.23.0/_inst/share/mesos\"> -I../../include -I../../3rdparty/libprocess/include -I../../3rdparty/libprocess/3rdparty/stout/include -I../include -I../include/mesos -I../3rdparty/libprocess/3rdparty/boost-1.53.0 -I../3rdparty/libprocess/3rdparty/picojson-4f93734 -I../3rdparty/libprocess/3rdparty/protobuf-2.5.0/src -I../3rdparty/libprocess/3rdparty/glog-0.3.3/src -I../3rdparty/libprocess/3rdparty/glog-0.3.3/src -I../3rdparty/leveldb/include -I../3rdparty/zookeeper-3.4.5/src/c/include -I../3rdparty/zookeeper-3.4.5/src/c/generated  -I../3rdparty/libprocess/3rdparty/protobuf-2.5.0/src -DSOURCE_DIR=\"<https://builds.apache.org/job/mesos-reviewbot/ws/mesos-0.23.0/_build/..\"> -DBUILD_DIR=\"<https://builds.apache.org/job/mesos-reviewbot/ws/mesos-0.23.0/_build\"> -I../3rdparty/libprocess/3rdparty/gmock-1.6.0/gtest/include -I../3rdparty/libprocess/3rdparty/gmock-1.6.0/include -I/home/jenkins/tools/java/jdk1.6.0_20-64/include -I/home/jenkins/tools/java/jdk1.6.0_20-64/include/linux -DZOOKEEPER_VERSION=\"3.4.5\" -I/usr/include/subversion-1 -I/usr/include/apr-1 -I/usr/include/apr-1.0  -pthread -g1 -O0 -Wno-unused-local-typedefs -std=c++11 -MT tests/mesos_tests-reconciliation_tests.o -MD -MP -MF tests/.deps/mesos_tests-reconciliation_tests.Tpo -c -o tests/mesos_tests-reconciliation_tests.o `test -f 'tests/reconciliation_tests.cpp' || echo '../../src/'`tests/reconciliation_tests.cpp
mv -f tests/.deps/mesos_tests-persistent_volume_tests.Tpo tests/.deps/mesos_tests-persistent_volume_tests.Po
g++ -DPACKAGE_NAME=\"mesos\" -DPACKAGE_TARNAME=\"mesos\" -DPACKAGE_VERSION=\"0.23.0\" -DPACKAGE_STRING=\"mesos\ 0.23.0\" -DPACKAGE_BUGREPORT=\"\" -DPACKAGE_URL=\"\" -DPACKAGE=\"mesos\" -DVERSION=\"0.23.0\" -DSTDC_HEADERS=1 -DHAVE_SYS_TYPES_H=1 -DHAVE_SYS_STAT_H=1 -DHAVE_STDLIB_H=1 -DHAVE_STRING_H=1 -DHAVE_MEMORY_H=1 -DHAVE_STRINGS_H=1 -DHAVE_INTTYPES_H=1 -DHAVE_STDINT_H=1 -DHAVE_UNISTD_H=1 -DHAVE_DLFCN_H=1 -DLT_OBJDIR=\".libs/\" -DHAVE_PTHREAD_PRIO_INHERIT=1 -DHAVE_PTHREAD=1 -DHAVE_LIBZ=1 -DHAVE_LIBCURL=1 -DHAVE_APR_POOLS_H=1 -DHAVE_LIBAPR_1=1 -DHAVE_SVN_VERSION_H=1 -DHAVE_LIBSVN_SUBR_1=1 -DHAVE_SVN_DELTA_H=1 -DHAVE_LIBSVN_DELTA_1=1 -DHAVE_LIBSASL2=1 -DMESOS_HAS_JAVA=1 -DHAVE_PYTHON=\"2.7\" -DMESOS_HAS_PYTHON=1 -I. -I../../src   -Wall -Werror -DLIBDIR=\"<https://builds.apache.org/job/mesos-reviewbot/ws/mesos-0.23.0/_inst/lib\"> -DPKGLIBEXECDIR=\"<https://builds.apache.org/job/mesos-reviewbot/ws/mesos-0.23.0/_inst/libexec/mesos\"> -DPKGDATADIR=\"<https://builds.apache.org/job/mesos-reviewbot/ws/mesos-0.23.0/_inst/share/mesos\"> -I../../include -I../../3rdparty/libprocess/include -I../../3rdparty/libprocess/3rdparty/stout/include -I../include -I../include/mesos -I../3rdparty/libprocess/3rdparty/boost-1.53.0 -I../3rdparty/libprocess/3rdparty/picojson-4f93734 -I../3rdparty/libprocess/3rdparty/protobuf-2.5.0/src -I../3rdparty/libprocess/3rdparty/glog-0.3.3/src -I../3rdparty/libprocess/3rdparty/glog-0.3.3/src -I../3rdparty/leveldb/include -I../3rdparty/zookeeper-3.4.5/src/c/include -I../3rdparty/zookeeper-3.4.5/src/c/generated  -I../3rdparty/libprocess/3rdparty/protobuf-2.5.0/src -DSOURCE_DIR=\"<https://builds.apache.org/job/mesos-reviewbot/ws/mesos-0.23.0/_build/..\"> -DBUILD_DIR=\"<https://builds.apache.org/job/mesos-reviewbot/ws/mesos-0.23.0/_build\"> -I../3rdparty/libprocess/3rdparty/gmock-1.6.0/gtest/include -I../3rdparty/libprocess/3rdparty/gmock-1.6.0/include -I/home/jenkins/tools/java/jdk1.6.0_20-64/include -I/home/jenkins/tools/java/jdk1.6.0_20-64/include/linux -DZOOKEEPER_VERSION=\"3.4.5\" -I/usr/include/subversion-1 -I/usr/include/apr-1 -I/usr/include/apr-1.0  -pthread -g1 -O0 -Wno-unused-local-typedefs -std=c++11 -MT tests/mesos_tests-registrar_tests.o -MD -MP -MF tests/.deps/mesos_tests-registrar_tests.Tpo -c -o tests/mesos_tests-registrar_tests.o `test -f 'tests/registrar_tests.cpp' || echo '../../src/'`tests/registrar_tests.cpp
mv -f tests/.deps/mesos_tests-rate_limiting_tests.Tpo tests/.deps/mesos_tests-rate_limiting_tests.Po
g++ -DPACKAGE_NAME=\"mesos\" -DPACKAGE_TARNAME=\"mesos\" -DPACKAGE_VERSION=\"0.23.0\" -DPACKAGE_STRING=\"mesos\ 0.23.0\" -DPACKAGE_BUGREPORT=\"\" -DPACKAGE_URL=\"\" -DPACKAGE=\"mesos\" -DVERSION=\"0.23.0\" -DSTDC_HEADERS=1 -DHAVE_SYS_TYPES_H=1 -DHAVE_SYS_STAT_H=1 -DHAVE_STDLIB_H=1 -DHAVE_STRING_H=1 -DHAVE_MEMORY_H=1 -DHAVE_STRINGS_H=1 -DHAVE_INTTYPES_H=1 -DHAVE_STDINT_H=1 -DHAVE_UNISTD_H=1 -DHAVE_DLFCN_H=1 -DLT_OBJDIR=\".libs/\" -DHAVE_PTHREAD_PRIO_INHERIT=1 -DHAVE_PTHREAD=1 -DHAVE_LIBZ=1 -DHAVE_LIBCURL=1 -DHAVE_APR_POOLS_H=1 -DHAVE_LIBAPR_1=1 -DHAVE_SVN_VERSION_H=1 -DHAVE_LIBSVN_SUBR_1=1 -DHAVE_SVN_DELTA_H=1 -DHAVE_LIBSVN_DELTA_1=1 -DHAVE_LIBSASL2=1 -DMESOS_HAS_JAVA=1 -DHAVE_PYTHON=\"2.7\" -DMESOS_HAS_PYTHON=1 -I. -I../../src   -Wall -Werror -DLIBDIR=\"<https://builds.apache.org/job/mesos-reviewbot/ws/mesos-0.23.0/_inst/lib\"> -DPKGLIBEXECDIR=\"<https://builds.apache.org/job/mesos-reviewbot/ws/mesos-0.23.0/_inst/libexec/mesos\"> -DPKGDATADIR=\"<https://builds.apache.org/job/mesos-reviewbot/ws/mesos-0.23.0/_inst/share/mesos\"> -I../../include -I../../3rdparty/libprocess/include -I../../3rdparty/libprocess/3rdparty/stout/include -I../include -I../include/mesos -I../3rdparty/libprocess/3rdparty/boost-1.53.0 -I../3rdparty/libprocess/3rdparty/picojson-4f93734 -I../3rdparty/libprocess/3rdparty/protobuf-2.5.0/src -I../3rdparty/libprocess/3rdparty/glog-0.3.3/src -I../3rdparty/libprocess/3rdparty/glog-0.3.3/src -I../3rdparty/leveldb/include -I../3rdparty/zookeeper-3.4.5/src/c/include -I../3rdparty/zookeeper-3.4.5/src/c/generated  -I../3rdparty/libprocess/3rdparty/protobuf-2.5.0/src -DSOURCE_DIR=\"<https://builds.apache.org/job/mesos-reviewbot/ws/mesos-0.23.0/_build/..\"> -DBUILD_DIR=\"<https://builds.apache.org/job/mesos-reviewbot/ws/mesos-0.23.0/_build\"> -I../3rdparty/libprocess/3rdparty/gmock-1.6.0/gtest/include -I../3rdparty/libprocess/3rdparty/gmock-1.6.0/include -I/home/jenkins/tools/java/jdk1.6.0_20-64/include -I/home/jenkins/tools/java/jdk1.6.0_20-64/include/linux -DZOOKEEPER_VERSION=\"3.4.5\" -I/usr/include/subversion-1 -I/usr/include/apr-1 -I/usr/include/apr-1.0  -pthread -g1 -O0 -Wno-unused-local-typedefs -std=c++11 -MT tests/mesos_tests-repair_tests.o -MD -MP -MF tests/.deps/mesos_tests-repair_tests.Tpo -c -o tests/mesos_tests-repair_tests.o `test -f 'tests/repair_tests.cpp' || echo '../../src/'`tests/repair_tests.cpp
mv -f tests/.deps/mesos_tests-registrar_tests.Tpo tests/.deps/mesos_tests-registrar_tests.Po
g++ -DPACKAGE_NAME=\"mesos\" -DPACKAGE_TARNAME=\"mesos\" -DPACKAGE_VERSION=\"0.23.0\" -DPACKAGE_STRING=\"mesos\ 0.23.0\" -DPACKAGE_BUGREPORT=\"\" -DPACKAGE_URL=\"\" -DPACKAGE=\"mesos\" -DVERSION=\"0.23.0\" -DSTDC_HEADERS=1 -DHAVE_SYS_TYPES_H=1 -DHAVE_SYS_STAT_H=1 -DHAVE_STDLIB_H=1 -DHAVE_STRING_H=1 -DHAVE_MEMORY_H=1 -DHAVE_STRINGS_H=1 -DHAVE_INTTYPES_H=1 -DHAVE_STDINT_H=1 -DHAVE_UNISTD_H=1 -DHAVE_DLFCN_H=1 -DLT_OBJDIR=\".libs/\" -DHAVE_PTHREAD_PRIO_INHERIT=1 -DHAVE_PTHREAD=1 -DHAVE_LIBZ=1 -DHAVE_LIBCURL=1 -DHAVE_APR_POOLS_H=1 -DHAVE_LIBAPR_1=1 -DHAVE_SVN_VERSION_H=1 -DHAVE_LIBSVN_SUBR_1=1 -DHAVE_SVN_DELTA_H=1 -DHAVE_LIBSVN_DELTA_1=1 -DHAVE_LIBSASL2=1 -DMESOS_HAS_JAVA=1 -DHAVE_PYTHON=\"2.7\" -DMESOS_HAS_PYTHON=1 -I. -I../../src   -Wall -Werror -DLIBDIR=\"<https://builds.apache.org/job/mesos-reviewbot/ws/mesos-0.23.0/_inst/lib\"> -DPKGLIBEXECDIR=\"<https://builds.apache.org/job/mesos-reviewbot/ws/mesos-0.23.0/_inst/libexec/mesos\"> -DPKGDATADIR=\"<https://builds.apache.org/job/mesos-reviewbot/ws/mesos-0.23.0/_inst/share/mesos\"> -I../../include -I../../3rdparty/libprocess/include -I../../3rdparty/libprocess/3rdparty/stout/include -I../include -I../include/mesos -I../3rdparty/libprocess/3rdparty/boost-1.53.0 -I../3rdparty/libprocess/3rdparty/picojson-4f93734 -I../3rdparty/libprocess/3rdparty/protobuf-2.5.0/src -I../3rdparty/libprocess/3rdparty/glog-0.3.3/src -I../3rdparty/libprocess/3rdparty/glog-0.3.3/src -I../3rdparty/leveldb/include -I../3rdparty/zookeeper-3.4.5/src/c/include -I../3rdparty/zookeeper-3.4.5/src/c/generated  -I../3rdparty/libprocess/3rdparty/protobuf-2.5.0/src -DSOURCE_DIR=\"<https://builds.apache.org/job/mesos-reviewbot/ws/mesos-0.23.0/_build/..\"> -DBUILD_DIR=\"<https://builds.apache.org/job/mesos-reviewbot/ws/mesos-0.23.0/_build\"> -I../3rdparty/libprocess/3rdparty/gmock-1.6.0/gtest/include -I../3rdparty/libprocess/3rdparty/gmock-1.6.0/include -I/home/jenkins/tools/java/jdk1.6.0_20-64/include -I/home/jenkins/tools/java/jdk1.6.0_20-64/include/linux -DZOOKEEPER_VERSION=\"3.4.5\" -I/usr/include/subversion-1 -I/usr/include/apr-1 -I/usr/include/apr-1.0  -pthread -g1 -O0 -Wno-unused-local-typedefs -std=c++11 -MT tests/mesos_tests-reservation_tests.o -MD -MP -MF tests/.deps/mesos_tests-reservation_tests.Tpo -c -o tests/mesos_tests-reservation_tests.o `test -f 'tests/reservation_tests.cpp' || echo '../../src/'`tests/reservation_tests.cpp
mv -f tests/.deps/mesos_tests-reconciliation_tests.Tpo tests/.deps/mesos_tests-reconciliation_tests.Po
g++ -DPACKAGE_NAME=\"mesos\" -DPACKAGE_TARNAME=\"mesos\" -DPACKAGE_VERSION=\"0.23.0\" -DPACKAGE_STRING=\"mesos\ 0.23.0\" -DPACKAGE_BUGREPORT=\"\" -DPACKAGE_URL=\"\" -DPACKAGE=\"mesos\" -DVERSION=\"0.23.0\" -DSTDC_HEADERS=1 -DHAVE_SYS_TYPES_H=1 -DHAVE_SYS_STAT_H=1 -DHAVE_STDLIB_H=1 -DHAVE_STRING_H=1 -DHAVE_MEMORY_H=1 -DHAVE_STRINGS_H=1 -DHAVE_INTTYPES_H=1 -DHAVE_STDINT_H=1 -DHAVE_UNISTD_H=1 -DHAVE_DLFCN_H=1 -DLT_OBJDIR=\".libs/\" -DHAVE_PTHREAD_PRIO_INHERIT=1 -DHAVE_PTHREAD=1 -DHAVE_LIBZ=1 -DHAVE_LIBCURL=1 -DHAVE_APR_POOLS_H=1 -DHAVE_LIBAPR_1=1 -DHAVE_SVN_VERSION_H=1 -DHAVE_LIBSVN_SUBR_1=1 -DHAVE_SVN_DELTA_H=1 -DHAVE_LIBSVN_DELTA_1=1 -DHAVE_LIBSASL2=1 -DMESOS_HAS_JAVA=1 -DHAVE_PYTHON=\"2.7\" -DMESOS_HAS_PYTHON=1 -I. -I../../src   -Wall -Werror -DLIBDIR=\"<https://builds.apache.org/job/mesos-reviewbot/ws/mesos-0.23.0/_inst/lib\"> -DPKGLIBEXECDIR=\"<https://builds.apache.org/job/mesos-reviewbot/ws/mesos-0.23.0/_inst/libexec/mesos\"> -DPKGDATADIR=\"<https://builds.apache.org/job/mesos-reviewbot/ws/mesos-0.23.0/_inst/share/mesos\"> -I../../include -I../../3rdparty/libprocess/include -I../../3rdparty/libprocess/3rdparty/stout/include -I../include -I../include/mesos -I../3rdparty/libprocess/3rdparty/boost-1.53.0 -I../3rdparty/libprocess/3rdparty/picojson-4f93734 -I../3rdparty/libprocess/3rdparty/protobuf-2.5.0/src -I../3rdparty/libprocess/3rdparty/glog-0.3.3/src -I../3rdparty/libprocess/3rdparty/glog-0.3.3/src -I../3rdparty/leveldb/include -I../3rdparty/zookeeper-3.4.5/src/c/include -I../3rdparty/zookeeper-3.4.5/src/c/generated  -I../3rdparty/libprocess/3rdparty/protobuf-2.5.0/src -DSOURCE_DIR=\"<https://builds.apache.org/job/mesos-reviewbot/ws/mesos-0.23.0/_build/..\"> -DBUILD_DIR=\"<https://builds.apache.org/job/mesos-reviewbot/ws/mesos-0.23.0/_build\"> -I../3rdparty/libprocess/3rdparty/gmock-1.6.0/gtest/include -I../3rdparty/libprocess/3rdparty/gmock-1.6.0/include -I/home/jenkins/tools/java/jdk1.6.0_20-64/include -I/home/jenkins/tools/java/jdk1.6.0_20-64/include/linux -DZOOKEEPER_VERSION=\"3.4.5\" -I/usr/include/subversion-1 -I/usr/include/apr-1 -I/usr/include/apr-1.0  -pthread -g1 -O0 -Wno-unused-local-typedefs -std=c++11 -MT tests/mesos_tests-resource_offers_tests.o -MD -MP -MF tests/.deps/mesos_tests-resource_offers_tests.Tpo -c -o tests/mesos_tests-resource_offers_tests.o `test -f 'tests/resource_offers_tests.cpp' || echo '../../src/'`tests/resource_offers_tests.cpp
mv -f tests/.deps/mesos_tests-repair_tests.Tpo tests/.deps/mesos_tests-repair_tests.Po
g++ -DPACKAGE_NAME=\"mesos\" -DPACKAGE_TARNAME=\"mesos\" -DPACKAGE_VERSION=\"0.23.0\" -DPACKAGE_STRING=\"mesos\ 0.23.0\" -DPACKAGE_BUGREPORT=\"\" -DPACKAGE_URL=\"\" -DPACKAGE=\"mesos\" -DVERSION=\"0.23.0\" -DSTDC_HEADERS=1 -DHAVE_SYS_TYPES_H=1 -DHAVE_SYS_STAT_H=1 -DHAVE_STDLIB_H=1 -DHAVE_STRING_H=1 -DHAVE_MEMORY_H=1 -DHAVE_STRINGS_H=1 -DHAVE_INTTYPES_H=1 -DHAVE_STDINT_H=1 -DHAVE_UNISTD_H=1 -DHAVE_DLFCN_H=1 -DLT_OBJDIR=\".libs/\" -DHAVE_PTHREAD_PRIO_INHERIT=1 -DHAVE_PTHREAD=1 -DHAVE_LIBZ=1 -DHAVE_LIBCURL=1 -DHAVE_APR_POOLS_H=1 -DHAVE_LIBAPR_1=1 -DHAVE_SVN_VERSION_H=1 -DHAVE_LIBSVN_SUBR_1=1 -DHAVE_SVN_DELTA_H=1 -DHAVE_LIBSVN_DELTA_1=1 -DHAVE_LIBSASL2=1 -DMESOS_HAS_JAVA=1 -DHAVE_PYTHON=\"2.7\" -DMESOS_HAS_PYTHON=1 -I. -I../../src   -Wall -Werror -DLIBDIR=\"<https://builds.apache.org/job/mesos-reviewbot/ws/mesos-0.23.0/_inst/lib\"> -DPKGLIBEXECDIR=\"<https://builds.apache.org/job/mesos-reviewbot/ws/mesos-0.23.0/_inst/libexec/mesos\"> -DPKGDATADIR=\"<https://builds.apache.org/job/mesos-reviewbot/ws/mesos-0.23.0/_inst/share/mesos\"> -I../../include -I../../3rdparty/libprocess/include -I../../3rdparty/libprocess/3rdparty/stout/include -I../include -I../include/mesos -I../3rdparty/libprocess/3rdparty/boost-1.53.0 -I../3rdparty/libprocess/3rdparty/picojson-4f93734 -I../3rdparty/libprocess/3rdparty/protobuf-2.5.0/src -I../3rdparty/libprocess/3rdparty/glog-0.3.3/src -I../3rdparty/libprocess/3rdparty/glog-0.3.3/src -I../3rdparty/leveldb/include -I../3rdparty/zookeeper-3.4.5/src/c/include -I../3rdparty/zookeeper-3.4.5/src/c/generated  -I../3rdparty/libprocess/3rdparty/protobuf-2.5.0/src -DSOURCE_DIR=\"<https://builds.apache.org/job/mesos-reviewbot/ws/mesos-0.23.0/_build/..\"> -DBUILD_DIR=\"<https://builds.apache.org/job/mesos-reviewbot/ws/mesos-0.23.0/_build\"> -I../3rdparty/libprocess/3rdparty/gmock-1.6.0/gtest/include -I../3rdparty/libprocess/3rdparty/gmock-1.6.0/include -I/home/jenkins/tools/java/jdk1.6.0_20-64/include -I/home/jenkins/tools/java/jdk1.6.0_20-64/include/linux -DZOOKEEPER_VERSION=\"3.4.5\" -I/usr/include/subversion-1 -I/usr/include/apr-1 -I/usr/include/apr-1.0  -pthread -g1 -O0 -Wno-unused-local-typedefs -std=c++11 -MT tests/mesos_tests-resources_tests.o -MD -MP -MF tests/.deps/mesos_tests-resources_tests.Tpo -c -o tests/mesos_tests-resources_tests.o `test -f 'tests/resources_tests.cpp' || echo '../../src/'`tests/resources_tests.cpp
mv -f tests/.deps/mesos_tests-resources_tests.Tpo tests/.deps/mesos_tests-resources_tests.Po
g++ -DPACKAGE_NAME=\"mesos\" -DPACKAGE_TARNAME=\"mesos\" -DPACKAGE_VERSION=\"0.23.0\" -DPACKAGE_STRING=\"mesos\ 0.23.0\" -DPACKAGE_BUGREPORT=\"\" -DPACKAGE_URL=\"\" -DPACKAGE=\"mesos\" -DVERSION=\"0.23.0\" -DSTDC_HEADERS=1 -DHAVE_SYS_TYPES_H=1 -DHAVE_SYS_STAT_H=1 -DHAVE_STDLIB_H=1 -DHAVE_STRING_H=1 -DHAVE_MEMORY_H=1 -DHAVE_STRINGS_H=1 -DHAVE_INTTYPES_H=1 -DHAVE_STDINT_H=1 -DHAVE_UNISTD_H=1 -DHAVE_DLFCN_H=1 -DLT_OBJDIR=\".libs/\" -DHAVE_PTHREAD_PRIO_INHERIT=1 -DHAVE_PTHREAD=1 -DHAVE_LIBZ=1 -DHAVE_LIBCURL=1 -DHAVE_APR_POOLS_H=1 -DHAVE_LIBAPR_1=1 -DHAVE_SVN_VERSION_H=1 -DHAVE_LIBSVN_SUBR_1=1 -DHAVE_SVN_DELTA_H=1 -DHAVE_LIBSVN_DELTA_1=1 -DHAVE_LIBSASL2=1 -DMESOS_HAS_JAVA=1 -DHAVE_PYTHON=\"2.7\" -DMESOS_HAS_PYTHON=1 -I. -I../../src   -Wall -Werror -DLIBDIR=\"<https://builds.apache.org/job/mesos-reviewbot/ws/mesos-0.23.0/_inst/lib\"> -DPKGLIBEXECDIR=\"<https://builds.apache.org/job/mesos-reviewbot/ws/mesos-0.23.0/_inst/libexec/mesos\"> -DPKGDATADIR=\"<https://builds.apache.org/job/mesos-reviewbot/ws/mesos-0.23.0/_inst/share/mesos\"> -I../../include -I../../3rdparty/libprocess/include -I../../3rdparty/libprocess/3rdparty/stout/include -I../include -I../include/mesos -I../3rdparty/libprocess/3rdparty/boost-1.53.0 -I../3rdparty/libprocess/3rdparty/picojson-4f93734 -I../3rdparty/libprocess/3rdparty/protobuf-2.5.0/src -I../3rdparty/libprocess/3rdparty/glog-0.3.3/src -I../3rdparty/libprocess/3rdparty/glog-0.3.3/src -I../3rdparty/leveldb/include -I../3rdparty/zookeeper-3.4.5/src/c/include -I../3rdparty/zookeeper-3.4.5/src/c/generated  -I../3rdparty/libprocess/3rdparty/protobuf-2.5.0/src -DSOURCE_DIR=\"<https://builds.apache.org/job/mesos-reviewbot/ws/mesos-0.23.0/_build/..\"> -DBUILD_DIR=\"<https://builds.apache.org/job/mesos-reviewbot/ws/mesos-0.23.0/_build\"> -I../3rdparty/libprocess/3rdparty/gmock-1.6.0/gtest/include -I../3rdparty/libprocess/3rdparty/gmock-1.6.0/include -I/home/jenkins/tools/java/jdk1.6.0_20-64/include -I/home/jenkins/tools/java/jdk1.6.0_20-64/include/linux -DZOOKEEPER_VERSION=\"3.4.5\" -I/usr/include/subversion-1 -I/usr/include/apr-1 -I/usr/include/apr-1.0  -pthread -g1 -O0 -Wno-unused-local-typedefs -std=c++11 -MT tests/mesos_tests-scheduler_tests.o -MD -MP -MF tests/.deps/mesos_tests-scheduler_tests.Tpo -c -o tests/mesos_tests-scheduler_tests.o `test -f 'tests/scheduler_tests.cpp' || echo '../../src/'`tests/scheduler_tests.cpp
mv -f tests/.deps/mesos_tests-resource_offers_tests.Tpo tests/.deps/mesos_tests-resource_offers_tests.Po
g++ -DPACKAGE_NAME=\"mesos\" -DPACKAGE_TARNAME=\"mesos\" -DPACKAGE_VERSION=\"0.23.0\" -DPACKAGE_STRING=\"mesos\ 0.23.0\" -DPACKAGE_BUGREPORT=\"\" -DPACKAGE_URL=\"\" -DPACKAGE=\"mesos\" -DVERSION=\"0.23.0\" -DSTDC_HEADERS=1 -DHAVE_SYS_TYPES_H=1 -DHAVE_SYS_STAT_H=1 -DHAVE_STDLIB_H=1 -DHAVE_STRING_H=1 -DHAVE_MEMORY_H=1 -DHAVE_STRINGS_H=1 -DHAVE_INTTYPES_H=1 -DHAVE_STDINT_H=1 -DHAVE_UNISTD_H=1 -DHAVE_DLFCN_H=1 -DLT_OBJDIR=\".libs/\" -DHAVE_PTHREAD_PRIO_INHERIT=1 -DHAVE_PTHREAD=1 -DHAVE_LIBZ=1 -DHAVE_LIBCURL=1 -DHAVE_APR_POOLS_H=1 -DHAVE_LIBAPR_1=1 -DHAVE_SVN_VERSION_H=1 -DHAVE_LIBSVN_SUBR_1=1 -DHAVE_SVN_DELTA_H=1 -DHAVE_LIBSVN_DELTA_1=1 -DHAVE_LIBSASL2=1 -DMESOS_HAS_JAVA=1 -DHAVE_PYTHON=\"2.7\" -DMESOS_HAS_PYTHON=1 -I. -I../../src   -Wall -Werror -DLIBDIR=\"<https://builds.apache.org/job/mesos-reviewbot/ws/mesos-0.23.0/_inst/lib\"> -DPKGLIBEXECDIR=\"<https://builds.apache.org/job/mesos-reviewbot/ws/mesos-0.23.0/_inst/libexec/mesos\"> -DPKGDATADIR=\"<https://builds.apache.org/job/mesos-reviewbot/ws/mesos-0.23.0/_inst/share/mesos\"> -I../../include -I../../3rdparty/libprocess/include -I../../3rdparty/libprocess/3rdparty/stout/include -I../include -I../include/mesos -I../3rdparty/libprocess/3rdparty/boost-1.53.0 -I../3rdparty/libprocess/3rdparty/picojson-4f93734 -I../3rdparty/libprocess/3rdparty/protobuf-2.5.0/src -I../3rdparty/libprocess/3rdparty/glog-0.3.3/src -I../3rdparty/libprocess/3rdparty/glog-0.3.3/src -I../3rdparty/leveldb/include -I../3rdparty/zookeeper-3.4.5/src/c/include -I../3rdparty/zookeeper-3.4.5/src/c/generated  -I../3rdparty/libprocess/3rdparty/protobuf-2.5.0/src -DSOURCE_DIR=\"<https://builds.apache.org/job/mesos-reviewbot/ws/mesos-0.23.0/_build/..\"> -DBUILD_DIR=\"<https://builds.apache.org/job/mesos-reviewbot/ws/mesos-0.23.0/_build\"> -I../3rdparty/libprocess/3rdparty/gmock-1.6.0/gtest/include -I../3rdparty/libprocess/3rdparty/gmock-1.6.0/include -I/home/jenkins/tools/java/jdk1.6.0_20-64/include -I/home/jenkins/tools/java/jdk1.6.0_20-64/include/linux -DZOOKEEPER_VERSION=\"3.4.5\" -I/usr/include/subversion-1 -I/usr/include/apr-1 -I/usr/include/apr-1.0  -pthread -g1 -O0 -Wno-unused-local-typedefs -std=c++11 -MT tests/mesos_tests-script.o -MD -MP -MF tests/.deps/mesos_tests-script.Tpo -c -o tests/mesos_tests-script.o `test -f 'tests/script.cpp' || echo '../../src/'`tests/script.cpp
mv -f tests/.deps/mesos_tests-reservation_tests.Tpo tests/.deps/mesos_tests-reservation_tests.Po
g++ -DPACKAGE_NAME=\"mesos\" -DPACKAGE_TARNAME=\"mesos\" -DPACKAGE_VERSION=\"0.23.0\" -DPACKAGE_STRING=\"mesos\ 0.23.0\" -DPACKAGE_BUGREPORT=\"\" -DPACKAGE_URL=\"\" -DPACKAGE=\"mesos\" -DVERSION=\"0.23.0\" -DSTDC_HEADERS=1 -DHAVE_SYS_TYPES_H=1 -DHAVE_SYS_STAT_H=1 -DHAVE_STDLIB_H=1 -DHAVE_STRING_H=1 -DHAVE_MEMORY_H=1 -DHAVE_STRINGS_H=1 -DHAVE_INTTYPES_H=1 -DHAVE_STDINT_H=1 -DHAVE_UNISTD_H=1 -DHAVE_DLFCN_H=1 -DLT_OBJDIR=\".libs/\" -DHAVE_PTHREAD_PRIO_INHERIT=1 -DHAVE_PTHREAD=1 -DHAVE_LIBZ=1 -DHAVE_LIBCURL=1 -DHAVE_APR_POOLS_H=1 -DHAVE_LIBAPR_1=1 -DHAVE_SVN_VERSION_H=1 -DHAVE_LIBSVN_SUBR_1=1 -DHAVE_SVN_DELTA_H=1 -DHAVE_LIBSVN_DELTA_1=1 -DHAVE_LIBSASL2=1 -DMESOS_HAS_JAVA=1 -DHAVE_PYTHON=\"2.7\" -DMESOS_HAS_PYTHON=1 -I. -I../../src   -Wall -Werror -DLIBDIR=\"<https://builds.apache.org/job/mesos-reviewbot/ws/mesos-0.23.0/_inst/lib\"> -DPKGLIBEXECDIR=\"<https://builds.apache.org/job/mesos-reviewbot/ws/mesos-0.23.0/_inst/libexec/mesos\"> -DPKGDATADIR=\"<https://builds.apache.org/job/mesos-reviewbot/ws/mesos-0.23.0/_inst/share/mesos\"> -I../../include -I../../3rdparty/libprocess/include -I../../3rdparty/libprocess/3rdparty/stout/include -I../include -I../include/mesos -I../3rdparty/libprocess/3rdparty/boost-1.53.0 -I../3rdparty/libprocess/3rdparty/picojson-4f93734 -I../3rdparty/libprocess/3rdparty/protobuf-2.5.0/src -I../3rdparty/libprocess/3rdparty/glog-0.3.3/src -I../3rdparty/libprocess/3rdparty/glog-0.3.3/src -I../3rdparty/leveldb/include -I../3rdparty/zookeeper-3.4.5/src/c/include -I../3rdparty/zookeeper-3.4.5/src/c/generated  -I../3rdparty/libprocess/3rdparty/protobuf-2.5.0/src -DSOURCE_DIR=\"<https://builds.apache.org/job/mesos-reviewbot/ws/mesos-0.23.0/_build/..\"> -DBUILD_DIR=\"<https://builds.apache.org/job/mesos-reviewbot/ws/mesos-0.23.0/_build\"> -I../3rdparty/libprocess/3rdparty/gmock-1.6.0/gtest/include -I../3rdparty/libprocess/3rdparty/gmock-1.6.0/include -I/home/jenkins/tools/java/jdk1.6.0_20-64/include -I/home/jenkins/tools/java/jdk1.6.0_20-64/include/linux -DZOOKEEPER_VERSION=\"3.4.5\" -I/usr/include/subversion-1 -I/usr/include/apr-1 -I/usr/include/apr-1.0  -pthread -g1 -O0 -Wno-unused-local-typedefs -std=c++11 -MT tests/mesos_tests-slave_recovery_tests.o -MD -MP -MF tests/.deps/mesos_tests-slave_recovery_tests.Tpo -c -o tests/mesos_tests-slave_recovery_tests.o `test -f 'tests/slave_recovery_tests.cpp' || echo '../../src/'`tests/slave_recovery_tests.cpp
mv -f tests/.deps/mesos_tests-script.Tpo tests/.deps/mesos_tests-script.Po
g++ -DPACKAGE_NAME=\"mesos\" -DPACKAGE_TARNAME=\"mesos\" -DPACKAGE_VERSION=\"0.23.0\" -DPACKAGE_STRING=\"mesos\ 0.23.0\" -DPACKAGE_BUGREPORT=\"\" -DPACKAGE_URL=\"\" -DPACKAGE=\"mesos\" -DVERSION=\"0.23.0\" -DSTDC_HEADERS=1 -DHAVE_SYS_TYPES_H=1 -DHAVE_SYS_STAT_H=1 -DHAVE_STDLIB_H=1 -DHAVE_STRING_H=1 -DHAVE_MEMORY_H=1 -DHAVE_STRINGS_H=1 -DHAVE_INTTYPES_H=1 -DHAVE_STDINT_H=1 -DHAVE_UNISTD_H=1 -DHAVE_DLFCN_H=1 -DLT_OBJDIR=\".libs/\" -DHAVE_PTHREAD_PRIO_INHERIT=1 -DHAVE_PTHREAD=1 -DHAVE_LIBZ=1 -DHAVE_LIBCURL=1 -DHAVE_APR_POOLS_H=1 -DHAVE_LIBAPR_1=1 -DHAVE_SVN_VERSION_H=1 -DHAVE_LIBSVN_SUBR_1=1 -DHAVE_SVN_DELTA_H=1 -DHAVE_LIBSVN_DELTA_1=1 -DHAVE_LIBSASL2=1 -DMESOS_HAS_JAVA=1 -DHAVE_PYTHON=\"2.7\" -DMESOS_HAS_PYTHON=1 -I. -I../../src   -Wall -Werror -DLIBDIR=\"<https://builds.apache.org/job/mesos-reviewbot/ws/mesos-0.23.0/_inst/lib\"> -DPKGLIBEXECDIR=\"<https://builds.apache.org/job/mesos-reviewbot/ws/mesos-0.23.0/_inst/libexec/mesos\"> -DPKGDATADIR=\"<https://builds.apache.org/job/mesos-reviewbot/ws/mesos-0.23.0/_inst/share/mesos\"> -I../../include -I../../3rdparty/libprocess/include -I../../3rdparty/libprocess/3rdparty/stout/include -I../include -I../include/mesos -I../3rdparty/libprocess/3rdparty/boost-1.53.0 -I../3rdparty/libprocess/3rdparty/picojson-4f93734 -I../3rdparty/libprocess/3rdparty/protobuf-2.5.0/src -I../3rdparty/libprocess/3rdparty/glog-0.3.3/src -I../3rdparty/libprocess/3rdparty/glog-0.3.3/src -I../3rdparty/leveldb/include -I../3rdparty/zookeeper-3.4.5/src/c/include -I../3rdparty/zookeeper-3.4.5/src/c/generated  -I../3rdparty/libprocess/3rdparty/protobuf-2.5.0/src -DSOURCE_DIR=\"<https://builds.apache.org/job/mesos-reviewbot/ws/mesos-0.23.0/_build/..\"> -DBUILD_DIR=\"<https://builds.apache.org/job/mesos-reviewbot/ws/mesos-0.23.0/_build\"> -I../3rdparty/libprocess/3rdparty/gmock-1.6.0/gtest/include -I../3rdparty/libprocess/3rdparty/gmock-1.6.0/include -I/home/jenkins/tools/java/jdk1.6.0_20-64/include -I/home/jenkins/tools/java/jdk1.6.0_20-64/include/linux -DZOOKEEPER_VERSION=\"3.4.5\" -I/usr/include/subversion-1 -I/usr/include/apr-1 -I/usr/include/apr-1.0  -pthread -g1 -O0 -Wno-unused-local-typedefs -std=c++11 -MT tests/mesos_tests-slave_tests.o -MD -MP -MF tests/.deps/mesos_tests-slave_tests.Tpo -c -o tests/mesos_tests-slave_tests.o `test -f 'tests/slave_tests.cpp' || echo '../../src/'`tests/slave_tests.cpp
mv -f tests/.deps/mesos_tests-scheduler_tests.Tpo tests/.deps/mesos_tests-scheduler_tests.Po
g++ -DPACKAGE_NAME=\"mesos\" -DPACKAGE_TARNAME=\"mesos\" -DPACKAGE_VERSION=\"0.23.0\" -DPACKAGE_STRING=\"mesos\ 0.23.0\" -DPACKAGE_BUGREPORT=\"\" -DPACKAGE_URL=\"\" -DPACKAGE=\"mesos\" -DVERSION=\"0.23.0\" -DSTDC_HEADERS=1 -DHAVE_SYS_TYPES_H=1 -DHAVE_SYS_STAT_H=1 -DHAVE_STDLIB_H=1 -DHAVE_STRING_H=1 -DHAVE_MEMORY_H=1 -DHAVE_STRINGS_H=1 -DHAVE_INTTYPES_H=1 -DHAVE_STDINT_H=1 -DHAVE_UNISTD_H=1 -DHAVE_DLFCN_H=1 -DLT_OBJDIR=\".libs/\" -DHAVE_PTHREAD_PRIO_INHERIT=1 -DHAVE_PTHREAD=1 -DHAVE_LIBZ=1 -DHAVE_LIBCURL=1 -DHAVE_APR_POOLS_H=1 -DHAVE_LIBAPR_1=1 -DHAVE_SVN_VERSION_H=1 -DHAVE_LIBSVN_SUBR_1=1 -DHAVE_SVN_DELTA_H=1 -DHAVE_LIBSVN_DELTA_1=1 -DHAVE_LIBSASL2=1 -DMESOS_HAS_JAVA=1 -DHAVE_PYTHON=\"2.7\" -DMESOS_HAS_PYTHON=1 -I. -I../../src   -Wall -Werror -DLIBDIR=\"<https://builds.apache.org/job/mesos-reviewbot/ws/mesos-0.23.0/_inst/lib\"> -DPKGLIBEXECDIR=\"<https://builds.apache.org/job/mesos-reviewbot/ws/mesos-0.23.0/_inst/libexec/mesos\"> -DPKGDATADIR=\"<https://builds.apache.org/job/mesos-reviewbot/ws/mesos-0.23.0/_inst/share/mesos\"> -I../../include -I../../3rdparty/libprocess/include -I../../3rdparty/libprocess/3rdparty/stout/include -I../include -I../include/mesos -I../3rdparty/libprocess/3rdparty/boost-1.53.0 -I../3rdparty/libprocess/3rdparty/picojson-4f93734 -I../3rdparty/libprocess/3rdparty/protobuf-2.5.0/src -I../3rdparty/libprocess/3rdparty/glog-0.3.3/src -I../3rdparty/libprocess/3rdparty/glog-0.3.3/src -I../3rdparty/leveldb/include -I../3rdparty/zookeeper-3.4.5/src/c/include -I../3rdparty/zookeeper-3.4.5/src/c/generated  -I../3rdparty/libprocess/3rdparty/protobuf-2.5.0/src -DSOURCE_DIR=\"<https://builds.apache.org/job/mesos-reviewbot/ws/mesos-0.23.0/_build/..\"> -DBUILD_DIR=\"<https://builds.apache.org/job/mesos-reviewbot/ws/mesos-0.23.0/_build\"> -I../3rdparty/libprocess/3rdparty/gmock-1.6.0/gtest/include -I../3rdparty/libprocess/3rdparty/gmock-1.6.0/include -I/home/jenkins/tools/java/jdk1.6.0_20-64/include -I/home/jenkins/tools/java/jdk1.6.0_20-64/include/linux -DZOOKEEPER_VERSION=\"3.4.5\" -I/usr/include/subversion-1 -I/usr/include/apr-1 -I/usr/include/apr-1.0  -pthread -g1 -O0 -Wno-unused-local-typedefs -std=c++11 -MT tests/mesos_tests-sorter_tests.o -MD -MP -MF tests/.deps/mesos_tests-sorter_tests.Tpo -c -o tests/mesos_tests-sorter_tests.o `test -f 'tests/sorter_tests.cpp' || echo '../../src/'`tests/sorter_tests.cpp
mv -f tests/.deps/mesos_tests-sorter_tests.Tpo tests/.deps/mesos_tests-sorter_tests.Po
g++ -DPACKAGE_NAME=\"mesos\" -DPACKAGE_TARNAME=\"mesos\" -DPACKAGE_VERSION=\"0.23.0\" -DPACKAGE_STRING=\"mesos\ 0.23.0\" -DPACKAGE_BUGREPORT=\"\" -DPACKAGE_URL=\"\" -DPACKAGE=\"mesos\" -DVERSION=\"0.23.0\" -DSTDC_HEADERS=1 -DHAVE_SYS_TYPES_H=1 -DHAVE_SYS_STAT_H=1 -DHAVE_STDLIB_H=1 -DHAVE_STRING_H=1 -DHAVE_MEMORY_H=1 -DHAVE_STRINGS_H=1 -DHAVE_INTTYPES_H=1 -DHAVE_STDINT_H=1 -DHAVE_UNISTD_H=1 -DHAVE_DLFCN_H=1 -DLT_OBJDIR=\".libs/\" -DHAVE_PTHREAD_PRIO_INHERIT=1 -DHAVE_PTHREAD=1 -DHAVE_LIBZ=1 -DHAVE_LIBCURL=1 -DHAVE_APR_POOLS_H=1 -DHAVE_LIBAPR_1=1 -DHAVE_SVN_VERSION_H=1 -DHAVE_LIBSVN_SUBR_1=1 -DHAVE_SVN_DELTA_H=1 -DHAVE_LIBSVN_DELTA_1=1 -DHAVE_LIBSASL2=1 -DMESOS_HAS_JAVA=1 -DHAVE_PYTHON=\"2.7\" -DMESOS_HAS_PYTHON=1 -I. -I../../src   -Wall -Werror -DLIBDIR=\"<https://builds.apache.org/job/mesos-reviewbot/ws/mesos-0.23.0/_inst/lib\"> -DPKGLIBEXECDIR=\"<https://builds.apache.org/job/mesos-reviewbot/ws/mesos-0.23.0/_inst/libexec/mesos\"> -DPKGDATADIR=\"<https://builds.apache.org/job/mesos-reviewbot/ws/mesos-0.23.0/_inst/share/mesos\"> -I../../include -I../../3rdparty/libprocess/include -I../../3rdparty/libprocess/3rdparty/stout/include -I../include -I../include/mesos -I../3rdparty/libprocess/3rdparty/boost-1.53.0 -I../3rdparty/libprocess/3rdparty/picojson-4f93734 -I../3rdparty/libprocess/3rdparty/protobuf-2.5.0/src -I../3rdparty/libprocess/3rdparty/glog-0.3.3/src -I../3rdparty/libprocess/3rdparty/glog-0.3.3/src -I../3rdparty/leveldb/include -I../3rdparty/zookeeper-3.4.5/src/c/include -I../3rdparty/zookeeper-3.4.5/src/c/generated  -I../3rdparty/libprocess/3rdparty/protobuf-2.5.0/src -DSOURCE_DIR=\"<https://builds.apache.org/job/mesos-reviewbot/ws/mesos-0.23.0/_build/..\"> -DBUILD_DIR=\"<https://builds.apache.org/job/mesos-reviewbot/ws/mesos-0.23.0/_build\"> -I../3rdparty/libprocess/3rdparty/gmock-1.6.0/gtest/include -I../3rdparty/libprocess/3rdparty/gmock-1.6.0/include -I/home/jenkins/tools/java/jdk1.6.0_20-64/include -I/home/jenkins/tools/java/jdk1.6.0_20-64/include/linux -DZOOKEEPER_VERSION=\"3.4.5\" -I/usr/include/subversion-1 -I/usr/include/apr-1 -I/usr/include/apr-1.0  -pthread -g1 -O0 -Wno-unused-local-typedefs -std=c++11 -MT tests/mesos_tests-state_tests.o -MD -MP -MF tests/.deps/mesos_tests-state_tests.Tpo -c -o tests/mesos_tests-state_tests.o `test -f 'tests/state_tests.cpp' || echo '../../src/'`tests/state_tests.cpp
mv -f tests/.deps/mesos_tests-slave_recovery_tests.Tpo tests/.deps/mesos_tests-slave_recovery_tests.Po
g++ -DPACKAGE_NAME=\"mesos\" -DPACKAGE_TARNAME=\"mesos\" -DPACKAGE_VERSION=\"0.23.0\" -DPACKAGE_STRING=\"mesos\ 0.23.0\" -DPACKAGE_BUGREPORT=\"\" -DPACKAGE_URL=\"\" -DPACKAGE=\"mesos\" -DVERSION=\"0.23.0\" -DSTDC_HEADERS=1 -DHAVE_SYS_TYPES_H=1 -DHAVE_SYS_STAT_H=1 -DHAVE_STDLIB_H=1 -DHAVE_STRING_H=1 -DHAVE_MEMORY_H=1 -DHAVE_STRINGS_H=1 -DHAVE_INTTYPES_H=1 -DHAVE_STDINT_H=1 -DHAVE_UNISTD_H=1 -DHAVE_DLFCN_H=1 -DLT_OBJDIR=\".libs/\" -DHAVE_PTHREAD_PRIO_INHERIT=1 -DHAVE_PTHREAD=1 -DHAVE_LIBZ=1 -DHAVE_LIBCURL=1 -DHAVE_APR_POOLS_H=1 -DHAVE_LIBAPR_1=1 -DHAVE_SVN_VERSION_H=1 -DHAVE_LIBSVN_SUBR_1=1 -DHAVE_SVN_DELTA_H=1 -DHAVE_LIBSVN_DELTA_1=1 -DHAVE_LIBSASL2=1 -DMESOS_HAS_JAVA=1 -DHAVE_PYTHON=\"2.7\" -DMESOS_HAS_PYTHON=1 -I. -I../../src   -Wall -Werror -DLIBDIR=\"<https://builds.apache.org/job/mesos-reviewbot/ws/mesos-0.23.0/_inst/lib\"> -DPKGLIBEXECDIR=\"<https://builds.apache.org/job/mesos-reviewbot/ws/mesos-0.23.0/_inst/libexec/mesos\"> -DPKGDATADIR=\"<https://builds.apache.org/job/mesos-reviewbot/ws/mesos-0.23.0/_inst/share/mesos\"> -I../../include -I../../3rdparty/libprocess/include -I../../3rdparty/libprocess/3rdparty/stout/include -I../include -I../include/mesos -I../3rdparty/libprocess/3rdparty/boost-1.53.0 -I../3rdparty/libprocess/3rdparty/picojson-4f93734 -I../3rdparty/libprocess/3rdparty/protobuf-2.5.0/src -I../3rdparty/libprocess/3rdparty/glog-0.3.3/src -I../3rdparty/libprocess/3rdparty/glog-0.3.3/src -I../3rdparty/leveldb/include -I../3rdparty/zookeeper-3.4.5/src/c/include -I../3rdparty/zookeeper-3.4.5/src/c/generated  -I../3rdparty/libprocess/3rdparty/protobuf-2.5.0/src -DSOURCE_DIR=\"<https://builds.apache.org/job/mesos-reviewbot/ws/mesos-0.23.0/_build/..\"> -DBUILD_DIR=\"<https://builds.apache.org/job/mesos-reviewbot/ws/mesos-0.23.0/_build\"> -I../3rdparty/libprocess/3rdparty/gmock-1.6.0/gtest/include -I../3rdparty/libprocess/3rdparty/gmock-1.6.0/include -I/home/jenkins/tools/java/jdk1.6.0_20-64/include -I/home/jenkins/tools/java/jdk1.6.0_20-64/include/linux -DZOOKEEPER_VERSION=\"3.4.5\" -I/usr/include/subversion-1 -I/usr/include/apr-1 -I/usr/include/apr-1.0  -pthread -g1 -O0 -Wno-unused-local-typedefs -std=c++11 -MT tests/mesos_tests-status_update_manager_tests.o -MD -MP -MF tests/.deps/mesos_tests-status_update_manager_tests.Tpo -c -o tests/mesos_tests-status_update_manager_tests.o `test -f 'tests/status_update_manager_tests.cpp' || echo '../../src/'`tests/status_update_manager_tests.cpp
mv -f tests/.deps/mesos_tests-slave_tests.Tpo tests/.deps/mesos_tests-slave_tests.Po
g++ -DPACKAGE_NAME=\"mesos\" -DPACKAGE_TARNAME=\"mesos\" -DPACKAGE_VERSION=\"0.23.0\" -DPACKAGE_STRING=\"mesos\ 0.23.0\" -DPACKAGE_BUGREPORT=\"\" -DPACKAGE_URL=\"\" -DPACKAGE=\"mesos\" -DVERSION=\"0.23.0\" -DSTDC_HEADERS=1 -DHAVE_SYS_TYPES_H=1 -DHAVE_SYS_STAT_H=1 -DHAVE_STDLIB_H=1 -DHAVE_STRING_H=1 -DHAVE_MEMORY_H=1 -DHAVE_STRINGS_H=1 -DHAVE_INTTYPES_H=1 -DHAVE_STDINT_H=1 -DHAVE_UNISTD_H=1 -DHAVE_DLFCN_H=1 -DLT_OBJDIR=\".libs/\" -DHAVE_PTHREAD_PRIO_INHERIT=1 -DHAVE_PTHREAD=1 -DHAVE_LIBZ=1 -DHAVE_LIBCURL=1 -DHAVE_APR_POOLS_H=1 -DHAVE_LIBAPR_1=1 -DHAVE_SVN_VERSION_H=1 -DHAVE_LIBSVN_SUBR_1=1 -DHAVE_SVN_DELTA_H=1 -DHAVE_LIBSVN_DELTA_1=1 -DHAVE_LIBSASL2=1 -DMESOS_HAS_JAVA=1 -DHAVE_PYTHON=\"2.7\" -DMESOS_HAS_PYTHON=1 -I. -I../../src   -Wall -Werror -DLIBDIR=\"<https://builds.apache.org/job/mesos-reviewbot/ws/mesos-0.23.0/_inst/lib\"> -DPKGLIBEXECDIR=\"<https://builds.apache.org/job/mesos-reviewbot/ws/mesos-0.23.0/_inst/libexec/mesos\"> -DPKGDATADIR=\"<https://builds.apache.org/job/mesos-reviewbot/ws/mesos-0.23.0/_inst/share/mesos\"> -I../../include -I../../3rdparty/libprocess/include -I../../3rdparty/libprocess/3rdparty/stout/include -I../include -I../include/mesos -I../3rdparty/libprocess/3rdparty/boost-1.53.0 -I../3rdparty/libprocess/3rdparty/picojson-4f93734 -I../3rdparty/libprocess/3rdparty/protobuf-2.5.0/src -I../3rdparty/libprocess/3rdparty/glog-0.3.3/src -I../3rdparty/libprocess/3rdparty/glog-0.3.3/src -I../3rdparty/leveldb/include -I../3rdparty/zookeeper-3.4.5/src/c/include -I../3rdparty/zookeeper-3.4.5/src/c/generated  -I../3rdparty/libprocess/3rdparty/protobuf-2.5.0/src -DSOURCE_DIR=\"<https://builds.apache.org/job/mesos-reviewbot/ws/mesos-0.23.0/_build/..\"> -DBUILD_DIR=\"<https://builds.apache.org/job/mesos-reviewbot/ws/mesos-0.23.0/_build\"> -I../3rdparty/libprocess/3rdparty/gmock-1.6.0/gtest/include -I../3rdparty/libprocess/3rdparty/gmock-1.6.0/include -I/home/jenkins/tools/java/jdk1.6.0_20-64/include -I/home/jenkins/tools/java/jdk1.6.0_20-64/include/linux -DZOOKEEPER_VERSION=\"3.4.5\" -I/usr/include/subversion-1 -I/usr/include/apr-1 -I/usr/include/apr-1.0  -pthread -g1 -O0 -Wno-unused-local-typedefs -std=c++11 -MT tests/mesos_tests-teardown_tests.o -MD -MP -MF tests/.deps/mesos_tests-teardown_tests.Tpo -c -o tests/mesos_tests-teardown_tests.o `test -f 'tests/teardown_tests.cpp' || echo '../../src/'`tests/teardown_tests.cpp
mv -f tests/.deps/mesos_tests-state_tests.Tpo tests/.deps/mesos_tests-state_tests.Po
g++ -DPACKAGE_NAME=\"mesos\" -DPACKAGE_TARNAME=\"mesos\" -DPACKAGE_VERSION=\"0.23.0\" -DPACKAGE_STRING=\"mesos\ 0.23.0\" -DPACKAGE_BUGREPORT=\"\" -DPACKAGE_URL=\"\" -DPACKAGE=\"mesos\" -DVERSION=\"0.23.0\" -DSTDC_HEADERS=1 -DHAVE_SYS_TYPES_H=1 -DHAVE_SYS_STAT_H=1 -DHAVE_STDLIB_H=1 -DHAVE_STRING_H=1 -DHAVE_MEMORY_H=1 -DHAVE_STRINGS_H=1 -DHAVE_INTTYPES_H=1 -DHAVE_STDINT_H=1 -DHAVE_UNISTD_H=1 -DHAVE_DLFCN_H=1 -DLT_OBJDIR=\".libs/\" -DHAVE_PTHREAD_PRIO_INHERIT=1 -DHAVE_PTHREAD=1 -DHAVE_LIBZ=1 -DHAVE_LIBCURL=1 -DHAVE_APR_POOLS_H=1 -DHAVE_LIBAPR_1=1 -DHAVE_SVN_VERSION_H=1 -DHAVE_LIBSVN_SUBR_1=1 -DHAVE_SVN_DELTA_H=1 -DHAVE_LIBSVN_DELTA_1=1 -DHAVE_LIBSASL2=1 -DMESOS_HAS_JAVA=1 -DHAVE_PYTHON=\"2.7\" -DMESOS_HAS_PYTHON=1 -I. -I../../src   -Wall -Werror -DLIBDIR=\"<https://builds.apache.org/job/mesos-reviewbot/ws/mesos-0.23.0/_inst/lib\"> -DPKGLIBEXECDIR=\"<https://builds.apache.org/job/mesos-reviewbot/ws/mesos-0.23.0/_inst/libexec/mesos\"> -DPKGDATADIR=\"<https://builds.apache.org/job/mesos-reviewbot/ws/mesos-0.23.0/_inst/share/mesos\"> -I../../include -I../../3rdparty/libprocess/include -I../../3rdparty/libprocess/3rdparty/stout/include -I../include -I../include/mesos -I../3rdparty/libprocess/3rdparty/boost-1.53.0 -I../3rdparty/libprocess/3rdparty/picojson-4f93734 -I../3rdparty/libprocess/3rdparty/protobuf-2.5.0/src -I../3rdparty/libprocess/3rdparty/glog-0.3.3/src -I../3rdparty/libprocess/3rdparty/glog-0.3.3/src -I../3rdparty/leveldb/include -I../3rdparty/zookeeper-3.4.5/src/c/include -I../3rdparty/zookeeper-3.4.5/src/c/generated  -I../3rdparty/libprocess/3rdparty/protobuf-2.5.0/src -DSOURCE_DIR=\"<https://builds.apache.org/job/mesos-reviewbot/ws/mesos-0.23.0/_build/..\"> -DBUILD_DIR=\"<https://builds.apache.org/job/mesos-reviewbot/ws/mesos-0.23.0/_build\"> -I../3rdparty/libprocess/3rdparty/gmock-1.6.0/gtest/include -I../3rdparty/libprocess/3rdparty/gmock-1.6.0/include -I/home/jenkins/tools/java/jdk1.6.0_20-64/include -I/home/jenkins/tools/java/jdk1.6.0_20-64/include/linux -DZOOKEEPER_VERSION=\"3.4.5\" -I/usr/include/subversion-1 -I/usr/include/apr-1 -I/usr/include/apr-1.0  -pthread -g1 -O0 -Wno-unused-local-typedefs -std=c++11 -MT tests/mesos_tests-utils.o -MD -MP -MF tests/.deps/mesos_tests-utils.Tpo -c -o tests/mesos_tests-utils.o `test -f 'tests/utils.cpp' || echo '../../src/'`tests/utils.cpp
mv -f tests/.deps/mesos_tests-utils.Tpo tests/.deps/mesos_tests-utils.Po
g++ -DPACKAGE_NAME=\"mesos\" -DPACKAGE_TARNAME=\"mesos\" -DPACKAGE_VERSION=\"0.23.0\" -DPACKAGE_STRING=\"mesos\ 0.23.0\" -DPACKAGE_BUGREPORT=\"\" -DPACKAGE_URL=\"\" -DPACKAGE=\"mesos\" -DVERSION=\"0.23.0\" -DSTDC_HEADERS=1 -DHAVE_SYS_TYPES_H=1 -DHAVE_SYS_STAT_H=1 -DHAVE_STDLIB_H=1 -DHAVE_STRING_H=1 -DHAVE_MEMORY_H=1 -DHAVE_STRINGS_H=1 -DHAVE_INTTYPES_H=1 -DHAVE_STDINT_H=1 -DHAVE_UNISTD_H=1 -DHAVE_DLFCN_H=1 -DLT_OBJDIR=\".libs/\" -DHAVE_PTHREAD_PRIO_INHERIT=1 -DHAVE_PTHREAD=1 -DHAVE_LIBZ=1 -DHAVE_LIBCURL=1 -DHAVE_APR_POOLS_H=1 -DHAVE_LIBAPR_1=1 -DHAVE_SVN_VERSION_H=1 -DHAVE_LIBSVN_SUBR_1=1 -DHAVE_SVN_DELTA_H=1 -DHAVE_LIBSVN_DELTA_1=1 -DHAVE_LIBSASL2=1 -DMESOS_HAS_JAVA=1 -DHAVE_PYTHON=\"2.7\" -DMESOS_HAS_PYTHON=1 -I. -I../../src   -Wall -Werror -DLIBDIR=\"<https://builds.apache.org/job/mesos-reviewbot/ws/mesos-0.23.0/_inst/lib\"> -DPKGLIBEXECDIR=\"<https://builds.apache.org/job/mesos-reviewbot/ws/mesos-0.23.0/_inst/libexec/mesos\"> -DPKGDATADIR=\"<https://builds.apache.org/job/mesos-reviewbot/ws/mesos-0.23.0/_inst/share/mesos\"> -I../../include -I../../3rdparty/libprocess/include -I../../3rdparty/libprocess/3rdparty/stout/include -I../include -I../include/mesos -I../3rdparty/libprocess/3rdparty/boost-1.53.0 -I../3rdparty/libprocess/3rdparty/picojson-4f93734 -I../3rdparty/libprocess/3rdparty/protobuf-2.5.0/src -I../3rdparty/libprocess/3rdparty/glog-0.3.3/src -I../3rdparty/libprocess/3rdparty/glog-0.3.3/src -I../3rdparty/leveldb/include -I../3rdparty/zookeeper-3.4.5/src/c/include -I../3rdparty/zookeeper-3.4.5/src/c/generated  -I../3rdparty/libprocess/3rdparty/protobuf-2.5.0/src -DSOURCE_DIR=\"<https://builds.apache.org/job/mesos-reviewbot/ws/mesos-0.23.0/_build/..\"> -DBUILD_DIR=\"<https://builds.apache.org/job/mesos-reviewbot/ws/mesos-0.23.0/_build\"> -I../3rdparty/libprocess/3rdparty/gmock-1.6.0/gtest/include -I../3rdparty/libprocess/3rdparty/gmock-1.6.0/include -I/home/jenkins/tools/java/jdk1.6.0_20-64/include -I/home/jenkins/tools/java/jdk1.6.0_20-64/include/linux -DZOOKEEPER_VERSION=\"3.4.5\" -I/usr/include/subversion-1 -I/usr/include/apr-1 -I/usr/include/apr-1.0  -pthread -g1 -O0 -Wno-unused-local-typedefs -std=c++11 -MT tests/mesos_tests-values_tests.o -MD -MP -MF tests/.deps/mesos_tests-values_tests.Tpo -c -o tests/mesos_tests-values_tests.o `test -f 'tests/values_tests.cpp' || echo '../../src/'`tests/values_tests.cpp
mv -f tests/.deps/mesos_tests-status_update_manager_tests.Tpo tests/.deps/mesos_tests-status_update_manager_tests.Po
g++ -DPACKAGE_NAME=\"mesos\" -DPACKAGE_TARNAME=\"mesos\" -DPACKAGE_VERSION=\"0.23.0\" -DPACKAGE_STRING=\"mesos\ 0.23.0\" -DPACKAGE_BUGREPORT=\"\" -DPACKAGE_URL=\"\" -DPACKAGE=\"mesos\" -DVERSION=\"0.23.0\" -DSTDC_HEADERS=1 -DHAVE_SYS_TYPES_H=1 -DHAVE_SYS_STAT_H=1 -DHAVE_STDLIB_H=1 -DHAVE_STRING_H=1 -DHAVE_MEMORY_H=1 -DHAVE_STRINGS_H=1 -DHAVE_INTTYPES_H=1 -DHAVE_STDINT_H=1 -DHAVE_UNISTD_H=1 -DHAVE_DLFCN_H=1 -DLT_OBJDIR=\".libs/\" -DHAVE_PTHREAD_PRIO_INHERIT=1 -DHAVE_PTHREAD=1 -DHAVE_LIBZ=1 -DHAVE_LIBCURL=1 -DHAVE_APR_POOLS_H=1 -DHAVE_LIBAPR_1=1 -DHAVE_SVN_VERSION_H=1 -DHAVE_LIBSVN_SUBR_1=1 -DHAVE_SVN_DELTA_H=1 -DHAVE_LIBSVN_DELTA_1=1 -DHAVE_LIBSASL2=1 -DMESOS_HAS_JAVA=1 -DHAVE_PYTHON=\"2.7\" -DMESOS_HAS_PYTHON=1 -I. -I../../src   -Wall -Werror -DLIBDIR=\"<https://builds.apache.org/job/mesos-reviewbot/ws/mesos-0.23.0/_inst/lib\"> -DPKGLIBEXECDIR=\"<https://builds.apache.org/job/mesos-reviewbot/ws/mesos-0.23.0/_inst/libexec/mesos\"> -DPKGDATADIR=\"<https://builds.apache.org/job/mesos-reviewbot/ws/mesos-0.23.0/_inst/share/mesos\"> -I../../include -I../../3rdparty/libprocess/include -I../../3rdparty/libprocess/3rdparty/stout/include -I../include -I../include/mesos -I../3rdparty/libprocess/3rdparty/boost-1.53.0 -I../3rdparty/libprocess/3rdparty/picojson-4f93734 -I../3rdparty/libprocess/3rdparty/protobuf-2.5.0/src -I../3rdparty/libprocess/3rdparty/glog-0.3.3/src -I../3rdparty/libprocess/3rdparty/glog-0.3.3/src -I../3rdparty/leveldb/include -I../3rdparty/zookeeper-3.4.5/src/c/include -I../3rdparty/zookeeper-3.4.5/src/c/generated  -I../3rdparty/libprocess/3rdparty/protobuf-2.5.0/src -DSOURCE_DIR=\"<https://builds.apache.org/job/mesos-reviewbot/ws/mesos-0.23.0/_build/..\"> -DBUILD_DIR=\"<https://builds.apache.org/job/mesos-reviewbot/ws/mesos-0.23.0/_build\"> -I../3rdparty/libprocess/3rdparty/gmock-1.6.0/gtest/include -I../3rdparty/libprocess/3rdparty/gmock-1.6.0/include -I/home/jenkins/tools/java/jdk1.6.0_20-64/include -I/home/jenkins/tools/java/jdk1.6.0_20-64/include/linux -DZOOKEEPER_VERSION=\"3.4.5\" -I/usr/include/subversion-1 -I/usr/include/apr-1 -I/usr/include/apr-1.0  -pthread -g1 -O0 -Wno-unused-local-typedefs -std=c++11 -MT tests/mesos_tests-zookeeper_url_tests.o -MD -MP -MF tests/.deps/mesos_tests-zookeeper_url_tests.Tpo -c -o tests/mesos_tests-zookeeper_url_tests.o `test -f 'tests/zookeeper_url_tests.cpp' || echo '../../src/'`tests/zookeeper_url_tests.cpp
mv -f tests/.deps/mesos_tests-teardown_tests.Tpo tests/.deps/mesos_tests-teardown_tests.Po
g++ -DPACKAGE_NAME=\"mesos\" -DPACKAGE_TARNAME=\"mesos\" -DPACKAGE_VERSION=\"0.23.0\" -DPACKAGE_STRING=\"mesos\ 0.23.0\" -DPACKAGE_BUGREPORT=\"\" -DPACKAGE_URL=\"\" -DPACKAGE=\"mesos\" -DVERSION=\"0.23.0\" -DSTDC_HEADERS=1 -DHAVE_SYS_TYPES_H=1 -DHAVE_SYS_STAT_H=1 -DHAVE_STDLIB_H=1 -DHAVE_STRING_H=1 -DHAVE_MEMORY_H=1 -DHAVE_STRINGS_H=1 -DHAVE_INTTYPES_H=1 -DHAVE_STDINT_H=1 -DHAVE_UNISTD_H=1 -DHAVE_DLFCN_H=1 -DLT_OBJDIR=\".libs/\" -DHAVE_PTHREAD_PRIO_INHERIT=1 -DHAVE_PTHREAD=1 -DHAVE_LIBZ=1 -DHAVE_LIBCURL=1 -DHAVE_APR_POOLS_H=1 -DHAVE_LIBAPR_1=1 -DHAVE_SVN_VERSION_H=1 -DHAVE_LIBSVN_SUBR_1=1 -DHAVE_SVN_DELTA_H=1 -DHAVE_LIBSVN_DELTA_1=1 -DHAVE_LIBSASL2=1 -DMESOS_HAS_JAVA=1 -DHAVE_PYTHON=\"2.7\" -DMESOS_HAS_PYTHON=1 -I. -I../../src   -Wall -Werror -DLIBDIR=\"<https://builds.apache.org/job/mesos-reviewbot/ws/mesos-0.23.0/_inst/lib\"> -DPKGLIBEXECDIR=\"<https://builds.apache.org/job/mesos-reviewbot/ws/mesos-0.23.0/_inst/libexec/mesos\"> -DPKGDATADIR=\"<https://builds.apache.org/job/mesos-reviewbot/ws/mesos-0.23.0/_inst/share/mesos\"> -I../../include -I../../3rdparty/libprocess/include -I../../3rdparty/libprocess/3rdparty/stout/include -I../include -I../include/mesos -I../3rdparty/libprocess/3rdparty/boost-1.53.0 -I../3rdparty/libprocess/3rdparty/picojson-4f93734 -I../3rdparty/libprocess/3rdparty/protobuf-2.5.0/src -I../3rdparty/libprocess/3rdparty/glog-0.3.3/src -I../3rdparty/libprocess/3rdparty/glog-0.3.3/src -I../3rdparty/leveldb/include -I../3rdparty/zookeeper-3.4.5/src/c/include -I../3rdparty/zookeeper-3.4.5/src/c/generated  -I../3rdparty/libprocess/3rdparty/protobuf-2.5.0/src -DSOURCE_DIR=\"<https://builds.apache.org/job/mesos-reviewbot/ws/mesos-0.23.0/_build/..\"> -DBUILD_DIR=\"<https://builds.apache.org/job/mesos-reviewbot/ws/mesos-0.23.0/_build\"> -I../3rdparty/libprocess/3rdparty/gmock-1.6.0/gtest/include -I../3rdparty/libprocess/3rdparty/gmock-1.6.0/include -I/home/jenkins/tools/java/jdk1.6.0_20-64/include -I/home/jenkins/tools/java/jdk1.6.0_20-64/include/linux -DZOOKEEPER_VERSION=\"3.4.5\" -I/usr/include/subversion-1 -I/usr/include/apr-1 -I/usr/include/apr-1.0  -pthread -g1 -O0 -Wno-unused-local-typedefs -std=c++11 -MT tests/mesos_tests-cgroups_isolator_tests.o -MD -MP -MF tests/.deps/mesos_tests-cgroups_isolator_tests.Tpo -c -o tests/mesos_tests-cgroups_isolator_tests.o `test -f 'tests/cgroups_isolator_tests.cpp' || echo '../../src/'`tests/cgroups_isolator_tests.cpp
mv -f tests/.deps/mesos_tests-values_tests.Tpo tests/.deps/mesos_tests-values_tests.Po
g++ -DPACKAGE_NAME=\"mesos\" -DPACKAGE_TARNAME=\"mesos\" -DPACKAGE_VERSION=\"0.23.0\" -DPACKAGE_STRING=\"mesos\ 0.23.0\" -DPACKAGE_BUGREPORT=\"\" -DPACKAGE_URL=\"\" -DPACKAGE=\"mesos\" -DVERSION=\"0.23.0\" -DSTDC_HEADERS=1 -DHAVE_SYS_TYPES_H=1 -DHAVE_SYS_STAT_H=1 -DHAVE_STDLIB_H=1 -DHAVE_STRING_H=1 -DHAVE_MEMORY_H=1 -DHAVE_STRINGS_H=1 -DHAVE_INTTYPES_H=1 -DHAVE_STDINT_H=1 -DHAVE_UNISTD_H=1 -DHAVE_DLFCN_H=1 -DLT_OBJDIR=\".libs/\" -DHAVE_PTHREAD_PRIO_INHERIT=1 -DHAVE_PTHREAD=1 -DHAVE_LIBZ=1 -DHAVE_LIBCURL=1 -DHAVE_APR_POOLS_H=1 -DHAVE_LIBAPR_1=1 -DHAVE_SVN_VERSION_H=1 -DHAVE_LIBSVN_SUBR_1=1 -DHAVE_SVN_DELTA_H=1 -DHAVE_LIBSVN_DELTA_1=1 -DHAVE_LIBSASL2=1 -DMESOS_HAS_JAVA=1 -DHAVE_PYTHON=\"2.7\" -DMESOS_HAS_PYTHON=1 -I. -I../../src   -Wall -Werror -DLIBDIR=\"<https://builds.apache.org/job/mesos-reviewbot/ws/mesos-0.23.0/_inst/lib\"> -DPKGLIBEXECDIR=\"<https://builds.apache.org/job/mesos-reviewbot/ws/mesos-0.23.0/_inst/libexec/mesos\"> -DPKGDATADIR=\"<https://builds.apache.org/job/mesos-reviewbot/ws/mesos-0.23.0/_inst/share/mesos\"> -I../../include -I../../3rdparty/libprocess/include -I../../3rdparty/libprocess/3rdparty/stout/include -I../include -I../include/mesos -I../3rdparty/libprocess/3rdparty/boost-1.53.0 -I../3rdparty/libprocess/3rdparty/picojson-4f93734 -I../3rdparty/libprocess/3rdparty/protobuf-2.5.0/src -I../3rdparty/libprocess/3rdparty/glog-0.3.3/src -I../3rdparty/libprocess/3rdparty/glog-0.3.3/src -I../3rdparty/leveldb/include -I../3rdparty/zookeeper-3.4.5/src/c/include -I../3rdparty/zookeeper-3.4.5/src/c/generated  -I../3rdparty/libprocess/3rdparty/protobuf-2.5.0/src -DSOURCE_DIR=\"<https://builds.apache.org/job/mesos-reviewbot/ws/mesos-0.23.0/_build/..\"> -DBUILD_DIR=\"<https://builds.apache.org/job/mesos-reviewbot/ws/mesos-0.23.0/_build\"> -I../3rdparty/libprocess/3rdparty/gmock-1.6.0/gtest/include -I../3rdparty/libprocess/3rdparty/gmock-1.6.0/include -I/home/jenkins/tools/java/jdk1.6.0_20-64/include -I/home/jenkins/tools/java/jdk1.6.0_20-64/include/linux -DZOOKEEPER_VERSION=\"3.4.5\" -I/usr/include/subversion-1 -I/usr/include/apr-1 -I/usr/include/apr-1.0  -pthread -g1 -O0 -Wno-unused-local-typedefs -std=c++11 -MT tests/mesos_tests-cgroups_tests.o -MD -MP -MF tests/.deps/mesos_tests-cgroups_tests.Tpo -c -o tests/mesos_tests-cgroups_tests.o `test -f 'tests/cgroups_tests.cpp' || echo '../../src/'`tests/cgroups_tests.cpp
mv -f tests/.deps/mesos_tests-zookeeper_url_tests.Tpo tests/.deps/mesos_tests-zookeeper_url_tests.Po
g++ -DPACKAGE_NAME=\"mesos\" -DPACKAGE_TARNAME=\"mesos\" -DPACKAGE_VERSION=\"0.23.0\" -DPACKAGE_STRING=\"mesos\ 0.23.0\" -DPACKAGE_BUGREPORT=\"\" -DPACKAGE_URL=\"\" -DPACKAGE=\"mesos\" -DVERSION=\"0.23.0\" -DSTDC_HEADERS=1 -DHAVE_SYS_TYPES_H=1 -DHAVE_SYS_STAT_H=1 -DHAVE_STDLIB_H=1 -DHAVE_STRING_H=1 -DHAVE_MEMORY_H=1 -DHAVE_STRINGS_H=1 -DHAVE_INTTYPES_H=1 -DHAVE_STDINT_H=1 -DHAVE_UNISTD_H=1 -DHAVE_DLFCN_H=1 -DLT_OBJDIR=\".libs/\" -DHAVE_PTHREAD_PRIO_INHERIT=1 -DHAVE_PTHREAD=1 -DHAVE_LIBZ=1 -DHAVE_LIBCURL=1 -DHAVE_APR_POOLS_H=1 -DHAVE_LIBAPR_1=1 -DHAVE_SVN_VERSION_H=1 -DHAVE_LIBSVN_SUBR_1=1 -DHAVE_SVN_DELTA_H=1 -DHAVE_LIBSVN_DELTA_1=1 -DHAVE_LIBSASL2=1 -DMESOS_HAS_JAVA=1 -DHAVE_PYTHON=\"2.7\" -DMESOS_HAS_PYTHON=1 -I. -I../../src   -Wall -Werror -DLIBDIR=\"<https://builds.apache.org/job/mesos-reviewbot/ws/mesos-0.23.0/_inst/lib\"> -DPKGLIBEXECDIR=\"<https://builds.apache.org/job/mesos-reviewbot/ws/mesos-0.23.0/_inst/libexec/mesos\"> -DPKGDATADIR=\"<https://builds.apache.org/job/mesos-reviewbot/ws/mesos-0.23.0/_inst/share/mesos\"> -I../../include -I../../3rdparty/libprocess/include -I../../3rdparty/libprocess/3rdparty/stout/include -I../include -I../include/mesos -I../3rdparty/libprocess/3rdparty/boost-1.53.0 -I../3rdparty/libprocess/3rdparty/picojson-4f93734 -I../3rdparty/libprocess/3rdparty/protobuf-2.5.0/src -I../3rdparty/libprocess/3rdparty/glog-0.3.3/src -I../3rdparty/libprocess/3rdparty/glog-0.3.3/src -I../3rdparty/leveldb/include -I../3rdparty/zookeeper-3.4.5/src/c/include -I../3rdparty/zookeeper-3.4.5/src/c/generated  -I../3rdparty/libprocess/3rdparty/protobuf-2.5.0/src -DSOURCE_DIR=\"<https://builds.apache.org/job/mesos-reviewbot/ws/mesos-0.23.0/_build/..\"> -DBUILD_DIR=\"<https://builds.apache.org/job/mesos-reviewbot/ws/mesos-0.23.0/_build\"> -I../3rdparty/libprocess/3rdparty/gmock-1.6.0/gtest/include -I../3rdparty/libprocess/3rdparty/gmock-1.6.0/include -I/home/jenkins/tools/java/jdk1.6.0_20-64/include -I/home/jenkins/tools/java/jdk1.6.0_20-64/include/linux -DZOOKEEPER_VERSION=\"3.4.5\" -I/usr/include/subversion-1 -I/usr/include/apr-1 -I/usr/include/apr-1.0  -pthread -g1 -O0 -Wno-unused-local-typedefs -std=c++11 -MT tests/mesos_tests-fs_tests.o -MD -MP -MF tests/.deps/mesos_tests-fs_tests.Tpo -c -o tests/mesos_tests-fs_tests.o `test -f 'tests/fs_tests.cpp' || echo '../../src/'`tests/fs_tests.cpp
mv -f tests/.deps/mesos_tests-fs_tests.Tpo tests/.deps/mesos_tests-fs_tests.Po
g++ -DPACKAGE_NAME=\"mesos\" -DPACKAGE_TARNAME=\"mesos\" -DPACKAGE_VERSION=\"0.23.0\" -DPACKAGE_STRING=\"mesos\ 0.23.0\" -DPACKAGE_BUGREPORT=\"\" -DPACKAGE_URL=\"\" -DPACKAGE=\"mesos\" -DVERSION=\"0.23.0\" -DSTDC_HEADERS=1 -DHAVE_SYS_TYPES_H=1 -DHAVE_SYS_STAT_H=1 -DHAVE_STDLIB_H=1 -DHAVE_STRING_H=1 -DHAVE_MEMORY_H=1 -DHAVE_STRINGS_H=1 -DHAVE_INTTYPES_H=1 -DHAVE_STDINT_H=1 -DHAVE_UNISTD_H=1 -DHAVE_DLFCN_H=1 -DLT_OBJDIR=\".libs/\" -DHAVE_PTHREAD_PRIO_INHERIT=1 -DHAVE_PTHREAD=1 -DHAVE_LIBZ=1 -DHAVE_LIBCURL=1 -DHAVE_APR_POOLS_H=1 -DHAVE_LIBAPR_1=1 -DHAVE_SVN_VERSION_H=1 -DHAVE_LIBSVN_SUBR_1=1 -DHAVE_SVN_DELTA_H=1 -DHAVE_LIBSVN_DELTA_1=1 -DHAVE_LIBSASL2=1 -DMESOS_HAS_JAVA=1 -DHAVE_PYTHON=\"2.7\" -DMESOS_HAS_PYTHON=1 -I. -I../../src   -Wall -Werror -DLIBDIR=\"<https://builds.apache.org/job/mesos-reviewbot/ws/mesos-0.23.0/_inst/lib\"> -DPKGLIBEXECDIR=\"<https://builds.apache.org/job/mesos-reviewbot/ws/mesos-0.23.0/_inst/libexec/mesos\"> -DPKGDATADIR=\"<https://builds.apache.org/job/mesos-reviewbot/ws/mesos-0.23.0/_inst/share/mesos\"> -I../../include -I../../3rdparty/libprocess/include -I../../3rdparty/libprocess/3rdparty/stout/include -I../include -I../include/mesos -I../3rdparty/libprocess/3rdparty/boost-1.53.0 -I../3rdparty/libprocess/3rdparty/picojson-4f93734 -I../3rdparty/libprocess/3rdparty/protobuf-2.5.0/src -I../3rdparty/libprocess/3rdparty/glog-0.3.3/src -I../3rdparty/libprocess/3rdparty/glog-0.3.3/src -I../3rdparty/leveldb/include -I../3rdparty/zookeeper-3.4.5/src/c/include -I../3rdparty/zookeeper-3.4.5/src/c/generated  -I../3rdparty/libprocess/3rdparty/protobuf-2.5.0/src -DSOURCE_DIR=\"<https://builds.apache.org/job/mesos-reviewbot/ws/mesos-0.23.0/_build/..\"> -DBUILD_DIR=\"<https://builds.apache.org/job/mesos-reviewbot/ws/mesos-0.23.0/_build\"> -I../3rdparty/libprocess/3rdparty/gmock-1.6.0/gtest/include -I../3rdparty/libprocess/3rdparty/gmock-1.6.0/include -I/home/jenkins/tools/java/jdk1.6.0_20-64/include -I/home/jenkins/tools/java/jdk1.6.0_20-64/include/linux -DZOOKEEPER_VERSION=\"3.4.5\" -I/usr/include/subversion-1 -I/usr/include/apr-1 -I/usr/include/apr-1.0  -pthread -g1 -O0 -Wno-unused-local-typedefs -std=c++11 -MT tests/mesos_tests-memory_pressure_tests.o -MD -MP -MF tests/.deps/mesos_tests-memory_pressure_tests.Tpo -c -o tests/mesos_tests-memory_pressure_tests.o `test -f 'tests/memory_pressure_tests.cpp' || echo '../../src/'`tests/memory_pressure_tests.cpp
mv -f tests/.deps/mesos_tests-cgroups_isolator_tests.Tpo tests/.deps/mesos_tests-cgroups_isolator_tests.Po
g++ -DPACKAGE_NAME=\"mesos\" -DPACKAGE_TARNAME=\"mesos\" -DPACKAGE_VERSION=\"0.23.0\" -DPACKAGE_STRING=\"mesos\ 0.23.0\" -DPACKAGE_BUGREPORT=\"\" -DPACKAGE_URL=\"\" -DPACKAGE=\"mesos\" -DVERSION=\"0.23.0\" -DSTDC_HEADERS=1 -DHAVE_SYS_TYPES_H=1 -DHAVE_SYS_STAT_H=1 -DHAVE_STDLIB_H=1 -DHAVE_STRING_H=1 -DHAVE_MEMORY_H=1 -DHAVE_STRINGS_H=1 -DHAVE_INTTYPES_H=1 -DHAVE_STDINT_H=1 -DHAVE_UNISTD_H=1 -DHAVE_DLFCN_H=1 -DLT_OBJDIR=\".libs/\" -DHAVE_PTHREAD_PRIO_INHERIT=1 -DHAVE_PTHREAD=1 -DHAVE_LIBZ=1 -DHAVE_LIBCURL=1 -DHAVE_APR_POOLS_H=1 -DHAVE_LIBAPR_1=1 -DHAVE_SVN_VERSION_H=1 -DHAVE_LIBSVN_SUBR_1=1 -DHAVE_SVN_DELTA_H=1 -DHAVE_LIBSVN_DELTA_1=1 -DHAVE_LIBSASL2=1 -DMESOS_HAS_JAVA=1 -DHAVE_PYTHON=\"2.7\" -DMESOS_HAS_PYTHON=1 -I. -I../../src   -Wall -Werror -DLIBDIR=\"<https://builds.apache.org/job/mesos-reviewbot/ws/mesos-0.23.0/_inst/lib\"> -DPKGLIBEXECDIR=\"<https://builds.apache.org/job/mesos-reviewbot/ws/mesos-0.23.0/_inst/libexec/mesos\"> -DPKGDATADIR=\"<https://builds.apache.org/job/mesos-reviewbot/ws/mesos-0.23.0/_inst/share/mesos\"> -I../../include -I../../3rdparty/libprocess/include -I../../3rdparty/libprocess/3rdparty/stout/include -I../include -I../include/mesos -I../3rdparty/libprocess/3rdparty/boost-1.53.0 -I../3rdparty/libprocess/3rdparty/picojson-4f93734 -I../3rdparty/libprocess/3rdparty/protobuf-2.5.0/src -I../3rdparty/libprocess/3rdparty/glog-0.3.3/src -I../3rdparty/libprocess/3rdparty/glog-0.3.3/src -I../3rdparty/leveldb/include -I../3rdparty/zookeeper-3.4.5/src/c/include -I../3rdparty/zookeeper-3.4.5/src/c/generated  -I../3rdparty/libprocess/3rdparty/protobuf-2.5.0/src -DSOURCE_DIR=\"<https://builds.apache.org/job/mesos-reviewbot/ws/mesos-0.23.0/_build/..\"> -DBUILD_DIR=\"<https://builds.apache.org/job/mesos-reviewbot/ws/mesos-0.23.0/_build\"> -I../3rdparty/libprocess/3rdparty/gmock-1.6.0/gtest/include -I../3rdparty/libprocess/3rdparty/gmock-1.6.0/include -I/home/jenkins/tools/java/jdk1.6.0_20-64/include -I/home/jenkins/tools/java/jdk1.6.0_20-64/include/linux -DZOOKEEPER_VERSION=\"3.4.5\" -I/usr/include/subversion-1 -I/usr/include/apr-1 -I/usr/include/apr-1.0  -pthread -g1 -O0 -Wno-unused-local-typedefs -std=c++11 -MT tests/mesos_tests-ns_tests.o -MD -MP -MF tests/.deps/mesos_tests-ns_tests.Tpo -c -o tests/mesos_tests-ns_tests.o `test -f 'tests/ns_tests.cpp' || echo '../../src/'`tests/ns_tests.cpp
mv -f tests/.deps/mesos_tests-ns_tests.Tpo tests/.deps/mesos_tests-ns_tests.Po
g++ -DPACKAGE_NAME=\"mesos\" -DPACKAGE_TARNAME=\"mesos\" -DPACKAGE_VERSION=\"0.23.0\" -DPACKAGE_STRING=\"mesos\ 0.23.0\" -DPACKAGE_BUGREPORT=\"\" -DPACKAGE_URL=\"\" -DPACKAGE=\"mesos\" -DVERSION=\"0.23.0\" -DSTDC_HEADERS=1 -DHAVE_SYS_TYPES_H=1 -DHAVE_SYS_STAT_H=1 -DHAVE_STDLIB_H=1 -DHAVE_STRING_H=1 -DHAVE_MEMORY_H=1 -DHAVE_STRINGS_H=1 -DHAVE_INTTYPES_H=1 -DHAVE_STDINT_H=1 -DHAVE_UNISTD_H=1 -DHAVE_DLFCN_H=1 -DLT_OBJDIR=\".libs/\" -DHAVE_PTHREAD_PRIO_INHERIT=1 -DHAVE_PTHREAD=1 -DHAVE_LIBZ=1 -DHAVE_LIBCURL=1 -DHAVE_APR_POOLS_H=1 -DHAVE_LIBAPR_1=1 -DHAVE_SVN_VERSION_H=1 -DHAVE_LIBSVN_SUBR_1=1 -DHAVE_SVN_DELTA_H=1 -DHAVE_LIBSVN_DELTA_1=1 -DHAVE_LIBSASL2=1 -DMESOS_HAS_JAVA=1 -DHAVE_PYTHON=\"2.7\" -DMESOS_HAS_PYTHON=1 -I. -I../../src   -Wall -Werror -DLIBDIR=\"<https://builds.apache.org/job/mesos-reviewbot/ws/mesos-0.23.0/_inst/lib\"> -DPKGLIBEXECDIR=\"<https://builds.apache.org/job/mesos-reviewbot/ws/mesos-0.23.0/_inst/libexec/mesos\"> -DPKGDATADIR=\"<https://builds.apache.org/job/mesos-reviewbot/ws/mesos-0.23.0/_inst/share/mesos\"> -I../../include -I../../3rdparty/libprocess/include -I../../3rdparty/libprocess/3rdparty/stout/include -I../include -I../include/mesos -I../3rdparty/libprocess/3rdparty/boost-1.53.0 -I../3rdparty/libprocess/3rdparty/picojson-4f93734 -I../3rdparty/libprocess/3rdparty/protobuf-2.5.0/src -I../3rdparty/libprocess/3rdparty/glog-0.3.3/src -I../3rdparty/libprocess/3rdparty/glog-0.3.3/src -I../3rdparty/leveldb/include -I../3rdparty/zookeeper-3.4.5/src/c/include -I../3rdparty/zookeeper-3.4.5/src/c/generated  -I../3rdparty/libprocess/3rdparty/protobuf-2.5.0/src -DSOURCE_DIR=\"<https://builds.apache.org/job/mesos-reviewbot/ws/mesos-0.23.0/_build/..\"> -DBUILD_DIR=\"<https://builds.apache.org/job/mesos-reviewbot/ws/mesos-0.23.0/_build\"> -I../3rdparty/libprocess/3rdparty/gmock-1.6.0/gtest/include -I../3rdparty/libprocess/3rdparty/gmock-1.6.0/include -I/home/jenkins/tools/java/jdk1.6.0_20-64/include -I/home/jenkins/tools/java/jdk1.6.0_20-64/include/linux -DZOOKEEPER_VERSION=\"3.4.5\" -I/usr/include/subversion-1 -I/usr/include/apr-1 -I/usr/include/apr-1.0  -pthread -g1 -O0 -Wno-unused-local-typedefs -std=c++11 -MT tests/mesos_tests-perf_tests.o -MD -MP -MF tests/.deps/mesos_tests-perf_tests.Tpo -c -o tests/mesos_tests-perf_tests.o `test -f 'tests/perf_tests.cpp' || echo '../../src/'`tests/perf_tests.cpp
mv -f tests/.deps/mesos_tests-cgroups_tests.Tpo tests/.deps/mesos_tests-cgroups_tests.Po
g++ -DPACKAGE_NAME=\"mesos\" -DPACKAGE_TARNAME=\"mesos\" -DPACKAGE_VERSION=\"0.23.0\" -DPACKAGE_STRING=\"mesos\ 0.23.0\" -DPACKAGE_BUGREPORT=\"\" -DPACKAGE_URL=\"\" -DPACKAGE=\"mesos\" -DVERSION=\"0.23.0\" -DSTDC_HEADERS=1 -DHAVE_SYS_TYPES_H=1 -DHAVE_SYS_STAT_H=1 -DHAVE_STDLIB_H=1 -DHAVE_STRING_H=1 -DHAVE_MEMORY_H=1 -DHAVE_STRINGS_H=1 -DHAVE_INTTYPES_H=1 -DHAVE_STDINT_H=1 -DHAVE_UNISTD_H=1 -DHAVE_DLFCN_H=1 -DLT_OBJDIR=\".libs/\" -DHAVE_PTHREAD_PRIO_INHERIT=1 -DHAVE_PTHREAD=1 -DHAVE_LIBZ=1 -DHAVE_LIBCURL=1 -DHAVE_APR_POOLS_H=1 -DHAVE_LIBAPR_1=1 -DHAVE_SVN_VERSION_H=1 -DHAVE_LIBSVN_SUBR_1=1 -DHAVE_SVN_DELTA_H=1 -DHAVE_LIBSVN_DELTA_1=1 -DHAVE_LIBSASL2=1 -DMESOS_HAS_JAVA=1 -DHAVE_PYTHON=\"2.7\" -DMESOS_HAS_PYTHON=1 -I. -I../../src   -Wall -Werror -DLIBDIR=\"<https://builds.apache.org/job/mesos-reviewbot/ws/mesos-0.23.0/_inst/lib\"> -DPKGLIBEXECDIR=\"<https://builds.apache.org/job/mesos-reviewbot/ws/mesos-0.23.0/_inst/libexec/mesos\"> -DPKGDATADIR=\"<https://builds.apache.org/job/mesos-reviewbot/ws/mesos-0.23.0/_inst/share/mesos\"> -I../../include -I../../3rdparty/libprocess/include -I../../3rdparty/libprocess/3rdparty/stout/include -I../include -I../include/mesos -I../3rdparty/libprocess/3rdparty/boost-1.53.0 -I../3rdparty/libprocess/3rdparty/picojson-4f93734 -I../3rdparty/libprocess/3rdparty/protobuf-2.5.0/src -I../3rdparty/libprocess/3rdparty/glog-0.3.3/src -I../3rdparty/libprocess/3rdparty/glog-0.3.3/src -I../3rdparty/leveldb/include -I../3rdparty/zookeeper-3.4.5/src/c/include -I../3rdparty/zookeeper-3.4.5/src/c/generated  -I../3rdparty/libprocess/3rdparty/protobuf-2.5.0/src -DSOURCE_DIR=\"<https://builds.apache.org/job/mesos-reviewbot/ws/mesos-0.23.0/_build/..\"> -DBUILD_DIR=\"<https://builds.apache.org/job/mesos-reviewbot/ws/mesos-0.23.0/_build\"> -I../3rdparty/libprocess/3rdparty/gmock-1.6.0/gtest/include -I../3rdparty/libprocess/3rdparty/gmock-1.6.0/include -I/home/jenkins/tools/java/jdk1.6.0_20-64/include -I/home/jenkins/tools/java/jdk1.6.0_20-64/include/linux -DZOOKEEPER_VERSION=\"3.4.5\" -I/usr/include/subversion-1 -I/usr/include/apr-1 -I/usr/include/apr-1.0  -pthread -g1 -O0 -Wno-unused-local-typedefs -std=c++11 -MT tests/mesos_tests-sched_tests.o -MD -MP -MF tests/.deps/mesos_tests-sched_tests.Tpo -c -o tests/mesos_tests-sched_tests.o `test -f 'tests/sched_tests.cpp' || echo '../../src/'`tests/sched_tests.cpp
mv -f tests/.deps/mesos_tests-perf_tests.Tpo tests/.deps/mesos_tests-perf_tests.Po
g++ -DPACKAGE_NAME=\"mesos\" -DPACKAGE_TARNAME=\"mesos\" -DPACKAGE_VERSION=\"0.23.0\" -DPACKAGE_STRING=\"mesos\ 0.23.0\" -DPACKAGE_BUGREPORT=\"\" -DPACKAGE_URL=\"\" -DPACKAGE=\"mesos\" -DVERSION=\"0.23.0\" -DSTDC_HEADERS=1 -DHAVE_SYS_TYPES_H=1 -DHAVE_SYS_STAT_H=1 -DHAVE_STDLIB_H=1 -DHAVE_STRING_H=1 -DHAVE_MEMORY_H=1 -DHAVE_STRINGS_H=1 -DHAVE_INTTYPES_H=1 -DHAVE_STDINT_H=1 -DHAVE_UNISTD_H=1 -DHAVE_DLFCN_H=1 -DLT_OBJDIR=\".libs/\" -DHAVE_PTHREAD_PRIO_INHERIT=1 -DHAVE_PTHREAD=1 -DHAVE_LIBZ=1 -DHAVE_LIBCURL=1 -DHAVE_APR_POOLS_H=1 -DHAVE_LIBAPR_1=1 -DHAVE_SVN_VERSION_H=1 -DHAVE_LIBSVN_SUBR_1=1 -DHAVE_SVN_DELTA_H=1 -DHAVE_LIBSVN_DELTA_1=1 -DHAVE_LIBSASL2=1 -DMESOS_HAS_JAVA=1 -DHAVE_PYTHON=\"2.7\" -DMESOS_HAS_PYTHON=1 -I. -I../../src   -Wall -Werror -DLIBDIR=\"<https://builds.apache.org/job/mesos-reviewbot/ws/mesos-0.23.0/_inst/lib\"> -DPKGLIBEXECDIR=\"<https://builds.apache.org/job/mesos-reviewbot/ws/mesos-0.23.0/_inst/libexec/mesos\"> -DPKGDATADIR=\"<https://builds.apache.org/job/mesos-reviewbot/ws/mesos-0.23.0/_inst/share/mesos\"> -I../../include -I../../3rdparty/libprocess/include -I../../3rdparty/libprocess/3rdparty/stout/include -I../include -I../include/mesos -I../3rdparty/libprocess/3rdparty/boost-1.53.0 -I../3rdparty/libprocess/3rdparty/picojson-4f93734 -I../3rdparty/libprocess/3rdparty/protobuf-2.5.0/src -I../3rdparty/libprocess/3rdparty/glog-0.3.3/src -I../3rdparty/libprocess/3rdparty/glog-0.3.3/src -I../3rdparty/leveldb/include -I../3rdparty/zookeeper-3.4.5/src/c/include -I../3rdparty/zookeeper-3.4.5/src/c/generated  -I../3rdparty/libprocess/3rdparty/protobuf-2.5.0/src -DSOURCE_DIR=\"<https://builds.apache.org/job/mesos-reviewbot/ws/mesos-0.23.0/_build/..\"> -DBUILD_DIR=\"<https://builds.apache.org/job/mesos-reviewbot/ws/mesos-0.23.0/_build\"> -I../3rdparty/libprocess/3rdparty/gmock-1.6.0/gtest/include -I../3rdparty/libprocess/3rdparty/gmock-1.6.0/include -I/home/jenkins/tools/java/jdk1.6.0_20-64/include -I/home/jenkins/tools/java/jdk1.6.0_20-64/include/linux -DZOOKEEPER_VERSION=\"3.4.5\" -I/usr/include/subversion-1 -I/usr/include/apr-1 -I/usr/include/apr-1.0  -pthread -g1 -O0 -Wno-unused-local-typedefs -std=c++11 -MT tests/mesos_tests-setns_test_helper.o -MD -MP -MF tests/.deps/mesos_tests-setns_test_helper.Tpo -c -o tests/mesos_tests-setns_test_helper.o `test -f 'tests/setns_test_helper.cpp' || echo '../../src/'`tests/setns_test_helper.cpp
mv -f tests/.deps/mesos_tests-sched_tests.Tpo tests/.deps/mesos_tests-sched_tests.Po
g++ -DPACKAGE_NAME=\"mesos\" -DPACKAGE_TARNAME=\"mesos\" -DPACKAGE_VERSION=\"0.23.0\" -DPACKAGE_STRING=\"mesos\ 0.23.0\" -DPACKAGE_BUGREPORT=\"\" -DPACKAGE_URL=\"\" -DPACKAGE=\"mesos\" -DVERSION=\"0.23.0\" -DSTDC_HEADERS=1 -DHAVE_SYS_TYPES_H=1 -DHAVE_SYS_STAT_H=1 -DHAVE_STDLIB_H=1 -DHAVE_STRING_H=1 -DHAVE_MEMORY_H=1 -DHAVE_STRINGS_H=1 -DHAVE_INTTYPES_H=1 -DHAVE_STDINT_H=1 -DHAVE_UNISTD_H=1 -DHAVE_DLFCN_H=1 -DLT_OBJDIR=\".libs/\" -DHAVE_PTHREAD_PRIO_INHERIT=1 -DHAVE_PTHREAD=1 -DHAVE_LIBZ=1 -DHAVE_LIBCURL=1 -DHAVE_APR_POOLS_H=1 -DHAVE_LIBAPR_1=1 -DHAVE_SVN_VERSION_H=1 -DHAVE_LIBSVN_SUBR_1=1 -DHAVE_SVN_DELTA_H=1 -DHAVE_LIBSVN_DELTA_1=1 -DHAVE_LIBSASL2=1 -DMESOS_HAS_JAVA=1 -DHAVE_PYTHON=\"2.7\" -DMESOS_HAS_PYTHON=1 -I. -I../../src   -Wall -Werror -DLIBDIR=\"<https://builds.apache.org/job/mesos-reviewbot/ws/mesos-0.23.0/_inst/lib\"> -DPKGLIBEXECDIR=\"<https://builds.apache.org/job/mesos-reviewbot/ws/mesos-0.23.0/_inst/libexec/mesos\"> -DPKGDATADIR=\"<https://builds.apache.org/job/mesos-reviewbot/ws/mesos-0.23.0/_inst/share/mesos\"> -I../../include -I../../3rdparty/libprocess/include -I../../3rdparty/libprocess/3rdparty/stout/include -I../include -I../include/mesos -I../3rdparty/libprocess/3rdparty/boost-1.53.0 -I../3rdparty/libprocess/3rdparty/picojson-4f93734 -I../3rdparty/libprocess/3rdparty/protobuf-2.5.0/src -I../3rdparty/libprocess/3rdparty/glog-0.3.3/src -I../3rdparty/libprocess/3rdparty/glog-0.3.3/src -I../3rdparty/leveldb/include -I../3rdparty/zookeeper-3.4.5/src/c/include -I../3rdparty/zookeeper-3.4.5/src/c/generated  -I../3rdparty/libprocess/3rdparty/protobuf-2.5.0/src -DSOURCE_DIR=\"<https://builds.apache.org/job/mesos-reviewbot/ws/mesos-0.23.0/_build/..\"> -DBUILD_DIR=\"<https://builds.apache.org/job/mesos-reviewbot/ws/mesos-0.23.0/_build\"> -I../3rdparty/libprocess/3rdparty/gmock-1.6.0/gtest/include -I../3rdparty/libprocess/3rdparty/gmock-1.6.0/include -I/home/jenkins/tools/java/jdk1.6.0_20-64/include -I/home/jenkins/tools/java/jdk1.6.0_20-64/include/linux -DZOOKEEPER_VERSION=\"3.4.5\" -I/usr/include/subversion-1 -I/usr/include/apr-1 -I/usr/include/apr-1.0  -pthread -g1 -O0 -Wno-unused-local-typedefs -std=c++11 -MT tests/mesos_tests-group_tests.o -MD -MP -MF tests/.deps/mesos_tests-group_tests.Tpo -c -o tests/mesos_tests-group_tests.o `test -f 'tests/group_tests.cpp' || echo '../../src/'`tests/group_tests.cpp
mv -f tests/.deps/mesos_tests-memory_pressure_tests.Tpo tests/.deps/mesos_tests-memory_pressure_tests.Po
g++ -DPACKAGE_NAME=\"mesos\" -DPACKAGE_TARNAME=\"mesos\" -DPACKAGE_VERSION=\"0.23.0\" -DPACKAGE_STRING=\"mesos\ 0.23.0\" -DPACKAGE_BUGREPORT=\"\" -DPACKAGE_URL=\"\" -DPACKAGE=\"mesos\" -DVERSION=\"0.23.0\" -DSTDC_HEADERS=1 -DHAVE_SYS_TYPES_H=1 -DHAVE_SYS_STAT_H=1 -DHAVE_STDLIB_H=1 -DHAVE_STRING_H=1 -DHAVE_MEMORY_H=1 -DHAVE_STRINGS_H=1 -DHAVE_INTTYPES_H=1 -DHAVE_STDINT_H=1 -DHAVE_UNISTD_H=1 -DHAVE_DLFCN_H=1 -DLT_OBJDIR=\".libs/\" -DHAVE_PTHREAD_PRIO_INHERIT=1 -DHAVE_PTHREAD=1 -DHAVE_LIBZ=1 -DHAVE_LIBCURL=1 -DHAVE_APR_POOLS_H=1 -DHAVE_LIBAPR_1=1 -DHAVE_SVN_VERSION_H=1 -DHAVE_LIBSVN_SUBR_1=1 -DHAVE_SVN_DELTA_H=1 -DHAVE_LIBSVN_DELTA_1=1 -DHAVE_LIBSASL2=1 -DMESOS_HAS_JAVA=1 -DHAVE_PYTHON=\"2.7\" -DMESOS_HAS_PYTHON=1 -I. -I../../src   -Wall -Werror -DLIBDIR=\"<https://builds.apache.org/job/mesos-reviewbot/ws/mesos-0.23.0/_inst/lib\"> -DPKGLIBEXECDIR=\"<https://builds.apache.org/job/mesos-reviewbot/ws/mesos-0.23.0/_inst/libexec/mesos\"> -DPKGDATADIR=\"<https://builds.apache.org/job/mesos-reviewbot/ws/mesos-0.23.0/_inst/share/mesos\"> -I../../include -I../../3rdparty/libprocess/include -I../../3rdparty/libprocess/3rdparty/stout/include -I../include -I../include/mesos -I../3rdparty/libprocess/3rdparty/boost-1.53.0 -I../3rdparty/libprocess/3rdparty/picojson-4f93734 -I../3rdparty/libprocess/3rdparty/protobuf-2.5.0/src -I../3rdparty/libprocess/3rdparty/glog-0.3.3/src -I../3rdparty/libprocess/3rdparty/glog-0.3.3/src -I../3rdparty/leveldb/include -I../3rdparty/zookeeper-3.4.5/src/c/include -I../3rdparty/zookeeper-3.4.5/src/c/generated  -I../3rdparty/libprocess/3rdparty/protobuf-2.5.0/src -DSOURCE_DIR=\"<https://builds.apache.org/job/mesos-reviewbot/ws/mesos-0.23.0/_build/..\"> -DBUILD_DIR=\"<https://builds.apache.org/job/mesos-reviewbot/ws/mesos-0.23.0/_build\"> -I../3rdparty/libprocess/3rdparty/gmock-1.6.0/gtest/include -I../3rdparty/libprocess/3rdparty/gmock-1.6.0/include -I/home/jenkins/tools/java/jdk1.6.0_20-64/include -I/home/jenkins/tools/java/jdk1.6.0_20-64/include/linux -DZOOKEEPER_VERSION=\"3.4.5\" -I/usr/include/subversion-1 -I/usr/include/apr-1 -I/usr/include/apr-1.0  -pthread -g1 -O0 -Wno-unused-local-typedefs -std=c++11 -MT tests/mesos_tests-registrar_zookeeper_tests.o -MD -MP -MF tests/.deps/mesos_tests-registrar_zookeeper_tests.Tpo -c -o tests/mesos_tests-registrar_zookeeper_tests.o `test -f 'tests/registrar_zookeeper_tests.cpp' || echo '../../src/'`tests/registrar_zookeeper_tests.cpp
mv -f tests/.deps/mesos_tests-setns_test_helper.Tpo tests/.deps/mesos_tests-setns_test_helper.Po
g++ -DPACKAGE_NAME=\"mesos\" -DPACKAGE_TARNAME=\"mesos\" -DPACKAGE_VERSION=\"0.23.0\" -DPACKAGE_STRING=\"mesos\ 0.23.0\" -DPACKAGE_BUGREPORT=\"\" -DPACKAGE_URL=\"\" -DPACKAGE=\"mesos\" -DVERSION=\"0.23.0\" -DSTDC_HEADERS=1 -DHAVE_SYS_TYPES_H=1 -DHAVE_SYS_STAT_H=1 -DHAVE_STDLIB_H=1 -DHAVE_STRING_H=1 -DHAVE_MEMORY_H=1 -DHAVE_STRINGS_H=1 -DHAVE_INTTYPES_H=1 -DHAVE_STDINT_H=1 -DHAVE_UNISTD_H=1 -DHAVE_DLFCN_H=1 -DLT_OBJDIR=\".libs/\" -DHAVE_PTHREAD_PRIO_INHERIT=1 -DHAVE_PTHREAD=1 -DHAVE_LIBZ=1 -DHAVE_LIBCURL=1 -DHAVE_APR_POOLS_H=1 -DHAVE_LIBAPR_1=1 -DHAVE_SVN_VERSION_H=1 -DHAVE_LIBSVN_SUBR_1=1 -DHAVE_SVN_DELTA_H=1 -DHAVE_LIBSVN_DELTA_1=1 -DHAVE_LIBSASL2=1 -DMESOS_HAS_JAVA=1 -DHAVE_PYTHON=\"2.7\" -DMESOS_HAS_PYTHON=1 -I. -I../../src   -Wall -Werror -DLIBDIR=\"<https://builds.apache.org/job/mesos-reviewbot/ws/mesos-0.23.0/_inst/lib\"> -DPKGLIBEXECDIR=\"<https://builds.apache.org/job/mesos-reviewbot/ws/mesos-0.23.0/_inst/libexec/mesos\"> -DPKGDATADIR=\"<https://builds.apache.org/job/mesos-reviewbot/ws/mesos-0.23.0/_inst/share/mesos\"> -I../../include -I../../3rdparty/libprocess/include -I../../3rdparty/libprocess/3rdparty/stout/include -I../include -I../include/mesos -I../3rdparty/libprocess/3rdparty/boost-1.53.0 -I../3rdparty/libprocess/3rdparty/picojson-4f93734 -I../3rdparty/libprocess/3rdparty/protobuf-2.5.0/src -I../3rdparty/libprocess/3rdparty/glog-0.3.3/src -I../3rdparty/libprocess/3rdparty/glog-0.3.3/src -I../3rdparty/leveldb/include -I../3rdparty/zookeeper-3.4.5/src/c/include -I../3rdparty/zookeeper-3.4.5/src/c/generated  -I../3rdparty/libprocess/3rdparty/protobuf-2.5.0/src -DSOURCE_DIR=\"<https://builds.apache.org/job/mesos-reviewbot/ws/mesos-0.23.0/_build/..\"> -DBUILD_DIR=\"<https://builds.apache.org/job/mesos-reviewbot/ws/mesos-0.23.0/_build\"> -I../3rdparty/libprocess/3rdparty/gmock-1.6.0/gtest/include -I../3rdparty/libprocess/3rdparty/gmock-1.6.0/include -I/home/jenkins/tools/java/jdk1.6.0_20-64/include -I/home/jenkins/tools/java/jdk1.6.0_20-64/include/linux -DZOOKEEPER_VERSION=\"3.4.5\" -I/usr/include/subversion-1 -I/usr/include/apr-1 -I/usr/include/apr-1.0  -pthread -g1 -O0 -Wno-unused-local-typedefs -std=c++11 -MT tests/mesos_tests-zookeeper.o -MD -MP -MF tests/.deps/mesos_tests-zookeeper.Tpo -c -o tests/mesos_tests-zookeeper.o `test -f 'tests/zookeeper.cpp' || echo '../../src/'`tests/zookeeper.cpp
mv -f tests/.deps/mesos_tests-group_tests.Tpo tests/.deps/mesos_tests-group_tests.Po
g++ -DPACKAGE_NAME=\"mesos\" -DPACKAGE_TARNAME=\"mesos\" -DPACKAGE_VERSION=\"0.23.0\" -DPACKAGE_STRING=\"mesos\ 0.23.0\" -DPACKAGE_BUGREPORT=\"\" -DPACKAGE_URL=\"\" -DPACKAGE=\"mesos\" -DVERSION=\"0.23.0\" -DSTDC_HEADERS=1 -DHAVE_SYS_TYPES_H=1 -DHAVE_SYS_STAT_H=1 -DHAVE_STDLIB_H=1 -DHAVE_STRING_H=1 -DHAVE_MEMORY_H=1 -DHAVE_STRINGS_H=1 -DHAVE_INTTYPES_H=1 -DHAVE_STDINT_H=1 -DHAVE_UNISTD_H=1 -DHAVE_DLFCN_H=1 -DLT_OBJDIR=\".libs/\" -DHAVE_PTHREAD_PRIO_INHERIT=1 -DHAVE_PTHREAD=1 -DHAVE_LIBZ=1 -DHAVE_LIBCURL=1 -DHAVE_APR_POOLS_H=1 -DHAVE_LIBAPR_1=1 -DHAVE_SVN_VERSION_H=1 -DHAVE_LIBSVN_SUBR_1=1 -DHAVE_SVN_DELTA_H=1 -DHAVE_LIBSVN_DELTA_1=1 -DHAVE_LIBSASL2=1 -DMESOS_HAS_JAVA=1 -DHAVE_PYTHON=\"2.7\" -DMESOS_HAS_PYTHON=1 -I. -I../../src   -Wall -Werror -DLIBDIR=\"<https://builds.apache.org/job/mesos-reviewbot/ws/mesos-0.23.0/_inst/lib\"> -DPKGLIBEXECDIR=\"<https://builds.apache.org/job/mesos-reviewbot/ws/mesos-0.23.0/_inst/libexec/mesos\"> -DPKGDATADIR=\"<https://builds.apache.org/job/mesos-reviewbot/ws/mesos-0.23.0/_inst/share/mesos\"> -I../../include -I../../3rdparty/libprocess/include -I../../3rdparty/libprocess/3rdparty/stout/include -I../include -I../include/mesos -I../3rdparty/libprocess/3rdparty/boost-1.53.0 -I../3rdparty/libprocess/3rdparty/picojson-4f93734 -I../3rdparty/libprocess/3rdparty/protobuf-2.5.0/src -I../3rdparty/libprocess/3rdparty/glog-0.3.3/src -I../3rdparty/libprocess/3rdparty/glog-0.3.3/src -I../3rdparty/leveldb/include -I../3rdparty/zookeeper-3.4.5/src/c/include -I../3rdparty/zookeeper-3.4.5/src/c/generated  -I../3rdparty/libprocess/3rdparty/protobuf-2.5.0/src -DSOURCE_DIR=\"<https://builds.apache.org/job/mesos-reviewbot/ws/mesos-0.23.0/_build/..\"> -DBUILD_DIR=\"<https://builds.apache.org/job/mesos-reviewbot/ws/mesos-0.23.0/_build\"> -I../3rdparty/libprocess/3rdparty/gmock-1.6.0/gtest/include -I../3rdparty/libprocess/3rdparty/gmock-1.6.0/include -I/home/jenkins/tools/java/jdk1.6.0_20-64/include -I/home/jenkins/tools/java/jdk1.6.0_20-64/include/linux -DZOOKEEPER_VERSION=\"3.4.5\" -I/usr/include/subversion-1 -I/usr/include/apr-1 -I/usr/include/apr-1.0  -pthread -g1 -O0 -Wno-unused-local-typedefs -std=c++11 -MT tests/mesos_tests-zookeeper_test_server.o -MD -MP -MF tests/.deps/mesos_tests-zookeeper_test_server.Tpo -c -o tests/mesos_tests-zookeeper_test_server.o `test -f 'tests/zookeeper_test_server.cpp' || echo '../../src/'`tests/zookeeper_test_server.cpp
mv -f tests/.deps/mesos_tests-zookeeper.Tpo tests/.deps/mesos_tests-zookeeper.Po
g++ -DPACKAGE_NAME=\"mesos\" -DPACKAGE_TARNAME=\"mesos\" -DPACKAGE_VERSION=\"0.23.0\" -DPACKAGE_STRING=\"mesos\ 0.23.0\" -DPACKAGE_BUGREPORT=\"\" -DPACKAGE_URL=\"\" -DPACKAGE=\"mesos\" -DVERSION=\"0.23.0\" -DSTDC_HEADERS=1 -DHAVE_SYS_TYPES_H=1 -DHAVE_SYS_STAT_H=1 -DHAVE_STDLIB_H=1 -DHAVE_STRING_H=1 -DHAVE_MEMORY_H=1 -DHAVE_STRINGS_H=1 -DHAVE_INTTYPES_H=1 -DHAVE_STDINT_H=1 -DHAVE_UNISTD_H=1 -DHAVE_DLFCN_H=1 -DLT_OBJDIR=\".libs/\" -DHAVE_PTHREAD_PRIO_INHERIT=1 -DHAVE_PTHREAD=1 -DHAVE_LIBZ=1 -DHAVE_LIBCURL=1 -DHAVE_APR_POOLS_H=1 -DHAVE_LIBAPR_1=1 -DHAVE_SVN_VERSION_H=1 -DHAVE_LIBSVN_SUBR_1=1 -DHAVE_SVN_DELTA_H=1 -DHAVE_LIBSVN_DELTA_1=1 -DHAVE_LIBSASL2=1 -DMESOS_HAS_JAVA=1 -DHAVE_PYTHON=\"2.7\" -DMESOS_HAS_PYTHON=1 -I. -I../../src   -Wall -Werror -DLIBDIR=\"<https://builds.apache.org/job/mesos-reviewbot/ws/mesos-0.23.0/_inst/lib\"> -DPKGLIBEXECDIR=\"<https://builds.apache.org/job/mesos-reviewbot/ws/mesos-0.23.0/_inst/libexec/mesos\"> -DPKGDATADIR=\"<https://builds.apache.org/job/mesos-reviewbot/ws/mesos-0.23.0/_inst/share/mesos\"> -I../../include -I../../3rdparty/libprocess/include -I../../3rdparty/libprocess/3rdparty/stout/include -I../include -I../include/mesos -I../3rdparty/libprocess/3rdparty/boost-1.53.0 -I../3rdparty/libprocess/3rdparty/picojson-4f93734 -I../3rdparty/libprocess/3rdparty/protobuf-2.5.0/src -I../3rdparty/libprocess/3rdparty/glog-0.3.3/src -I../3rdparty/libprocess/3rdparty/glog-0.3.3/src -I../3rdparty/leveldb/include -I../3rdparty/zookeeper-3.4.5/src/c/include -I../3rdparty/zookeeper-3.4.5/src/c/generated  -I../3rdparty/libprocess/3rdparty/protobuf-2.5.0/src -DSOURCE_DIR=\"<https://builds.apache.org/job/mesos-reviewbot/ws/mesos-0.23.0/_build/..\"> -DBUILD_DIR=\"<https://builds.apache.org/job/mesos-reviewbot/ws/mesos-0.23.0/_build\"> -I../3rdparty/libprocess/3rdparty/gmock-1.6.0/gtest/include -I../3rdparty/libprocess/3rdparty/gmock-1.6.0/include -I/home/jenkins/tools/java/jdk1.6.0_20-64/include -I/home/jenkins/tools/java/jdk1.6.0_20-64/include/linux -DZOOKEEPER_VERSION=\"3.4.5\" -I/usr/include/subversion-1 -I/usr/include/apr-1 -I/usr/include/apr-1.0  -pthread -g1 -O0 -Wno-unused-local-typedefs -std=c++11 -MT tests/mesos_tests-zookeeper_tests.o -MD -MP -MF tests/.deps/mesos_tests-zookeeper_tests.Tpo -c -o tests/mesos_tests-zookeeper_tests.o `test -f 'tests/zookeeper_tests.cpp' || echo '../../src/'`tests/zookeeper_tests.cpp
mv -f tests/.deps/mesos_tests-zookeeper_test_server.Tpo tests/.deps/mesos_tests-zookeeper_test_server.Po
Building examples.jar ...
make[4]: Nothing to be done for `examples/java/test-framework'.
make[4]: Nothing to be done for `examples/java/test-executor'.
make[4]: Nothing to be done for `examples/java/test-exception-framework'.
make[4]: Nothing to be done for `examples/java/test-multiple-executors-framework'.
make[4]: Nothing to be done for `examples/java/test-log'.
make[4]: Nothing to be done for `../../src/examples/python/test_containerizer.py'.
make[4]: Nothing to be done for `examples/python/test-containerizer'.
make[4]: Nothing to be done for `../../src/examples/python/test_framework.py'.
make[4]: Nothing to be done for `examples/python/test-framework'.
make[4]: Nothing to be done for `../../src/examples/python/test_executor.py'.
make[4]: Nothing to be done for `examples/python/test-executor'.
make[4]: Nothing to be done for `../../src/tests/balloon_framework_test.sh'.
make[4]: Nothing to be done for `../../src/tests/low_level_scheduler_libprocess_test.sh'.
make[4]: Nothing to be done for `../../src/tests/low_level_scheduler_pthread_test.sh'.
make[4]: Nothing to be done for `../../src/tests/java_exception_test.sh'.
make[4]: Nothing to be done for `../../src/tests/java_framework_test.sh'.
make[4]: Nothing to be done for `../../src/tests/java_log_test.sh'.
make[4]: Nothing to be done for `../../src/tests/no_executor_framework_test.sh'.
make[4]: Nothing to be done for `../../src/tests/persistent_volume_framework_test.sh'.
make[4]: Nothing to be done for `../../src/tests/python_framework_test.sh'.
make[4]: Nothing to be done for `../../src/tests/test_framework_test.sh'.
/bin/mkdir -p examples/java
/home/jenkins/tools/java/jdk1.6.0_20-64/bin/javac -source 1.6 -target 1.6			\
          -cp ../3rdparty/zookeeper-3.4.5/zookeeper-3.4.5.jar:<https://builds.apache.org/job/mesos-reviewbot/ws/mesos-0.23.0/_build/src/java/target/protobuf-java-2.5.0.jar>:java/target/mesos-0.23.0.jar:../../src/examples/java	\
          -sourcepath ../../src/examples/java -d examples/java	        \
          ../../src/examples/java/*.java
Note: ../../src/examples/java/TestMultipleExecutorsFramework.java uses or overrides a deprecated API.
Note: Recompile with -Xlint:deprecation for details.
/home/jenkins/tools/java/jdk1.6.0_20-64/bin/jar cf examples.jar -C examples/java .
/bin/bash ../libtool  --tag=CXX   --mode=link g++ -pthread -g1 -O0 -Wno-unused-local-typedefs -std=c++11 -Wl,--as-needed  -o low-level-scheduler-libprocess examples/low_level_scheduler_libprocess-low_level_scheduler_libprocess.o libmesos.la     -lsasl2 -lsvn_delta-1 -lsvn_subr-1 -lapr-1 -lcurl -lz  -lrt
libtool: link: g++ -pthread -g1 -O0 -Wno-unused-local-typedefs -std=c++11 -Wl,--as-needed -o .libs/low-level-scheduler-libprocess examples/low_level_scheduler_libprocess-low_level_scheduler_libprocess.o  ./.libs/libmesos.so -lsasl2 /usr/lib/x86_64-linux-gnu/libsvn_delta-1.so /usr/lib/x86_64-linux-gnu/libsvn_subr-1.so /usr/lib/x86_64-linux-gnu/libapr-1.so /usr/lib/x86_64-linux-gnu/libcurl.so -lz -lrt -pthread -Wl,-rpath -Wl,<https://builds.apache.org/job/mesos-reviewbot/ws/mesos-0.23.0/_inst/lib>
/bin/bash ../libtool  --tag=CXX   --mode=link g++ -pthread -g1 -O0 -Wno-unused-local-typedefs -std=c++11 -Wl,--as-needed  -o low-level-scheduler-pthread examples/low_level_scheduler_pthread-low_level_scheduler_pthread.o libmesos.la     -lsasl2 -lsvn_delta-1 -lsvn_subr-1 -lapr-1 -lcurl -lz  -lrt
libtool: link: g++ -pthread -g1 -O0 -Wno-unused-local-typedefs -std=c++11 -Wl,--as-needed -o .libs/low-level-scheduler-pthread examples/low_level_scheduler_pthread-low_level_scheduler_pthread.o  ./.libs/libmesos.so -lsasl2 /usr/lib/x86_64-linux-gnu/libsvn_delta-1.so /usr/lib/x86_64-linux-gnu/libsvn_subr-1.so /usr/lib/x86_64-linux-gnu/libapr-1.so /usr/lib/x86_64-linux-gnu/libcurl.so -lz -lrt -pthread -Wl,-rpath -Wl,<https://builds.apache.org/job/mesos-reviewbot/ws/mesos-0.23.0/_inst/lib>
/bin/bash ../libtool  --tag=CXX   --mode=link g++ -pthread -g1 -O0 -Wno-unused-local-typedefs -std=c++11 -Wl,--as-needed  -o test-framework examples/test_framework-test_framework.o libmesos.la     -lsasl2 -lsvn_delta-1 -lsvn_subr-1 -lapr-1 -lcurl -lz  -lrt
libtool: link: g++ -pthread -g1 -O0 -Wno-unused-local-typedefs -std=c++11 -Wl,--as-needed -o .libs/test-framework examples/test_framework-test_framework.o  ./.libs/libmesos.so -lsasl2 /usr/lib/x86_64-linux-gnu/libsvn_delta-1.so /usr/lib/x86_64-linux-gnu/libsvn_subr-1.so /usr/lib/x86_64-linux-gnu/libapr-1.so /usr/lib/x86_64-linux-gnu/libcurl.so -lz -lrt -pthread -Wl,-rpath -Wl,<https://builds.apache.org/job/mesos-reviewbot/ws/mesos-0.23.0/_inst/lib>
/bin/bash ../libtool  --tag=CXX   --mode=link g++ -pthread -g1 -O0 -Wno-unused-local-typedefs -std=c++11 -Wl,--as-needed  -o test-executor examples/test_executor-test_executor.o libmesos.la     -lsasl2 -lsvn_delta-1 -lsvn_subr-1 -lapr-1 -lcurl -lz  -lrt
libtool: link: g++ -pthread -g1 -O0 -Wno-unused-local-typedefs -std=c++11 -Wl,--as-needed -o .libs/test-executor examples/test_executor-test_executor.o  ./.libs/libmesos.so -lsasl2 /usr/lib/x86_64-linux-gnu/libsvn_delta-1.so /usr/lib/x86_64-linux-gnu/libsvn_subr-1.so /usr/lib/x86_64-linux-gnu/libapr-1.so /usr/lib/x86_64-linux-gnu/libcurl.so -lz -lrt -pthread -Wl,-rpath -Wl,<https://builds.apache.org/job/mesos-reviewbot/ws/mesos-0.23.0/_inst/lib>
/bin/bash ../libtool  --tag=CXX   --mode=link g++ -pthread -g1 -O0 -Wno-unused-local-typedefs -std=c++11 -Wl,--as-needed  -o long-lived-framework examples/long_lived_framework-long_lived_framework.o libmesos.la     -lsasl2 -lsvn_delta-1 -lsvn_subr-1 -lapr-1 -lcurl -lz  -lrt
libtool: link: g++ -pthread -g1 -O0 -Wno-unused-local-typedefs -std=c++11 -Wl,--as-needed -o .libs/long-lived-framework examples/long_lived_framework-long_lived_framework.o  ./.libs/libmesos.so -lsasl2 /usr/lib/x86_64-linux-gnu/libsvn_delta-1.so /usr/lib/x86_64-linux-gnu/libsvn_subr-1.so /usr/lib/x86_64-linux-gnu/libapr-1.so /usr/lib/x86_64-linux-gnu/libcurl.so -lz -lrt -pthread -Wl,-rpath -Wl,<https://builds.apache.org/job/mesos-reviewbot/ws/mesos-0.23.0/_inst/lib>
mv -f tests/.deps/mesos_tests-zookeeper_tests.Tpo tests/.deps/mesos_tests-zookeeper_tests.Po
/bin/bash ../libtool  --tag=CXX   --mode=link g++ -pthread -g1 -O0 -Wno-unused-local-typedefs -std=c++11 -Wl,--as-needed  -o long-lived-executor examples/long_lived_executor-long_lived_executor.o libmesos.la     -lsasl2 -lsvn_delta-1 -lsvn_subr-1 -lapr-1 -lcurl -lz  -lrt
libtool: link: g++ -pthread -g1 -O0 -Wno-unused-local-typedefs -std=c++11 -Wl,--as-needed -o .libs/long-lived-executor examples/long_lived_executor-long_lived_executor.o  ./.libs/libmesos.so -lsasl2 /usr/lib/x86_64-linux-gnu/libsvn_delta-1.so /usr/lib/x86_64-linux-gnu/libsvn_subr-1.so /usr/lib/x86_64-linux-gnu/libapr-1.so /usr/lib/x86_64-linux-gnu/libcurl.so -lz -lrt -pthread -Wl,-rpath -Wl,<https://builds.apache.org/job/mesos-reviewbot/ws/mesos-0.23.0/_inst/lib>
/bin/bash ../libtool  --tag=CXX   --mode=link g++ -pthread -g1 -O0 -Wno-unused-local-typedefs -std=c++11 -Wl,--as-needed  -o no-executor-framework examples/no_executor_framework-no_executor_framework.o libmesos.la     -lsasl2 -lsvn_delta-1 -lsvn_subr-1 -lapr-1 -lcurl -lz  -lrt
/bin/bash ../libtool  --tag=CXX   --mode=link g++ -pthread -g1 -O0 -Wno-unused-local-typedefs -std=c++11 -Wl,--as-needed  -o docker-no-executor-framework examples/docker_no_executor_framework-docker_no_executor_framework.o libmesos.la     -lsasl2 -lsvn_delta-1 -lsvn_subr-1 -lapr-1 -lcurl -lz  -lrt
mv -f tests/.deps/mesos_tests-registrar_zookeeper_tests.Tpo tests/.deps/mesos_tests-registrar_zookeeper_tests.Po
/bin/bash ../libtool  --tag=CXX   --mode=link g++ -pthread -g1 -O0 -Wno-unused-local-typedefs -std=c++11 -Wl,--as-needed  -o balloon-framework examples/balloon_framework-balloon_framework.o libmesos.la     -lsasl2 -lsvn_delta-1 -lsvn_subr-1 -lapr-1 -lcurl -lz  -lrt
libtool: link: g++ -pthread -g1 -O0 -Wno-unused-local-typedefs -std=c++11 -Wl,--as-needed -o .libs/no-executor-framework examples/no_executor_framework-no_executor_framework.o  ./.libs/libmesos.so -lsasl2 /usr/lib/x86_64-linux-gnu/libsvn_delta-1.so /usr/lib/x86_64-linux-gnu/libsvn_subr-1.so /usr/lib/x86_64-linux-gnu/libapr-1.so /usr/lib/x86_64-linux-gnu/libcurl.so -lz -lrt -pthread -Wl,-rpath -Wl,<https://builds.apache.org/job/mesos-reviewbot/ws/mesos-0.23.0/_inst/lib>
libtool: link: g++ -pthread -g1 -O0 -Wno-unused-local-typedefs -std=c++11 -Wl,--as-needed -o .libs/docker-no-executor-framework examples/docker_no_executor_framework-docker_no_executor_framework.o  ./.libs/libmesos.so -lsasl2 /usr/lib/x86_64-linux-gnu/libsvn_delta-1.so /usr/lib/x86_64-linux-gnu/libsvn_subr-1.so /usr/lib/x86_64-linux-gnu/libapr-1.so /usr/lib/x86_64-linux-gnu/libcurl.so -lz -lrt -pthread -Wl,-rpath -Wl,<https://builds.apache.org/job/mesos-reviewbot/ws/mesos-0.23.0/_inst/lib>
libtool: link: g++ -pthread -g1 -O0 -Wno-unused-local-typedefs -std=c++11 -Wl,--as-needed -o .libs/balloon-framework examples/balloon_framework-balloon_framework.o  ./.libs/libmesos.so -lsasl2 /usr/lib/x86_64-linux-gnu/libsvn_delta-1.so /usr/lib/x86_64-linux-gnu/libsvn_subr-1.so /usr/lib/x86_64-linux-gnu/libapr-1.so /usr/lib/x86_64-linux-gnu/libcurl.so -lz -lrt -pthread -Wl,-rpath -Wl,<https://builds.apache.org/job/mesos-reviewbot/ws/mesos-0.23.0/_inst/lib>
/bin/bash ../libtool  --tag=CXX   --mode=link g++ -pthread -g1 -O0 -Wno-unused-local-typedefs -std=c++11 -Wl,--as-needed  -o balloon-executor examples/balloon_executor-balloon_executor.o libmesos.la     -lsasl2 -lsvn_delta-1 -lsvn_subr-1 -lapr-1 -lcurl -lz  -lrt
/bin/bash ../libtool  --tag=CXX   --mode=link g++ -pthread -g1 -O0 -Wno-unused-local-typedefs -std=c++11 -Wl,--as-needed  -o load-generator-framework examples/load_generator_framework-load_generator_framework.o libmesos.la     -lsasl2 -lsvn_delta-1 -lsvn_subr-1 -lapr-1 -lcurl -lz  -lrt
libtool: link: g++ -pthread -g1 -O0 -Wno-unused-local-typedefs -std=c++11 -Wl,--as-needed -o .libs/balloon-executor examples/balloon_executor-balloon_executor.o  ./.libs/libmesos.so -lsasl2 /usr/lib/x86_64-linux-gnu/libsvn_delta-1.so /usr/lib/x86_64-linux-gnu/libsvn_subr-1.so /usr/lib/x86_64-linux-gnu/libapr-1.so /usr/lib/x86_64-linux-gnu/libcurl.so -lz -lrt -pthread -Wl,-rpath -Wl,<https://builds.apache.org/job/mesos-reviewbot/ws/mesos-0.23.0/_inst/lib>
/bin/bash ../libtool  --tag=CXX   --mode=link g++ -pthread -g1 -O0 -Wno-unused-local-typedefs -std=c++11 -Wl,--as-needed  -o persistent-volume-framework examples/persistent_volume_framework-persistent_volume_framework.o libmesos.la     -lsasl2 -lsvn_delta-1 -lsvn_subr-1 -lapr-1 -lcurl -lz  -lrt
libtool: link: g++ -pthread -g1 -O0 -Wno-unused-local-typedefs -std=c++11 -Wl,--as-needed -o .libs/load-generator-framework examples/load_generator_framework-load_generator_framework.o  ./.libs/libmesos.so -lsasl2 /usr/lib/x86_64-linux-gnu/libsvn_delta-1.so /usr/lib/x86_64-linux-gnu/libsvn_subr-1.so /usr/lib/x86_64-linux-gnu/libapr-1.so /usr/lib/x86_64-linux-gnu/libcurl.so -lz -lrt -pthread -Wl,-rpath -Wl,<https://builds.apache.org/job/mesos-reviewbot/ws/mesos-0.23.0/_inst/lib>
libtool: link: g++ -pthread -g1 -O0 -Wno-unused-local-typedefs -std=c++11 -Wl,--as-needed -o .libs/persistent-volume-framework examples/persistent_volume_framework-persistent_volume_framework.o  ./.libs/libmesos.so -lsasl2 /usr/lib/x86_64-linux-gnu/libsvn_delta-1.so /usr/lib/x86_64-linux-gnu/libsvn_subr-1.so /usr/lib/x86_64-linux-gnu/libapr-1.so /usr/lib/x86_64-linux-gnu/libcurl.so -lz -lrt -pthread -Wl,-rpath -Wl,<https://builds.apache.org/job/mesos-reviewbot/ws/mesos-0.23.0/_inst/lib>
g++ -DPACKAGE_NAME=\"mesos\" -DPACKAGE_TARNAME=\"mesos\" -DPACKAGE_VERSION=\"0.23.0\" -DPACKAGE_STRING=\"mesos\ 0.23.0\" -DPACKAGE_BUGREPORT=\"\" -DPACKAGE_URL=\"\" -DPACKAGE=\"mesos\" -DVERSION=\"0.23.0\" -DSTDC_HEADERS=1 -DHAVE_SYS_TYPES_H=1 -DHAVE_SYS_STAT_H=1 -DHAVE_STDLIB_H=1 -DHAVE_STRING_H=1 -DHAVE_MEMORY_H=1 -DHAVE_STRINGS_H=1 -DHAVE_INTTYPES_H=1 -DHAVE_STDINT_H=1 -DHAVE_UNISTD_H=1 -DHAVE_DLFCN_H=1 -DLT_OBJDIR=\".libs/\" -DHAVE_PTHREAD_PRIO_INHERIT=1 -DHAVE_PTHREAD=1 -DHAVE_LIBZ=1 -DHAVE_LIBCURL=1 -DHAVE_APR_POOLS_H=1 -DHAVE_LIBAPR_1=1 -DHAVE_SVN_VERSION_H=1 -DHAVE_LIBSVN_SUBR_1=1 -DHAVE_SVN_DELTA_H=1 -DHAVE_LIBSVN_DELTA_1=1 -DHAVE_LIBSASL2=1 -DMESOS_HAS_JAVA=1 -DHAVE_PYTHON=\"2.7\" -DMESOS_HAS_PYTHON=1 -I. -I../../src   -Wall -Werror -DLIBDIR=\"<https://builds.apache.org/job/mesos-reviewbot/ws/mesos-0.23.0/_inst/lib\"> -DPKGLIBEXECDIR=\"<https://builds.apache.org/job/mesos-reviewbot/ws/mesos-0.23.0/_inst/libexec/mesos\"> -DPKGDATADIR=\"<https://builds.apache.org/job/mesos-reviewbot/ws/mesos-0.23.0/_inst/share/mesos\"> -I../../include -I../../3rdparty/libprocess/include -I../../3rdparty/libprocess/3rdparty/stout/include -I../include -I../include/mesos -I../3rdparty/libprocess/3rdparty/boost-1.53.0 -I../3rdparty/libprocess/3rdparty/picojson-4f93734 -I../3rdparty/libprocess/3rdparty/protobuf-2.5.0/src -I../3rdparty/libprocess/3rdparty/glog-0.3.3/src -I../3rdparty/libprocess/3rdparty/glog-0.3.3/src -I../3rdparty/leveldb/include -I../3rdparty/zookeeper-3.4.5/src/c/include -I../3rdparty/zookeeper-3.4.5/src/c/generated  -I../3rdparty/libprocess/3rdparty/protobuf-2.5.0/src -I/usr/include/subversion-1 -I/usr/include/apr-1 -I/usr/include/apr-1.0  -pthread -g1 -O0 -Wno-unused-local-typedefs -std=c++11 -MT tests/setns_test_helper-setns_test_helper_main.o -MD -MP -MF tests/.deps/setns_test_helper-setns_test_helper_main.Tpo -c -o tests/setns_test_helper-setns_test_helper_main.o `test -f 'tests/setns_test_helper_main.cpp' || echo '../../src/'`tests/setns_test_helper_main.cpp
g++ -DPACKAGE_NAME=\"mesos\" -DPACKAGE_TARNAME=\"mesos\" -DPACKAGE_VERSION=\"0.23.0\" -DPACKAGE_STRING=\"mesos\ 0.23.0\" -DPACKAGE_BUGREPORT=\"\" -DPACKAGE_URL=\"\" -DPACKAGE=\"mesos\" -DVERSION=\"0.23.0\" -DSTDC_HEADERS=1 -DHAVE_SYS_TYPES_H=1 -DHAVE_SYS_STAT_H=1 -DHAVE_STDLIB_H=1 -DHAVE_STRING_H=1 -DHAVE_MEMORY_H=1 -DHAVE_STRINGS_H=1 -DHAVE_INTTYPES_H=1 -DHAVE_STDINT_H=1 -DHAVE_UNISTD_H=1 -DHAVE_DLFCN_H=1 -DLT_OBJDIR=\".libs/\" -DHAVE_PTHREAD_PRIO_INHERIT=1 -DHAVE_PTHREAD=1 -DHAVE_LIBZ=1 -DHAVE_LIBCURL=1 -DHAVE_APR_POOLS_H=1 -DHAVE_LIBAPR_1=1 -DHAVE_SVN_VERSION_H=1 -DHAVE_LIBSVN_SUBR_1=1 -DHAVE_SVN_DELTA_H=1 -DHAVE_LIBSVN_DELTA_1=1 -DHAVE_LIBSASL2=1 -DMESOS_HAS_JAVA=1 -DHAVE_PYTHON=\"2.7\" -DMESOS_HAS_PYTHON=1 -I. -I../../src   -Wall -Werror -DLIBDIR=\"<https://builds.apache.org/job/mesos-reviewbot/ws/mesos-0.23.0/_inst/lib\"> -DPKGLIBEXECDIR=\"<https://builds.apache.org/job/mesos-reviewbot/ws/mesos-0.23.0/_inst/libexec/mesos\"> -DPKGDATADIR=\"<https://builds.apache.org/job/mesos-reviewbot/ws/mesos-0.23.0/_inst/share/mesos\"> -I../../include -I../../3rdparty/libprocess/include -I../../3rdparty/libprocess/3rdparty/stout/include -I../include -I../include/mesos -I../3rdparty/libprocess/3rdparty/boost-1.53.0 -I../3rdparty/libprocess/3rdparty/picojson-4f93734 -I../3rdparty/libprocess/3rdparty/protobuf-2.5.0/src -I../3rdparty/libprocess/3rdparty/glog-0.3.3/src -I../3rdparty/libprocess/3rdparty/glog-0.3.3/src -I../3rdparty/leveldb/include -I../3rdparty/zookeeper-3.4.5/src/c/include -I../3rdparty/zookeeper-3.4.5/src/c/generated  -I../3rdparty/libprocess/3rdparty/protobuf-2.5.0/src -I/usr/include/subversion-1 -I/usr/include/apr-1 -I/usr/include/apr-1.0  -pthread -g1 -O0 -Wno-unused-local-typedefs -std=c++11 -MT tests/setns_test_helper-setns_test_helper.o -MD -MP -MF tests/.deps/setns_test_helper-setns_test_helper.Tpo -c -o tests/setns_test_helper-setns_test_helper.o `test -f 'tests/setns_test_helper.cpp' || echo '../../src/'`tests/setns_test_helper.cpp
g++ -DPACKAGE_NAME=\"mesos\" -DPACKAGE_TARNAME=\"mesos\" -DPACKAGE_VERSION=\"0.23.0\" -DPACKAGE_STRING=\"mesos\ 0.23.0\" -DPACKAGE_BUGREPORT=\"\" -DPACKAGE_URL=\"\" -DPACKAGE=\"mesos\" -DVERSION=\"0.23.0\" -DSTDC_HEADERS=1 -DHAVE_SYS_TYPES_H=1 -DHAVE_SYS_STAT_H=1 -DHAVE_STDLIB_H=1 -DHAVE_STRING_H=1 -DHAVE_MEMORY_H=1 -DHAVE_STRINGS_H=1 -DHAVE_INTTYPES_H=1 -DHAVE_STDINT_H=1 -DHAVE_UNISTD_H=1 -DHAVE_DLFCN_H=1 -DLT_OBJDIR=\".libs/\" -DHAVE_PTHREAD_PRIO_INHERIT=1 -DHAVE_PTHREAD=1 -DHAVE_LIBZ=1 -DHAVE_LIBCURL=1 -DHAVE_APR_POOLS_H=1 -DHAVE_LIBAPR_1=1 -DHAVE_SVN_VERSION_H=1 -DHAVE_LIBSVN_SUBR_1=1 -DHAVE_SVN_DELTA_H=1 -DHAVE_LIBSVN_DELTA_1=1 -DHAVE_LIBSASL2=1 -DMESOS_HAS_JAVA=1 -DHAVE_PYTHON=\"2.7\" -DMESOS_HAS_PYTHON=1 -I. -I../../src   -Wall -Werror -DLIBDIR=\"<https://builds.apache.org/job/mesos-reviewbot/ws/mesos-0.23.0/_inst/lib\"> -DPKGLIBEXECDIR=\"<https://builds.apache.org/job/mesos-reviewbot/ws/mesos-0.23.0/_inst/libexec/mesos\"> -DPKGDATADIR=\"<https://builds.apache.org/job/mesos-reviewbot/ws/mesos-0.23.0/_inst/share/mesos\"> -I../../include -I../../3rdparty/libprocess/include -I../../3rdparty/libprocess/3rdparty/stout/include -I../include -I../include/mesos -I../3rdparty/libprocess/3rdparty/boost-1.53.0 -I../3rdparty/libprocess/3rdparty/picojson-4f93734 -I../3rdparty/libprocess/3rdparty/protobuf-2.5.0/src -I../3rdparty/libprocess/3rdparty/glog-0.3.3/src -I../3rdparty/libprocess/3rdparty/glog-0.3.3/src -I../3rdparty/leveldb/include -I../3rdparty/zookeeper-3.4.5/src/c/include -I../3rdparty/zookeeper-3.4.5/src/c/generated  -I../3rdparty/libprocess/3rdparty/protobuf-2.5.0/src -DSOURCE_DIR=\"<https://builds.apache.org/job/mesos-reviewbot/ws/mesos-0.23.0/_build/..\"> -DBUILD_DIR=\"<https://builds.apache.org/job/mesos-reviewbot/ws/mesos-0.23.0/_build\"> -I../3rdparty/libprocess/3rdparty/gmock-1.6.0/gtest/include -I../3rdparty/libprocess/3rdparty/gmock-1.6.0/include -I/home/jenkins/tools/java/jdk1.6.0_20-64/include -I/home/jenkins/tools/java/jdk1.6.0_20-64/include/linux -DZOOKEEPER_VERSION=\"3.4.5\" -I/usr/include/subversion-1 -I/usr/include/apr-1 -I/usr/include/apr-1.0  -pthread -g1 -O0 -Wno-unused-local-typedefs -std=c++11 -MT tests/memory_test_helper-flags.o -MD -MP -MF tests/.deps/memory_test_helper-flags.Tpo -c -o tests/memory_test_helper-flags.o `test -f 'tests/flags.cpp' || echo '../../src/'`tests/flags.cpp
mv -f tests/.deps/setns_test_helper-setns_test_helper_main.Tpo tests/.deps/setns_test_helper-setns_test_helper_main.Po
g++ -DPACKAGE_NAME=\"mesos\" -DPACKAGE_TARNAME=\"mesos\" -DPACKAGE_VERSION=\"0.23.0\" -DPACKAGE_STRING=\"mesos\ 0.23.0\" -DPACKAGE_BUGREPORT=\"\" -DPACKAGE_URL=\"\" -DPACKAGE=\"mesos\" -DVERSION=\"0.23.0\" -DSTDC_HEADERS=1 -DHAVE_SYS_TYPES_H=1 -DHAVE_SYS_STAT_H=1 -DHAVE_STDLIB_H=1 -DHAVE_STRING_H=1 -DHAVE_MEMORY_H=1 -DHAVE_STRINGS_H=1 -DHAVE_INTTYPES_H=1 -DHAVE_STDINT_H=1 -DHAVE_UNISTD_H=1 -DHAVE_DLFCN_H=1 -DLT_OBJDIR=\".libs/\" -DHAVE_PTHREAD_PRIO_INHERIT=1 -DHAVE_PTHREAD=1 -DHAVE_LIBZ=1 -DHAVE_LIBCURL=1 -DHAVE_APR_POOLS_H=1 -DHAVE_LIBAPR_1=1 -DHAVE_SVN_VERSION_H=1 -DHAVE_LIBSVN_SUBR_1=1 -DHAVE_SVN_DELTA_H=1 -DHAVE_LIBSVN_DELTA_1=1 -DHAVE_LIBSASL2=1 -DMESOS_HAS_JAVA=1 -DHAVE_PYTHON=\"2.7\" -DMESOS_HAS_PYTHON=1 -I. -I../../src   -Wall -Werror -DLIBDIR=\"<https://builds.apache.org/job/mesos-reviewbot/ws/mesos-0.23.0/_inst/lib\"> -DPKGLIBEXECDIR=\"<https://builds.apache.org/job/mesos-reviewbot/ws/mesos-0.23.0/_inst/libexec/mesos\"> -DPKGDATADIR=\"<https://builds.apache.org/job/mesos-reviewbot/ws/mesos-0.23.0/_inst/share/mesos\"> -I../../include -I../../3rdparty/libprocess/include -I../../3rdparty/libprocess/3rdparty/stout/include -I../include -I../include/mesos -I../3rdparty/libprocess/3rdparty/boost-1.53.0 -I../3rdparty/libprocess/3rdparty/picojson-4f93734 -I../3rdparty/libprocess/3rdparty/protobuf-2.5.0/src -I../3rdparty/libprocess/3rdparty/glog-0.3.3/src -I../3rdparty/libprocess/3rdparty/glog-0.3.3/src -I../3rdparty/leveldb/include -I../3rdparty/zookeeper-3.4.5/src/c/include -I../3rdparty/zookeeper-3.4.5/src/c/generated  -I../3rdparty/libprocess/3rdparty/protobuf-2.5.0/src -DSOURCE_DIR=\"<https://builds.apache.org/job/mesos-reviewbot/ws/mesos-0.23.0/_build/..\"> -DBUILD_DIR=\"<https://builds.apache.org/job/mesos-reviewbot/ws/mesos-0.23.0/_build\"> -I../3rdparty/libprocess/3rdparty/gmock-1.6.0/gtest/include -I../3rdparty/libprocess/3rdparty/gmock-1.6.0/include -I/home/jenkins/tools/java/jdk1.6.0_20-64/include -I/home/jenkins/tools/java/jdk1.6.0_20-64/include/linux -DZOOKEEPER_VERSION=\"3.4.5\" -I/usr/include/subversion-1 -I/usr/include/apr-1 -I/usr/include/apr-1.0  -pthread -g1 -O0 -Wno-unused-local-typedefs -std=c++11 -MT tests/memory_test_helper-memory_test_helper_main.o -MD -MP -MF tests/.deps/memory_test_helper-memory_test_helper_main.Tpo -c -o tests/memory_test_helper-memory_test_helper_main.o `test -f 'tests/memory_test_helper_main.cpp' || echo '../../src/'`tests/memory_test_helper_main.cpp
mv -f tests/.deps/memory_test_helper-flags.Tpo tests/.deps/memory_test_helper-flags.Po
g++ -DPACKAGE_NAME=\"mesos\" -DPACKAGE_TARNAME=\"mesos\" -DPACKAGE_VERSION=\"0.23.0\" -DPACKAGE_STRING=\"mesos\ 0.23.0\" -DPACKAGE_BUGREPORT=\"\" -DPACKAGE_URL=\"\" -DPACKAGE=\"mesos\" -DVERSION=\"0.23.0\" -DSTDC_HEADERS=1 -DHAVE_SYS_TYPES_H=1 -DHAVE_SYS_STAT_H=1 -DHAVE_STDLIB_H=1 -DHAVE_STRING_H=1 -DHAVE_MEMORY_H=1 -DHAVE_STRINGS_H=1 -DHAVE_INTTYPES_H=1 -DHAVE_STDINT_H=1 -DHAVE_UNISTD_H=1 -DHAVE_DLFCN_H=1 -DLT_OBJDIR=\".libs/\" -DHAVE_PTHREAD_PRIO_INHERIT=1 -DHAVE_PTHREAD=1 -DHAVE_LIBZ=1 -DHAVE_LIBCURL=1 -DHAVE_APR_POOLS_H=1 -DHAVE_LIBAPR_1=1 -DHAVE_SVN_VERSION_H=1 -DHAVE_LIBSVN_SUBR_1=1 -DHAVE_SVN_DELTA_H=1 -DHAVE_LIBSVN_DELTA_1=1 -DHAVE_LIBSASL2=1 -DMESOS_HAS_JAVA=1 -DHAVE_PYTHON=\"2.7\" -DMESOS_HAS_PYTHON=1 -I. -I../../src   -Wall -Werror -DLIBDIR=\"<https://builds.apache.org/job/mesos-reviewbot/ws/mesos-0.23.0/_inst/lib\"> -DPKGLIBEXECDIR=\"<https://builds.apache.org/job/mesos-reviewbot/ws/mesos-0.23.0/_inst/libexec/mesos\"> -DPKGDATADIR=\"<https://builds.apache.org/job/mesos-reviewbot/ws/mesos-0.23.0/_inst/share/mesos\"> -I../../include -I../../3rdparty/libprocess/include -I../../3rdparty/libprocess/3rdparty/stout/include -I../include -I../include/mesos -I../3rdparty/libprocess/3rdparty/boost-1.53.0 -I../3rdparty/libprocess/3rdparty/picojson-4f93734 -I../3rdparty/libprocess/3rdparty/protobuf-2.5.0/src -I../3rdparty/libprocess/3rdparty/glog-0.3.3/src -I../3rdparty/libprocess/3rdparty/glog-0.3.3/src -I../3rdparty/leveldb/include -I../3rdparty/zookeeper-3.4.5/src/c/include -I../3rdparty/zookeeper-3.4.5/src/c/generated  -I../3rdparty/libprocess/3rdparty/protobuf-2.5.0/src -DSOURCE_DIR=\"<https://builds.apache.org/job/mesos-reviewbot/ws/mesos-0.23.0/_build/..\"> -DBUILD_DIR=\"<https://builds.apache.org/job/mesos-reviewbot/ws/mesos-0.23.0/_build\"> -I../3rdparty/libprocess/3rdparty/gmock-1.6.0/gtest/include -I../3rdparty/libprocess/3rdparty/gmock-1.6.0/include -I/home/jenkins/tools/java/jdk1.6.0_20-64/include -I/home/jenkins/tools/java/jdk1.6.0_20-64/include/linux -DZOOKEEPER_VERSION=\"3.4.5\" -I/usr/include/subversion-1 -I/usr/include/apr-1 -I/usr/include/apr-1.0  -pthread -g1 -O0 -Wno-unused-local-typedefs -std=c++11 -MT tests/memory_test_helper-memory_test_helper.o -MD -MP -MF tests/.deps/memory_test_helper-memory_test_helper.Tpo -c -o tests/memory_test_helper-memory_test_helper.o `test -f 'tests/memory_test_helper.cpp' || echo '../../src/'`tests/memory_test_helper.cpp
mv -f tests/.deps/setns_test_helper-setns_test_helper.Tpo tests/.deps/setns_test_helper-setns_test_helper.Po
g++ -DPACKAGE_NAME=\"mesos\" -DPACKAGE_TARNAME=\"mesos\" -DPACKAGE_VERSION=\"0.23.0\" -DPACKAGE_STRING=\"mesos\ 0.23.0\" -DPACKAGE_BUGREPORT=\"\" -DPACKAGE_URL=\"\" -DPACKAGE=\"mesos\" -DVERSION=\"0.23.0\" -DSTDC_HEADERS=1 -DHAVE_SYS_TYPES_H=1 -DHAVE_SYS_STAT_H=1 -DHAVE_STDLIB_H=1 -DHAVE_STRING_H=1 -DHAVE_MEMORY_H=1 -DHAVE_STRINGS_H=1 -DHAVE_INTTYPES_H=1 -DHAVE_STDINT_H=1 -DHAVE_UNISTD_H=1 -DHAVE_DLFCN_H=1 -DLT_OBJDIR=\".libs/\" -DHAVE_PTHREAD_PRIO_INHERIT=1 -DHAVE_PTHREAD=1 -DHAVE_LIBZ=1 -DHAVE_LIBCURL=1 -DHAVE_APR_POOLS_H=1 -DHAVE_LIBAPR_1=1 -DHAVE_SVN_VERSION_H=1 -DHAVE_LIBSVN_SUBR_1=1 -DHAVE_SVN_DELTA_H=1 -DHAVE_LIBSVN_DELTA_1=1 -DHAVE_LIBSASL2=1 -DMESOS_HAS_JAVA=1 -DHAVE_PYTHON=\"2.7\" -DMESOS_HAS_PYTHON=1 -I. -I../../src   -Wall -Werror -DLIBDIR=\"<https://builds.apache.org/job/mesos-reviewbot/ws/mesos-0.23.0/_inst/lib\"> -DPKGLIBEXECDIR=\"<https://builds.apache.org/job/mesos-reviewbot/ws/mesos-0.23.0/_inst/libexec/mesos\"> -DPKGDATADIR=\"<https://builds.apache.org/job/mesos-reviewbot/ws/mesos-0.23.0/_inst/share/mesos\"> -I../../include -I../../3rdparty/libprocess/include -I../../3rdparty/libprocess/3rdparty/stout/include -I../include -I../include/mesos -I../3rdparty/libprocess/3rdparty/boost-1.53.0 -I../3rdparty/libprocess/3rdparty/picojson-4f93734 -I../3rdparty/libprocess/3rdparty/protobuf-2.5.0/src -I../3rdparty/libprocess/3rdparty/glog-0.3.3/src -I../3rdparty/libprocess/3rdparty/glog-0.3.3/src -I../3rdparty/leveldb/include -I../3rdparty/zookeeper-3.4.5/src/c/include -I../3rdparty/zookeeper-3.4.5/src/c/generated  -I../3rdparty/libprocess/3rdparty/protobuf-2.5.0/src -I/usr/include/subversion-1 -I/usr/include/apr-1 -I/usr/include/apr-1.0  -pthread -g1 -O0 -Wno-unused-local-typedefs -std=c++11 -MT tests/active_user_test_helper-active_user_test_helper.o -MD -MP -MF tests/.deps/active_user_test_helper-active_user_test_helper.Tpo -c -o tests/active_user_test_helper-active_user_test_helper.o `test -f 'tests/active_user_test_helper.cpp' || echo '../../src/'`tests/active_user_test_helper.cpp
mv -f tests/.deps/memory_test_helper-memory_test_helper_main.Tpo tests/.deps/memory_test_helper-memory_test_helper_main.Po
g++ -DPACKAGE_NAME=\"mesos\" -DPACKAGE_TARNAME=\"mesos\" -DPACKAGE_VERSION=\"0.23.0\" -DPACKAGE_STRING=\"mesos\ 0.23.0\" -DPACKAGE_BUGREPORT=\"\" -DPACKAGE_URL=\"\" -DPACKAGE=\"mesos\" -DVERSION=\"0.23.0\" -DSTDC_HEADERS=1 -DHAVE_SYS_TYPES_H=1 -DHAVE_SYS_STAT_H=1 -DHAVE_STDLIB_H=1 -DHAVE_STRING_H=1 -DHAVE_MEMORY_H=1 -DHAVE_STRINGS_H=1 -DHAVE_INTTYPES_H=1 -DHAVE_STDINT_H=1 -DHAVE_UNISTD_H=1 -DHAVE_DLFCN_H=1 -DLT_OBJDIR=\".libs/\" -DHAVE_PTHREAD_PRIO_INHERIT=1 -DHAVE_PTHREAD=1 -DHAVE_LIBZ=1 -DHAVE_LIBCURL=1 -DHAVE_APR_POOLS_H=1 -DHAVE_LIBAPR_1=1 -DHAVE_SVN_VERSION_H=1 -DHAVE_LIBSVN_SUBR_1=1 -DHAVE_SVN_DELTA_H=1 -DHAVE_LIBSVN_DELTA_1=1 -DHAVE_LIBSASL2=1 -DMESOS_HAS_JAVA=1 -DHAVE_PYTHON=\"2.7\" -DMESOS_HAS_PYTHON=1 -I. -I../../src   -Wall -Werror -DLIBDIR=\"<https://builds.apache.org/job/mesos-reviewbot/ws/mesos-0.23.0/_inst/lib\"> -DPKGLIBEXECDIR=\"<https://builds.apache.org/job/mesos-reviewbot/ws/mesos-0.23.0/_inst/libexec/mesos\"> -DPKGDATADIR=\"<https://builds.apache.org/job/mesos-reviewbot/ws/mesos-0.23.0/_inst/share/mesos\"> -I../../include -I../../3rdparty/libprocess/include -I../../3rdparty/libprocess/3rdparty/stout/include -I../include -I../include/mesos -I../3rdparty/libprocess/3rdparty/boost-1.53.0 -I../3rdparty/libprocess/3rdparty/picojson-4f93734 -I../3rdparty/libprocess/3rdparty/protobuf-2.5.0/src -I../3rdparty/libprocess/3rdparty/glog-0.3.3/src -I../3rdparty/libprocess/3rdparty/glog-0.3.3/src -I../3rdparty/leveldb/include -I../3rdparty/zookeeper-3.4.5/src/c/include -I../3rdparty/zookeeper-3.4.5/src/c/generated  -I../3rdparty/libprocess/3rdparty/protobuf-2.5.0/src -DSOURCE_DIR=\"<https://builds.apache.org/job/mesos-reviewbot/ws/mesos-0.23.0/_build/..\"> -DBUILD_DIR=\"<https://builds.apache.org/job/mesos-reviewbot/ws/mesos-0.23.0/_build\"> -I../3rdparty/libprocess/3rdparty/gmock-1.6.0/gtest/include -I../3rdparty/libprocess/3rdparty/gmock-1.6.0/include -I/home/jenkins/tools/java/jdk1.6.0_20-64/include -I/home/jenkins/tools/java/jdk1.6.0_20-64/include/linux -DZOOKEEPER_VERSION=\"3.4.5\" -I/usr/include/subversion-1 -I/usr/include/apr-1 -I/usr/include/apr-1.0  -pthread -g1 -O0 -Wno-unused-local-typedefs -std=c++11 -MT tests/mesos_tests-anonymous_tests.o -MD -MP -MF tests/.deps/mesos_tests-anonymous_tests.Tpo -c -o tests/mesos_tests-anonymous_tests.o `test -f 'tests/anonymous_tests.cpp' || echo '../../src/'`tests/anonymous_tests.cpp
mv -f tests/.deps/active_user_test_helper-active_user_test_helper.Tpo tests/.deps/active_user_test_helper-active_user_test_helper.Po
g++ -DPACKAGE_NAME=\"mesos\" -DPACKAGE_TARNAME=\"mesos\" -DPACKAGE_VERSION=\"0.23.0\" -DPACKAGE_STRING=\"mesos\ 0.23.0\" -DPACKAGE_BUGREPORT=\"\" -DPACKAGE_URL=\"\" -DPACKAGE=\"mesos\" -DVERSION=\"0.23.0\" -DSTDC_HEADERS=1 -DHAVE_SYS_TYPES_H=1 -DHAVE_SYS_STAT_H=1 -DHAVE_STDLIB_H=1 -DHAVE_STRING_H=1 -DHAVE_MEMORY_H=1 -DHAVE_STRINGS_H=1 -DHAVE_INTTYPES_H=1 -DHAVE_STDINT_H=1 -DHAVE_UNISTD_H=1 -DHAVE_DLFCN_H=1 -DLT_OBJDIR=\".libs/\" -DHAVE_PTHREAD_PRIO_INHERIT=1 -DHAVE_PTHREAD=1 -DHAVE_LIBZ=1 -DHAVE_LIBCURL=1 -DHAVE_APR_POOLS_H=1 -DHAVE_LIBAPR_1=1 -DHAVE_SVN_VERSION_H=1 -DHAVE_LIBSVN_SUBR_1=1 -DHAVE_SVN_DELTA_H=1 -DHAVE_LIBSVN_DELTA_1=1 -DHAVE_LIBSASL2=1 -DMESOS_HAS_JAVA=1 -DHAVE_PYTHON=\"2.7\" -DMESOS_HAS_PYTHON=1 -I. -I../../src   -Wall -Werror -DLIBDIR=\"<https://builds.apache.org/job/mesos-reviewbot/ws/mesos-0.23.0/_inst/lib\"> -DPKGLIBEXECDIR=\"<https://builds.apache.org/job/mesos-reviewbot/ws/mesos-0.23.0/_inst/libexec/mesos\"> -DPKGDATADIR=\"<https://builds.apache.org/job/mesos-reviewbot/ws/mesos-0.23.0/_inst/share/mesos\"> -I../../include -I../../3rdparty/libprocess/include -I../../3rdparty/libprocess/3rdparty/stout/include -I../include -I../include/mesos -I../3rdparty/libprocess/3rdparty/boost-1.53.0 -I../3rdparty/libprocess/3rdparty/picojson-4f93734 -I../3rdparty/libprocess/3rdparty/protobuf-2.5.0/src -I../3rdparty/libprocess/3rdparty/glog-0.3.3/src -I../3rdparty/libprocess/3rdparty/glog-0.3.3/src -I../3rdparty/leveldb/include -I../3rdparty/zookeeper-3.4.5/src/c/include -I../3rdparty/zookeeper-3.4.5/src/c/generated  -I../3rdparty/libprocess/3rdparty/protobuf-2.5.0/src -DSOURCE_DIR=\"<https://builds.apache.org/job/mesos-reviewbot/ws/mesos-0.23.0/_build/..\"> -DBUILD_DIR=\"<https://builds.apache.org/job/mesos-reviewbot/ws/mesos-0.23.0/_build\"> -I../3rdparty/libprocess/3rdparty/gmock-1.6.0/gtest/include -I../3rdparty/libprocess/3rdparty/gmock-1.6.0/include -I/home/jenkins/tools/java/jdk1.6.0_20-64/include -I/home/jenkins/tools/java/jdk1.6.0_20-64/include/linux -DZOOKEEPER_VERSION=\"3.4.5\" -I/usr/include/subversion-1 -I/usr/include/apr-1 -I/usr/include/apr-1.0  -pthread -g1 -O0 -Wno-unused-local-typedefs -std=c++11 -MT tests/mesos_tests-attributes_tests.o -MD -MP -MF tests/.deps/mesos_tests-attributes_tests.Tpo -c -o tests/mesos_tests-attributes_tests.o `test -f 'tests/attributes_tests.cpp' || echo '../../src/'`tests/attributes_tests.cpp
mv -f tests/.deps/mesos_tests-attributes_tests.Tpo tests/.deps/mesos_tests-attributes_tests.Po
g++ -DPACKAGE_NAME=\"mesos\" -DPACKAGE_TARNAME=\"mesos\" -DPACKAGE_VERSION=\"0.23.0\" -DPACKAGE_STRING=\"mesos\ 0.23.0\" -DPACKAGE_BUGREPORT=\"\" -DPACKAGE_URL=\"\" -DPACKAGE=\"mesos\" -DVERSION=\"0.23.0\" -DSTDC_HEADERS=1 -DHAVE_SYS_TYPES_H=1 -DHAVE_SYS_STAT_H=1 -DHAVE_STDLIB_H=1 -DHAVE_STRING_H=1 -DHAVE_MEMORY_H=1 -DHAVE_STRINGS_H=1 -DHAVE_INTTYPES_H=1 -DHAVE_STDINT_H=1 -DHAVE_UNISTD_H=1 -DHAVE_DLFCN_H=1 -DLT_OBJDIR=\".libs/\" -DHAVE_PTHREAD_PRIO_INHERIT=1 -DHAVE_PTHREAD=1 -DHAVE_LIBZ=1 -DHAVE_LIBCURL=1 -DHAVE_APR_POOLS_H=1 -DHAVE_LIBAPR_1=1 -DHAVE_SVN_VERSION_H=1 -DHAVE_LIBSVN_SUBR_1=1 -DHAVE_SVN_DELTA_H=1 -DHAVE_LIBSVN_DELTA_1=1 -DHAVE_LIBSASL2=1 -DMESOS_HAS_JAVA=1 -DHAVE_PYTHON=\"2.7\" -DMESOS_HAS_PYTHON=1 -I. -I../../src   -Wall -Werror -DLIBDIR=\"<https://builds.apache.org/job/mesos-reviewbot/ws/mesos-0.23.0/_inst/lib\"> -DPKGLIBEXECDIR=\"<https://builds.apache.org/job/mesos-reviewbot/ws/mesos-0.23.0/_inst/libexec/mesos\"> -DPKGDATADIR=\"<https://builds.apache.org/job/mesos-reviewbot/ws/mesos-0.23.0/_inst/share/mesos\"> -I../../include -I../../3rdparty/libprocess/include -I../../3rdparty/libprocess/3rdparty/stout/include -I../include -I../include/mesos -I../3rdparty/libprocess/3rdparty/boost-1.53.0 -I../3rdparty/libprocess/3rdparty/picojson-4f93734 -I../3rdparty/libprocess/3rdparty/protobuf-2.5.0/src -I../3rdparty/libprocess/3rdparty/glog-0.3.3/src -I../3rdparty/libprocess/3rdparty/glog-0.3.3/src -I../3rdparty/leveldb/include -I../3rdparty/zookeeper-3.4.5/src/c/include -I../3rdparty/zookeeper-3.4.5/src/c/generated  -I../3rdparty/libprocess/3rdparty/protobuf-2.5.0/src -DSOURCE_DIR=\"<https://builds.apache.org/job/mesos-reviewbot/ws/mesos-0.23.0/_build/..\"> -DBUILD_DIR=\"<https://builds.apache.org/job/mesos-reviewbot/ws/mesos-0.23.0/_build\"> -I../3rdparty/libprocess/3rdparty/gmock-1.6.0/gtest/include -I../3rdparty/libprocess/3rdparty/gmock-1.6.0/include -I/home/jenkins/tools/java/jdk1.6.0_20-64/include -I/home/jenkins/tools/java/jdk1.6.0_20-64/include/linux -DZOOKEEPER_VERSION=\"3.4.5\" -I/usr/include/subversion-1 -I/usr/include/apr-1 -I/usr/include/apr-1.0  -pthread -g1 -O0 -Wno-unused-local-typedefs -std=c++11 -MT tests/mesos_tests-authentication_tests.o -MD -MP -MF tests/.deps/mesos_tests-authentication_tests.Tpo -c -o tests/mesos_tests-authentication_tests.o `test -f 'tests/authentication_tests.cpp' || echo '../../src/'`tests/authentication_tests.cpp
mv -f tests/.deps/memory_test_helper-memory_test_helper.Tpo tests/.deps/memory_test_helper-memory_test_helper.Po
g++ -DPACKAGE_NAME=\"mesos\" -DPACKAGE_TARNAME=\"mesos\" -DPACKAGE_VERSION=\"0.23.0\" -DPACKAGE_STRING=\"mesos\ 0.23.0\" -DPACKAGE_BUGREPORT=\"\" -DPACKAGE_URL=\"\" -DPACKAGE=\"mesos\" -DVERSION=\"0.23.0\" -DSTDC_HEADERS=1 -DHAVE_SYS_TYPES_H=1 -DHAVE_SYS_STAT_H=1 -DHAVE_STDLIB_H=1 -DHAVE_STRING_H=1 -DHAVE_MEMORY_H=1 -DHAVE_STRINGS_H=1 -DHAVE_INTTYPES_H=1 -DHAVE_STDINT_H=1 -DHAVE_UNISTD_H=1 -DHAVE_DLFCN_H=1 -DLT_OBJDIR=\".libs/\" -DHAVE_PTHREAD_PRIO_INHERIT=1 -DHAVE_PTHREAD=1 -DHAVE_LIBZ=1 -DHAVE_LIBCURL=1 -DHAVE_APR_POOLS_H=1 -DHAVE_LIBAPR_1=1 -DHAVE_SVN_VERSION_H=1 -DHAVE_LIBSVN_SUBR_1=1 -DHAVE_SVN_DELTA_H=1 -DHAVE_LIBSVN_DELTA_1=1 -DHAVE_LIBSASL2=1 -DMESOS_HAS_JAVA=1 -DHAVE_PYTHON=\"2.7\" -DMESOS_HAS_PYTHON=1 -I. -I../../src   -Wall -Werror -DLIBDIR=\"<https://builds.apache.org/job/mesos-reviewbot/ws/mesos-0.23.0/_inst/lib\"> -DPKGLIBEXECDIR=\"<https://builds.apache.org/job/mesos-reviewbot/ws/mesos-0.23.0/_inst/libexec/mesos\"> -DPKGDATADIR=\"<https://builds.apache.org/job/mesos-reviewbot/ws/mesos-0.23.0/_inst/share/mesos\"> -I../../include -I../../3rdparty/libprocess/include -I../../3rdparty/libprocess/3rdparty/stout/include -I../include -I../include/mesos -I../3rdparty/libprocess/3rdparty/boost-1.53.0 -I../3rdparty/libprocess/3rdparty/picojson-4f93734 -I../3rdparty/libprocess/3rdparty/protobuf-2.5.0/src -I../3rdparty/libprocess/3rdparty/glog-0.3.3/src -I../3rdparty/libprocess/3rdparty/glog-0.3.3/src -I../3rdparty/leveldb/include -I../3rdparty/zookeeper-3.4.5/src/c/include -I../3rdparty/zookeeper-3.4.5/src/c/generated  -I../3rdparty/libprocess/3rdparty/protobuf-2.5.0/src -DSOURCE_DIR=\"<https://builds.apache.org/job/mesos-reviewbot/ws/mesos-0.23.0/_build/..\"> -DBUILD_DIR=\"<https://builds.apache.org/job/mesos-reviewbot/ws/mesos-0.23.0/_build\"> -I../3rdparty/libprocess/3rdparty/gmock-1.6.0/gtest/include -I../3rdparty/libprocess/3rdparty/gmock-1.6.0/include -I/home/jenkins/tools/java/jdk1.6.0_20-64/include -I/home/jenkins/tools/java/jdk1.6.0_20-64/include/linux -DZOOKEEPER_VERSION=\"3.4.5\" -I/usr/include/subversion-1 -I/usr/include/apr-1 -I/usr/include/apr-1.0  -pthread -g1 -O0 -Wno-unused-local-typedefs -std=c++11 -MT tests/mesos_tests-authorization_tests.o -MD -MP -MF tests/.deps/mesos_tests-authorization_tests.Tpo -c -o tests/mesos_tests-authorization_tests.o `test -f 'tests/authorization_tests.cpp' || echo '../../src/'`tests/authorization_tests.cpp
mv -f tests/.deps/mesos_tests-anonymous_tests.Tpo tests/.deps/mesos_tests-anonymous_tests.Po
g++ -DPACKAGE_NAME=\"mesos\" -DPACKAGE_TARNAME=\"mesos\" -DPACKAGE_VERSION=\"0.23.0\" -DPACKAGE_STRING=\"mesos\ 0.23.0\" -DPACKAGE_BUGREPORT=\"\" -DPACKAGE_URL=\"\" -DPACKAGE=\"mesos\" -DVERSION=\"0.23.0\" -DSTDC_HEADERS=1 -DHAVE_SYS_TYPES_H=1 -DHAVE_SYS_STAT_H=1 -DHAVE_STDLIB_H=1 -DHAVE_STRING_H=1 -DHAVE_MEMORY_H=1 -DHAVE_STRINGS_H=1 -DHAVE_INTTYPES_H=1 -DHAVE_STDINT_H=1 -DHAVE_UNISTD_H=1 -DHAVE_DLFCN_H=1 -DLT_OBJDIR=\".libs/\" -DHAVE_PTHREAD_PRIO_INHERIT=1 -DHAVE_PTHREAD=1 -DHAVE_LIBZ=1 -DHAVE_LIBCURL=1 -DHAVE_APR_POOLS_H=1 -DHAVE_LIBAPR_1=1 -DHAVE_SVN_VERSION_H=1 -DHAVE_LIBSVN_SUBR_1=1 -DHAVE_SVN_DELTA_H=1 -DHAVE_LIBSVN_DELTA_1=1 -DHAVE_LIBSASL2=1 -DMESOS_HAS_JAVA=1 -DHAVE_PYTHON=\"2.7\" -DMESOS_HAS_PYTHON=1 -I. -I../../src   -Wall -Werror -DLIBDIR=\"<https://builds.apache.org/job/mesos-reviewbot/ws/mesos-0.23.0/_inst/lib\"> -DPKGLIBEXECDIR=\"<https://builds.apache.org/job/mesos-reviewbot/ws/mesos-0.23.0/_inst/libexec/mesos\"> -DPKGDATADIR=\"<https://builds.apache.org/job/mesos-reviewbot/ws/mesos-0.23.0/_inst/share/mesos\"> -I../../include -I../../3rdparty/libprocess/include -I../../3rdparty/libprocess/3rdparty/stout/include -I../include -I../include/mesos -I../3rdparty/libprocess/3rdparty/boost-1.53.0 -I../3rdparty/libprocess/3rdparty/picojson-4f93734 -I../3rdparty/libprocess/3rdparty/protobuf-2.5.0/src -I../3rdparty/libprocess/3rdparty/glog-0.3.3/src -I../3rdparty/libprocess/3rdparty/glog-0.3.3/src -I../3rdparty/leveldb/include -I../3rdparty/zookeeper-3.4.5/src/c/include -I../3rdparty/zookeeper-3.4.5/src/c/generated  -I../3rdparty/libprocess/3rdparty/protobuf-2.5.0/src -DSOURCE_DIR=\"<https://builds.apache.org/job/mesos-reviewbot/ws/mesos-0.23.0/_build/..\"> -DBUILD_DIR=\"<https://builds.apache.org/job/mesos-reviewbot/ws/mesos-0.23.0/_build\"> -I../3rdparty/libprocess/3rdparty/gmock-1.6.0/gtest/include -I../3rdparty/libprocess/3rdparty/gmock-1.6.0/include -I/home/jenkins/tools/java/jdk1.6.0_20-64/include -I/home/jenkins/tools/java/jdk1.6.0_20-64/include/linux -DZOOKEEPER_VERSION=\"3.4.5\" -I/usr/include/subversion-1 -I/usr/include/apr-1 -I/usr/include/apr-1.0  -pthread -g1 -O0 -Wno-unused-local-typedefs -std=c++11 -MT tests/common/mesos_tests-http_tests.o -MD -MP -MF tests/common/.deps/mesos_tests-http_tests.Tpo -c -o tests/common/mesos_tests-http_tests.o `test -f 'tests/common/http_tests.cpp' || echo '../../src/'`tests/common/http_tests.cpp
mv -f tests/common/.deps/mesos_tests-http_tests.Tpo tests/common/.deps/mesos_tests-http_tests.Po
/bin/bash ../libtool  --tag=CXX   --mode=link g++ -pthread -g1 -O0 -Wno-unused-local-typedefs -std=c++11 -Wl,--as-needed  -o setns-test-helper tests/setns_test_helper-setns_test_helper_main.o tests/setns_test_helper-setns_test_helper.o libmesos.la     -lsasl2 -lsvn_delta-1 -lsvn_subr-1 -lapr-1 -lcurl -lz  -lrt
mv -f tests/.deps/mesos_tests-authorization_tests.Tpo tests/.deps/mesos_tests-authorization_tests.Po
/bin/bash ../libtool  --tag=CXX   --mode=link g++ -pthread -g1 -O0 -Wno-unused-local-typedefs -std=c++11 -Wl,--as-needed  -o memory-test-helper tests/memory_test_helper-flags.o tests/memory_test_helper-memory_test_helper_main.o tests/memory_test_helper-memory_test_helper.o libmesos.la     -lsasl2 -lsvn_delta-1 -lsvn_subr-1 -lapr-1 -lcurl -lz  -lrt
libtool: link: g++ -pthread -g1 -O0 -Wno-unused-local-typedefs -std=c++11 -Wl,--as-needed -o .libs/setns-test-helper tests/setns_test_helper-setns_test_helper_main.o tests/setns_test_helper-setns_test_helper.o  ./.libs/libmesos.so -lsasl2 /usr/lib/x86_64-linux-gnu/libsvn_delta-1.so /usr/lib/x86_64-linux-gnu/libsvn_subr-1.so /usr/lib/x86_64-linux-gnu/libapr-1.so /usr/lib/x86_64-linux-gnu/libcurl.so -lz -lrt -pthread -Wl,-rpath -Wl,<https://builds.apache.org/job/mesos-reviewbot/ws/mesos-0.23.0/_inst/lib>
libtool: link: g++ -pthread -g1 -O0 -Wno-unused-local-typedefs -std=c++11 -Wl,--as-needed -o .libs/memory-test-helper tests/memory_test_helper-flags.o tests/memory_test_helper-memory_test_helper_main.o tests/memory_test_helper-memory_test_helper.o  ./.libs/libmesos.so -lsasl2 /usr/lib/x86_64-linux-gnu/libsvn_delta-1.so /usr/lib/x86_64-linux-gnu/libsvn_subr-1.so /usr/lib/x86_64-linux-gnu/libapr-1.so /usr/lib/x86_64-linux-gnu/libcurl.so -lz -lrt -pthread -Wl,-rpath -Wl,<https://builds.apache.org/job/mesos-reviewbot/ws/mesos-0.23.0/_inst/lib>
/bin/bash ../libtool  --tag=CXX   --mode=link g++ -pthread -g1 -O0 -Wno-unused-local-typedefs -std=c++11 -Wl,--as-needed  -o active-user-test-helper tests/active_user_test_helper-active_user_test_helper.o libmesos.la     -lsasl2 -lsvn_delta-1 -lsvn_subr-1 -lapr-1 -lcurl -lz  -lrt
libtool: link: g++ -pthread -g1 -O0 -Wno-unused-local-typedefs -std=c++11 -Wl,--as-needed -o .libs/active-user-test-helper tests/active_user_test_helper-active_user_test_helper.o  ./.libs/libmesos.so -lsasl2 /usr/lib/x86_64-linux-gnu/libsvn_delta-1.so /usr/lib/x86_64-linux-gnu/libsvn_subr-1.so /usr/lib/x86_64-linux-gnu/libapr-1.so /usr/lib/x86_64-linux-gnu/libcurl.so -lz -lrt -pthread -Wl,-rpath -Wl,<https://builds.apache.org/job/mesos-reviewbot/ws/mesos-0.23.0/_inst/lib>
mv -f tests/.deps/mesos_tests-authentication_tests.Tpo tests/.deps/mesos_tests-authentication_tests.Po
/bin/bash ../libtool  --tag=CXX   --mode=link g++ -pthread -g1 -O0 -Wno-unused-local-typedefs -std=c++11 -Wl,--as-needed  -o mesos-tests tests/mesos_tests-anonymous_tests.o tests/mesos_tests-attributes_tests.o tests/mesos_tests-authentication_tests.o tests/mesos_tests-authorization_tests.o tests/common/mesos_tests-http_tests.o tests/mesos_tests-composing_containerizer_tests.o tests/mesos_tests-containerizer.o tests/mesos_tests-containerizer_tests.o tests/mesos_tests-cram_md5_authentication_tests.o tests/mesos_tests-credentials_tests.o tests/mesos_tests-disk_quota_tests.o tests/mesos_tests-docker_containerizer_tests.o tests/mesos_tests-docker_tests.o tests/mesos_tests-environment.o tests/mesos_tests-examples_tests.o tests/mesos_tests-exception_tests.o tests/mesos_tests-external_containerizer_test.o tests/mesos_tests-health_check_tests.o tests/mesos_tests-fault_tolerance_tests.o tests/mesos_tests-fetcher_cache_tests.o tests/mesos_tests-fetcher_tests.o tests/mesos_tests-files_tests.o tests/mesos_tests-flags.o tests/mesos_tests-gc_tests.o tests/mesos_tests-hierarchical_allocator_tests.o tests/mesos_tests-hook_tests.o tests/mesos_tests-isolator_tests.o tests/mesos_tests-log_tests.o tests/mesos_tests-logging_tests.o tests/mesos_tests-main.o tests/mesos_tests-master_allocator_tests.o tests/mesos_tests-master_authorization_tests.o tests/mesos_tests-master_contender_detector_tests.o tests/mesos_tests-master_slave_reconciliation_tests.o tests/mesos_tests-master_tests.o tests/mesos_tests-master_validation_tests.o tests/mesos_tests-memory_test_helper.o tests/mesos_tests-mesos.o tests/mesos_tests-metrics_tests.o tests/mesos_tests-module.o tests/mesos_tests-module_tests.o tests/mesos_tests-monitor_tests.o tests/mesos_tests-oversubscription_tests.o tests/mesos_tests-partition_tests.o tests/mesos_tests-paths_tests.o tests/mesos_tests-persistent_volume_tests.o tests/mesos_tests-protobuf_io_tests.o tests/mesos_tests-rate_limiting_tests.o tests/mesos_tests-reconciliation_tests.o tests/mesos_tests-registrar_tests.o tests/mesos_tests-repair_tests.o tests/mesos_tests-reservation_tests.o tests/mesos_tests-resource_offers_tests.o tests/mesos_tests-resources_tests.o tests/mesos_tests-scheduler_tests.o tests/mesos_tests-script.o tests/mesos_tests-slave_recovery_tests.o tests/mesos_tests-slave_tests.o tests/mesos_tests-sorter_tests.o tests/mesos_tests-state_tests.o tests/mesos_tests-status_update_manager_tests.o tests/mesos_tests-teardown_tests.o tests/mesos_tests-utils.o tests/mesos_tests-values_tests.o tests/mesos_tests-zookeeper_url_tests.o tests/mesos_tests-cgroups_isolator_tests.o tests/mesos_tests-cgroups_tests.o tests/mesos_tests-fs_tests.o tests/mesos_tests-memory_pressure_tests.o tests/mesos_tests-ns_tests.o tests/mesos_tests-perf_tests.o tests/mesos_tests-sched_tests.o tests/mesos_tests-setns_test_helper.o  tests/mesos_tests-group_tests.o tests/mesos_tests-registrar_zookeeper_tests.o tests/mesos_tests-zookeeper.o tests/mesos_tests-zookeeper_test_server.o tests/mesos_tests-zookeeper_tests.o ../3rdparty/libprocess/3rdparty/libgmock.la libmesos.la -ldl     -lsasl2 -lsvn_delta-1 -lsvn_subr-1 -lapr-1 -lcurl -lz  -lrt
libtool: link: g++ -pthread -g1 -O0 -Wno-unused-local-typedefs -std=c++11 -Wl,--as-needed -o .libs/mesos-tests tests/mesos_tests-anonymous_tests.o tests/mesos_tests-attributes_tests.o tests/mesos_tests-authentication_tests.o tests/mesos_tests-authorization_tests.o tests/common/mesos_tests-http_tests.o tests/mesos_tests-composing_containerizer_tests.o tests/mesos_tests-containerizer.o tests/mesos_tests-containerizer_tests.o tests/mesos_tests-cram_md5_authentication_tests.o tests/mesos_tests-credentials_tests.o tests/mesos_tests-disk_quota_tests.o tests/mesos_tests-docker_containerizer_tests.o tests/mesos_tests-docker_tests.o tests/mesos_tests-environment.o tests/mesos_tests-examples_tests.o tests/mesos_tests-exception_tests.o tests/mesos_tests-external_containerizer_test.o tests/mesos_tests-health_check_tests.o tests/mesos_tests-fault_tolerance_tests.o tests/mesos_tests-fetcher_cache_tests.o tests/mesos_tests-fetcher_tests.o tests/mesos_tests-files_tests.o tests/mesos_tests-flags.o tests/mesos_tests-gc_tests.o tests/mesos_tests-hierarchical_allocator_tests.o tests/mesos_tests-hook_tests.o tests/mesos_tests-isolator_tests.o tests/mesos_tests-log_tests.o tests/mesos_tests-logging_tests.o tests/mesos_tests-main.o tests/mesos_tests-master_allocator_tests.o tests/mesos_tests-master_authorization_tests.o tests/mesos_tests-master_contender_detector_tests.o tests/mesos_tests-master_slave_reconciliation_tests.o tests/mesos_tests-master_tests.o tests/mesos_tests-master_validation_tests.o tests/mesos_tests-memory_test_helper.o tests/mesos_tests-mesos.o tests/mesos_tests-metrics_tests.o tests/mesos_tests-module.o tests/mesos_tests-module_tests.o tests/mesos_tests-monitor_tests.o tests/mesos_tests-oversubscription_tests.o tests/mesos_tests-partition_tests.o tests/mesos_tests-paths_tests.o tests/mesos_tests-persistent_volume_tests.o tests/mesos_tests-protobuf_io_tests.o tests/mesos_tests-rate_limiting_tests.o tests/mesos_tests-reconciliation_tests.o tests/mesos_tests-registrar_tests.o tests/mesos_tests-repair_tests.o tests/mesos_tests-reservation_tests.o tests/mesos_tests-resource_offers_tests.o tests/mesos_tests-resources_tests.o tests/mesos_tests-scheduler_tests.o tests/mesos_tests-script.o tests/mesos_tests-slave_recovery_tests.o tests/mesos_tests-slave_tests.o tests/mesos_tests-sorter_tests.o tests/mesos_tests-state_tests.o tests/mesos_tests-status_update_manager_tests.o tests/mesos_tests-teardown_tests.o tests/mesos_tests-utils.o tests/mesos_tests-values_tests.o tests/mesos_tests-zookeeper_url_tests.o tests/mesos_tests-cgroups_isolator_tests.o tests/mesos_tests-cgroups_tests.o tests/mesos_tests-fs_tests.o tests/mesos_tests-memory_pressure_tests.o tests/mesos_tests-ns_tests.o tests/mesos_tests-perf_tests.o tests/mesos_tests-sched_tests.o tests/mesos_tests-setns_test_helper.o tests/mesos_tests-group_tests.o tests/mesos_tests-registrar_zookeeper_tests.o tests/mesos_tests-zookeeper.o tests/mesos_tests-zookeeper_test_server.o tests/mesos_tests-zookeeper_tests.o  ../3rdparty/libprocess/3rdparty/.libs/libgmock.a ./.libs/libmesos.so -ldl -lsasl2 /usr/lib/x86_64-linux-gnu/libsvn_delta-1.so /usr/lib/x86_64-linux-gnu/libsvn_subr-1.so /usr/lib/x86_64-linux-gnu/libapr-1.so /usr/lib/x86_64-linux-gnu/libcurl.so -lz -lrt -pthread -Wl,-rpath -Wl,<https://builds.apache.org/job/mesos-reviewbot/ws/mesos-0.23.0/_inst/lib>
make[4]: Leaving directory `<https://builds.apache.org/job/mesos-reviewbot/ws/mesos-0.23.0/_build/src'>
make  check-local
make[4]: Entering directory `<https://builds.apache.org/job/mesos-reviewbot/ws/mesos-0.23.0/_build/src'>
./mesos-tests
Source directory: <https://builds.apache.org/job/mesos-reviewbot/ws/mesos-0.23.0>
Build directory: <https://builds.apache.org/job/mesos-reviewbot/ws/mesos-0.23.0/_build>
-------------------------------------------------------------
We cannot run any cgroups tests that require mounting
hierarchies because you have the following hierarchies mounted:
/sys/fs/cgroup/blkio, /sys/fs/cgroup/cpu, /sys/fs/cgroup/cpuacct, /sys/fs/cgroup/cpuset, /sys/fs/cgroup/devices, /sys/fs/cgroup/freezer, /sys/fs/cgroup/hugetlb, /sys/fs/cgroup/memory, /sys/fs/cgroup/perf_event, /sys/fs/cgroup/systemd
We'll disable the CgroupsNoHierarchyTest test fixture for now.
-------------------------------------------------------------
Note: Google Test filter = *-DockerContainerizerTest.ROOT_DOCKER_Launch_Executor:DockerContainerizerTest.ROOT_DOCKER_Launch_Executor_Bridged:DockerContainerizerTest.ROOT_DOCKER_Launch:DockerContainerizerTest.ROOT_DOCKER_Kill:DockerContainerizerTest.ROOT_DOCKER_Usage:DockerContainerizerTest.ROOT_DOCKER_Update:DockerContainerizerTest.ROOT_DOCKER_Recover:DockerContainerizerTest.ROOT_DOCKER_SkipRecoverNonDocker:DockerContainerizerTest.ROOT_DOCKER_Logs:DockerContainerizerTest.ROOT_DOCKER_Default_CMD:DockerContainerizerTest.ROOT_DOCKER_Default_CMD_Override:DockerContainerizerTest.ROOT_DOCKER_Default_CMD_Args:DockerContainerizerTest.ROOT_DOCKER_SlaveRecoveryTaskContainer:DockerContainerizerTest.DISABLED_ROOT_DOCKER_SlaveRecoveryExecutorContainer:DockerContainerizerTest.ROOT_DOCKER_PortMapping:DockerContainerizerTest.ROOT_DOCKER_LaunchSandboxWithColon:DockerContainerizerTest.ROOT_DOCKER_DestroyWhileFetching:DockerContainerizerTest.ROOT_DOCKER_DestroyWhilePulling:DockerContainerizerTest.ROOT_DOCKER_ExecutorCleanupWhenLaunchFailed:DockerContainerizerTest.ROOT_DOCKER_FetchFailure:DockerContainerizerTest.ROOT_DOCKER_DockerPullFailure:DockerContainerizerTest.ROOT_DOCKER_DockerInspectDiscard:DockerTest.ROOT_DOCKER_interface:DockerTest.ROOT_DOCKER_CheckCommandWithShell:DockerTest.ROOT_DOCKER_CheckPortResource:DockerTest.ROOT_DOCKER_CancelPull:CpuIsolatorTest/1.UserCpuUsage:CpuIsolatorTest/1.SystemCpuUsage:RevocableCpuIsolatorTest.ROOT_CGROUPS_RevocableCpu:LimitedCpuIsolatorTest.ROOT_CGROUPS_Cfs:LimitedCpuIsolatorTest.ROOT_CGROUPS_Cfs_Big_Quota:LimitedCpuIsolatorTest.ROOT_CGROUPS_Pids_and_Tids:MemIsolatorTest/0.MemUsage:MemIsolatorTest/1.MemUsage:MemIsolatorTest/2.MemUsage:PerfEventIsolatorTest.ROOT_CGROUPS_Sample:SharedFilesystemIsolatorTest.ROOT_RelativeVolume:SharedFilesystemIsolatorTest.ROOT_AbsoluteVolume:NamespacesPidIsolatorTest.ROOT_PidNamespace:UserCgroupIsolatorTest/0.ROOT_CGROUPS_UserCgroup:UserCgroupIsolatorTest/1.ROOT_CGROUPS_UserCgroup:UserCgroupIsolatorTest/2.ROOT_CGROUPS_UserCgroup:MesosContainerizerSlaveRecoveryTest.CGROUPS_ROOT_PerfRollForward:MesosContainerizerSlaveRecoveryTest.CGROUPS_ROOT_PidNamespaceForward:MesosContainerizerSlaveRecoveryTest.CGROUPS_ROOT_PidNamespaceBackward:SlaveTest.ROOT_RunTaskWithCommandInfoWithoutUser:SlaveTest.DISABLED_ROOT_RunTaskWithCommandInfoWithUser:ContainerizerTest.ROOT_CGROUPS_BalloonFramework:CgroupsAnyHierarchyTest.ROOT_CGROUPS_Enabled:CgroupsAnyHierarchyTest.ROOT_CGROUPS_Subsystems:CgroupsAnyHierarchyTest.ROOT_CGROUPS_Mounted:CgroupsAnyHierarchyTest.ROOT_CGROUPS_Get:CgroupsAnyHierarchyTest.ROOT_CGROUPS_NestedCgroups:CgroupsAnyHierarchyTest.ROOT_CGROUPS_Tasks:CgroupsAnyHierarchyTest.ROOT_CGROUPS_Read:CgroupsAnyHierarchyTest.ROOT_CGROUPS_Write:CgroupsAnyHierarchyTest.ROOT_CGROUPS_Cfs_Big_Quota:CgroupsAnyHierarchyWithCpuMemoryTest.ROOT_CGROUPS_Busy:CgroupsAnyHierarchyWithCpuMemoryTest.ROOT_CGROUPS_SubsystemsHierarchy:CgroupsAnyHierarchyWithCpuMemoryTest.ROOT_CGROUPS_FindCgroupSubsystems:CgroupsAnyHierarchyWithCpuMemoryTest.ROOT_CGROUPS_MountedSubsystems:CgroupsAnyHierarchyWithCpuMemoryTest.ROOT_CGROUPS_CreateRemove:CgroupsAnyHierarchyWithCpuMemoryTest.ROOT_CGROUPS_Listen:CgroupsAnyHierarchyWithCpuMemoryTest.ROOT_CGROUPS_FreezeNonFreezer:CgroupsNoHierarchyTest.ROOT_CGROUPS_NOHIERARCHY_MountUnmountHierarchy:CgroupsAnyHierarchyWithCpuAcctMemoryTest.ROOT_CGROUPS_Stat:CgroupsAnyHierarchyWithFreezerTest.ROOT_CGROUPS_Freeze:CgroupsAnyHierarchyWithFreezerTest.ROOT_CGROUPS_Kill:CgroupsAnyHierarchyWithFreezerTest.ROOT_CGROUPS_Destroy:CgroupsAnyHierarchyWithFreezerTest.ROOT_CGROUPS_AssignThreads:CgroupsAnyHierarchyWithFreezerTest.ROOT_CGROUPS_DestroyStoppedProcess:CgroupsAnyHierarchyWithFreezerTest.ROOT_CGROUPS_DestroyTracedProcess:CgroupsAnyHierarchyWithPerfEventTest.ROOT_CGROUPS_Perf:CgroupsAnyHierarchyMemoryPressureTest.ROOT_IncreaseUnlockedRSS:CgroupsAnyHierarchyMemoryPressureTest.ROOT_IncreasePageCache:MemoryPressureMesosTest.CGROUPS_ROOT_Statistics:MemoryPressureMesosTest.CGROUPS_ROOT_SlaveRecovery:NsTest.ROOT_setns:NsTest.ROOT_setnsMultipleThreads:NsTest.ROOT_getns:NsTest.ROOT_destroy:PerfTest.ROOT_Events:PerfTest.ROOT_SamplePid:SchedTest.ROOT_PolicySelf:SchedTest.ROOT_PolicyChild:SlaveCount/HierarchicalAllocator_BENCHMARK_Test.AddSlave/0:SlaveCount/HierarchicalAllocator_BENCHMARK_Test.AddSlave/1:SlaveCount/HierarchicalAllocator_BENCHMARK_Test.AddSlave/2:SlaveCount/HierarchicalAllocator_BENCHMARK_Test.AddSlave/3:SlaveCount/HierarchicalAllocator_BENCHMARK_Test.AddSlave/4:SlaveCount/HierarchicalAllocator_BENCHMARK_Test.AddSlave/5:SlaveCount/Registrar_BENCHMARK_Test.performance/0:SlaveCount/Registrar_BENCHMARK_Test.performance/1:SlaveCount/Registrar_BENCHMARK_Test.performance/2:SlaveCount/Registrar_BENCHMARK_Test.performance/3
[==========] Running 647 tests from 95 test cases.
[----------] Global test environment set-up.
[----------] 1 test from AnonymousTest
[ RUN      ] AnonymousTest.Running
[       OK ] AnonymousTest.Running (1 ms)
[----------] 1 test from AnonymousTest (1 ms total)

[----------] 2 tests from AttributesTest
[ RUN      ] AttributesTest.Parsing
[       OK ] AttributesTest.Parsing (1 ms)
[ RUN      ] AttributesTest.Equality
[       OK ] AttributesTest.Equality (0 ms)
[----------] 2 tests from AttributesTest (1 ms total)

[----------] 20 tests from AuthenticationTest
[ RUN      ] AuthenticationTest.UnauthenticatedFramework
W0620 07:30:21.044446 15023 logging.cpp:81] RAW: Received signal SIGTERM from process 20256 of user 2396; exiting
make[4]: *** [check-local] Terminated
make[4]: Leaving directory `<https://builds.apache.org/job/mesos-reviewbot/ws/mesos-0.23.0/_build/src'>
make[3]: *** [check-am] Error 2
make[3]: Leaving directory `<https://builds.apache.org/job/mesos-reviewbot/ws/mesos-0.23.0/_build/src'>
make[2]: *** [check] Error 2
make[2]: Leaving directory `<https://builds.apache.org/job/mesos-reviewbot/ws/mesos-0.23.0/_build/src'>
make[1]: *** [check-recursive] Error 1
make[1]: Leaving directory `/hom

Mime
View raw message