maven-users mailing list archives

Site index · List index
Message view « Date » · « Thread »
Top « Date » · « Thread »
From Siddu Patil <siddu.automat...@gmail.com>
Subject Maven Build Error
Date Fri, 11 Oct 2013 04:19:34 GMT
Hi All,

Here i'm compiling the project the below error is being displayed please
guide me here to come out the below error

G:\cq\maven_3>mvn archetype:generate -DarchetypeGroupId=com.day.jcr.vault
-DarchetypeArtifactId=multimodule-content-package-archetype -Darch
etypeVersion=1.0.0 -DarchetypeRepository=adobe-public-releases
[INFO] Scanning for projects...
[INFO]
[INFO]
------------------------------------------------------------------------
[INFO] Building Maven Stub Project (No POM) 1
[INFO]
------------------------------------------------------------------------
[INFO]
[INFO] >>> maven-archetype-plugin:2.2:generate (default-cli) @
standalone-pom >>>
[INFO]
[INFO] <<< maven-archetype-plugin:2.2:generate (default-cli) @
standalone-pom <<<
[INFO]
[INFO] --- maven-archetype-plugin:2.2:generate (default-cli) @
standalone-pom ---
[INFO] Generating project in Interactive mode
[INFO] Archetype defined by properties
[INFO]
------------------------------------------------------------------------
[INFO] BUILD FAILURE
[INFO]
------------------------------------------------------------------------
[INFO] Total time: 3.059s
[INFO] Finished at: Fri Oct 11 09:51:26 IST 2013
[INFO] Final Memory: 8M/62M
[INFO]
------------------------------------------------------------------------
*[ERROR] Failed to execute goal
org.apache.maven.plugins:maven-archetype-plugin:2.2:generate (default-cli)
on project standalone-pom: The des**ired archetype does not exist
(com.day.jcr.vault:multimodule-content-package-archetype:1.0.0) -> [Help 1]*
*[ERROR]*
*[ERROR] To see the full stack trace of the errors, re-run Maven with the
-e switch.*
*[ERROR] Re-run Maven using the -X switch to enable full debug logging.*
*[ERROR]*
*[ERROR] For more information about the errors and possible solutions,
please read the following articles:*
*[ERROR] [Help 1]
http://cwiki.apache.org/confluence/display/MAVEN/MojoFailureException*
*
*
Thanks in advance

Mime
  • Unnamed multipart/alternative (inline, None, 0 bytes)
View raw message