maven-users mailing list archives

Site index · List index
Message view « Date » · « Thread »
Top « Date » · « Thread »
From Anders Hammar <and...@hammar.net>
Subject Re: No surefire-reports directory and BuildFailureException
Date Thu, 04 Nov 2010 05:38:49 GMT
Indeed, it doesn't give much of a clue. However, I noticed that you're using
maven-surefire-plugin v2.3.1. It's old. Try changing to the latest (v2.6) to
see if that does a difference.

/Anders

On Wed, Nov 3, 2010 at 22:00, Moritz Winter
<moritz.a.winter@googlemail.com>wrote:

> Here's the log (mvn -C -e -X test)
>
> + Error stacktraces are turned on.
> Apache Maven 2.2.1 (rdebian-1)
> Java version: 1.6.0_22
> Java home: /usr/lib/jvm/java-6-sun-1.6.0.22/jre
> Default locale: de_DE, platform encoding: UTF-8
> OS name: "linux" version: "2.6.32-25-generic" arch: "i386" Family: "unix"
> + Enabling strict checksum verification on all artifact downloads.
> [DEBUG] Building Maven user-level plugin registry from:
> '/home/mwinter/.m2/plugin-registry.xml'
> [DEBUG] Building Maven global-level plugin registry from:
> '/usr/share/maven2/conf/plugin-registry.xml'
> [INFO] Scanning for projects...
> [DEBUG] Wagons could not be registered as the extension container was never
> created
> [INFO]
> ------------------------------------------------------------------------
> [INFO] Building arquillian-example
> [INFO]    task-segment: [test]
> [INFO]
> ------------------------------------------------------------------------
> [DEBUG] Retrieving parent-POM:
> org.apache.maven.plugins:maven-plugins:pom:12 for project:
> null:maven-resources-plugin:maven-plugin:2.3 from the repository.
> [DEBUG] Retrieving parent-POM: org.apache.maven:maven-parent:pom:9 for
> project: org.apache.maven.plugins:maven-plugins:pom:12 from the repository.
> [DEBUG] Retrieving parent-POM: org.apache:apache:pom:4 for project:
> org.apache.maven:maven-parent:pom:9 from the repository.
> [DEBUG] Retrieving parent-POM:
> org.apache.maven.plugins:maven-plugins:pom:18 for project:
> null:maven-compiler-plugin:maven-plugin:2.3.2 from the repository.
> [DEBUG] Retrieving parent-POM: org.apache.maven:maven-parent:pom:16 for
> project: org.apache.maven.plugins:maven-plugins:pom:18 from the repository.
> [DEBUG] Retrieving parent-POM: org.apache:apache:pom:7 for project:
> org.apache.maven:maven-parent:pom:16 from the repository.
> [DEBUG] Retrieving parent-POM: org.apache.maven.surefire:surefire:pom:2.3.1
> for project:
> org.apache.maven.plugins:maven-surefire-plugin:maven-plugin:null from the
> repository.
> [DEBUG] Retrieving parent-POM: org.apache.maven:maven-parent:pom:5 for
> project: org.apache.maven.surefire:surefire:pom:2.3.1 from the repository.
> [DEBUG] Retrieving parent-POM: org.apache:apache:pom:3 for project:
> org.apache.maven:maven-parent:pom:5 from the repository.
> [DEBUG] Adding managed dependencies for
> org.apache.maven.plugins:maven-surefire-plugin
> [DEBUG]   org.apache.maven.surefire:surefire-api:jar:2.3.1
> [DEBUG]   org.apache.maven.surefire:surefire-booter:jar:2.3.1
> [DEBUG] Plugin dependencies for:
>
> org.apache.maven.plugins:maven-resources-plugin:2.3
>
> are:
>
> org.apache.maven:maven-plugin-api:jar:2.0.6:runtime
> org.apache.maven:maven-project:jar:2.0.6:runtime
> org.codehaus.plexus:plexus-utils:jar:1.5.6:runtime
> org.apache.maven.shared:maven-filtering:jar:1.0-beta-2:runtime
>
>
> [DEBUG]
> org.apache.maven.plugins:maven-resources-plugin:maven-plugin:2.3:runtime
> (selected for runtime)
> [DEBUG] Retrieving parent-POM: org.apache.maven:maven:pom:2.0.6 for
> project: null:maven-plugin-api:jar:null from the repository.
> [DEBUG] Adding managed dependencies for unknown:maven-plugin-api
> [DEBUG]   org.apache.maven:maven-model:jar:2.0.6
> [DEBUG]   org.apache.maven:maven-project:jar:2.0.6
> [DEBUG]   org.apache.maven.reporting:maven-reporting-api:jar:2.0.6
> [DEBUG]   org.apache.maven:maven-repository-metadata:jar:2.0.6
> [DEBUG]   org.apache.maven:maven-artifact:jar:2.0.6
> [DEBUG]   org.apache.maven:maven-artifact-manager:jar:2.0.6
> [DEBUG]   org.apache.maven:maven-artifact-test:jar:2.0.6
> [DEBUG]   org.apache.maven:maven-settings:jar:2.0.6
> [DEBUG]   org.apache.maven:maven-plugin-parameter-documenter:jar:2.0.6
> [DEBUG]   org.apache.maven:maven-profile:jar:2.0.6
> [DEBUG]   org.apache.maven:maven-plugin-registry:jar:2.0.6
> [DEBUG]   org.apache.maven:maven-plugin-api:jar:2.0.6
> [DEBUG]   org.apache.maven:maven-monitor:jar:2.0.6
> [DEBUG]
> org.codehaus.plexus:plexus-container-default:jar:1.0-alpha-9-stable-1
> [DEBUG]   org.codehaus.plexus:plexus-utils:jar:1.4.1
> [DEBUG]   org.apache.maven.wagon:wagon-provider-api:jar:1.0-beta-2
> [DEBUG]   org.apache.maven.wagon:wagon-ssh:jar:1.0-beta-2
> [DEBUG]   org.apache.maven.wagon:wagon-ssh-external:jar:1.0-beta-2
> [DEBUG]   org.apache.maven.wagon:wagon-file:jar:1.0-beta-2
> [DEBUG]   org.apache.maven.wagon:wagon-http-lightweight:jar:1.0-beta-2
> [DEBUG]   easymock:easymock:jar:1.2_Java1.3:test
> [DEBUG]   classworlds:classworlds:jar:1.1
> [DEBUG]   org.apache.maven:maven-plugin-api:jar:2.0.6:runtime (selected for
> runtime)
> [DEBUG] Adding managed dependencies for unknown:maven-project
> [DEBUG]   org.apache.maven:maven-model:jar:2.0.6
> [DEBUG]   org.apache.maven:maven-project:jar:2.0.6
> [DEBUG]   org.apache.maven.reporting:maven-reporting-api:jar:2.0.6
> [DEBUG]   org.apache.maven:maven-repository-metadata:jar:2.0.6
> [DEBUG]   org.apache.maven:maven-artifact:jar:2.0.6
> [DEBUG]   org.apache.maven:maven-artifact-manager:jar:2.0.6
> [DEBUG]   org.apache.maven:maven-artifact-test:jar:2.0.6
> [DEBUG]   org.apache.maven:maven-settings:jar:2.0.6
> [DEBUG]   org.apache.maven:maven-plugin-parameter-documenter:jar:2.0.6
> [DEBUG]   org.apache.maven:maven-profile:jar:2.0.6
> [DEBUG]   org.apache.maven:maven-plugin-registry:jar:2.0.6
> [DEBUG]   org.apache.maven:maven-plugin-api:jar:2.0.6
> [DEBUG]   org.apache.maven:maven-monitor:jar:2.0.6
> [DEBUG]
> org.codehaus.plexus:plexus-container-default:jar:1.0-alpha-9-stable-1
> [DEBUG]   org.codehaus.plexus:plexus-utils:jar:1.4.1
> [DEBUG]   org.apache.maven.wagon:wagon-provider-api:jar:1.0-beta-2
> [DEBUG]   org.apache.maven.wagon:wagon-ssh:jar:1.0-beta-2
> [DEBUG]   org.apache.maven.wagon:wagon-ssh-external:jar:1.0-beta-2
> [DEBUG]   org.apache.maven.wagon:wagon-file:jar:1.0-beta-2
> [DEBUG]   org.apache.maven.wagon:wagon-http-lightweight:jar:1.0-beta-2
> [DEBUG]   easymock:easymock:jar:1.2_Java1.3:test
> [DEBUG]   classworlds:classworlds:jar:1.1
> [DEBUG]   org.apache.maven:maven-project:jar:2.0.6:runtime (selected for
> runtime)
> [DEBUG] Adding managed dependencies for unknown:maven-settings
> [DEBUG]   org.apache.maven:maven-model:jar:2.0.6
> [DEBUG]   org.apache.maven:maven-project:jar:2.0.6
> [DEBUG]   org.apache.maven.reporting:maven-reporting-api:jar:2.0.6
> [DEBUG]   org.apache.maven:maven-repository-metadata:jar:2.0.6
> [DEBUG]   org.apache.maven:maven-artifact:jar:2.0.6
> [DEBUG]   org.apache.maven:maven-artifact-manager:jar:2.0.6
> [DEBUG]   org.apache.maven:maven-artifact-test:jar:2.0.6
> [DEBUG]   org.apache.maven:maven-settings:jar:2.0.6
> [DEBUG]   org.apache.maven:maven-plugin-parameter-documenter:jar:2.0.6
> [DEBUG]   org.apache.maven:maven-profile:jar:2.0.6
> [DEBUG]   org.apache.maven:maven-plugin-registry:jar:2.0.6
> [DEBUG]   org.apache.maven:maven-plugin-api:jar:2.0.6
> [DEBUG]   org.apache.maven:maven-monitor:jar:2.0.6
> [DEBUG]
> org.codehaus.plexus:plexus-container-default:jar:1.0-alpha-9-stable-1
> [DEBUG]   org.codehaus.plexus:plexus-utils:jar:1.4.1
> [DEBUG]   org.apache.maven.wagon:wagon-provider-api:jar:1.0-beta-2
> [DEBUG]   org.apache.maven.wagon:wagon-ssh:jar:1.0-beta-2
> [DEBUG]   org.apache.maven.wagon:wagon-ssh-external:jar:1.0-beta-2
> [DEBUG]   org.apache.maven.wagon:wagon-file:jar:1.0-beta-2
> [DEBUG]   org.apache.maven.wagon:wagon-http-lightweight:jar:1.0-beta-2
> [DEBUG]   easymock:easymock:jar:1.2_Java1.3:test
> [DEBUG]   classworlds:classworlds:jar:1.1
> [DEBUG]     org.apache.maven:maven-settings:jar:2.0.6:runtime (selected for
> runtime)
> [DEBUG] Adding managed dependencies for unknown:maven-model
> [DEBUG]   org.apache.maven:maven-model:jar:2.0.6
> [DEBUG]   org.apache.maven:maven-project:jar:2.0.6
> [DEBUG]   org.apache.maven.reporting:maven-reporting-api:jar:2.0.6
> [DEBUG]   org.apache.maven:maven-repository-metadata:jar:2.0.6
> [DEBUG]   org.apache.maven:maven-artifact:jar:2.0.6
> [DEBUG]   org.apache.maven:maven-artifact-manager:jar:2.0.6
> [DEBUG]   org.apache.maven:maven-artifact-test:jar:2.0.6
> [DEBUG]   org.apache.maven:maven-settings:jar:2.0.6
> [DEBUG]   org.apache.maven:maven-plugin-parameter-documenter:jar:2.0.6
> [DEBUG]   org.apache.maven:maven-profile:jar:2.0.6
> [DEBUG]   org.apache.maven:maven-plugin-registry:jar:2.0.6
> [DEBUG]   org.apache.maven:maven-plugin-api:jar:2.0.6
> [DEBUG]   org.apache.maven:maven-monitor:jar:2.0.6
> [DEBUG]
> org.codehaus.plexus:plexus-container-default:jar:1.0-alpha-9-stable-1
> [DEBUG]   org.codehaus.plexus:plexus-utils:jar:1.4.1
> [DEBUG]   org.apache.maven.wagon:wagon-provider-api:jar:1.0-beta-2
> [DEBUG]   org.apache.maven.wagon:wagon-ssh:jar:1.0-beta-2
> [DEBUG]   org.apache.maven.wagon:wagon-ssh-external:jar:1.0-beta-2
> [DEBUG]   org.apache.maven.wagon:wagon-file:jar:1.0-beta-2
> [DEBUG]   org.apache.maven.wagon:wagon-http-lightweight:jar:1.0-beta-2
> [DEBUG]   easymock:easymock:jar:1.2_Java1.3:test
> [DEBUG]   classworlds:classworlds:jar:1.1
> [DEBUG]       org.apache.maven:maven-model:jar:2.0.6:runtime (selected for
> runtime)
> [DEBUG] Retrieving parent-POM: org.codehaus.plexus:plexus:pom:1.0.11 for
> project: null:plexus-utils:jar:1.4.1 from the repository.
> [DEBUG]         org.codehaus.plexus:plexus-utils:jar:1.4.1:runtime
> (selected for runtime)
> [DEBUG]       org.codehaus.plexus:plexus-utils:jar:1.4.1:runtime (selected
> for runtime)
> [DEBUG] Retrieving parent-POM:
> org.codehaus.plexus:plexus-containers:pom:1.0.3 for project:
> null:plexus-container-default:jar:1.0-alpha-9-stable-1 from the repository.
> [DEBUG] Retrieving parent-POM: org.codehaus.plexus:plexus:pom:1.0.4 for
> project: org.codehaus.plexus:plexus-containers:pom:1.0.3 from the
> repository.
> [DEBUG]
> org.codehaus.plexus:plexus-container-default:jar:1.0-alpha-9-stable-1:runtime
> (selected for runtime)
> [DEBUG]         junit:junit:jar:3.8.1:runtime (selected for runtime)
> [DEBUG]         org.codehaus.plexus:plexus-utils:jar:1.0.4:runtime (removed
> - nearer found: 1.4.1)
> [DEBUG]         classworlds:classworlds:jar:1.1-alpha-2:runtime (selected
> for runtime)
> [DEBUG] Adding managed dependencies for unknown:maven-profile
> [DEBUG]   org.apache.maven:maven-model:jar:2.0.6
> [DEBUG]   org.apache.maven:maven-project:jar:2.0.6
> [DEBUG]   org.apache.maven.reporting:maven-reporting-api:jar:2.0.6
> [DEBUG]   org.apache.maven:maven-repository-metadata:jar:2.0.6
> [DEBUG]   org.apache.maven:maven-artifact:jar:2.0.6
> [DEBUG]   org.apache.maven:maven-artifact-manager:jar:2.0.6
> [DEBUG]   org.apache.maven:maven-artifact-test:jar:2.0.6
> [DEBUG]   org.apache.maven:maven-settings:jar:2.0.6
> [DEBUG]   org.apache.maven:maven-plugin-parameter-documenter:jar:2.0.6
> [DEBUG]   org.apache.maven:maven-profile:jar:2.0.6
> [DEBUG]   org.apache.maven:maven-plugin-registry:jar:2.0.6
> [DEBUG]   org.apache.maven:maven-plugin-api:jar:2.0.6
> [DEBUG]   org.apache.maven:maven-monitor:jar:2.0.6
> [DEBUG]
> org.codehaus.plexus:plexus-container-default:jar:1.0-alpha-9-stable-1
> [DEBUG]   org.codehaus.plexus:plexus-utils:jar:1.4.1
> [DEBUG]   org.apache.maven.wagon:wagon-provider-api:jar:1.0-beta-2
> [DEBUG]   org.apache.maven.wagon:wagon-ssh:jar:1.0-beta-2
> [DEBUG]   org.apache.maven.wagon:wagon-ssh-external:jar:1.0-beta-2
> [DEBUG]   org.apache.maven.wagon:wagon-file:jar:1.0-beta-2
> [DEBUG]   org.apache.maven.wagon:wagon-http-lightweight:jar:1.0-beta-2
> [DEBUG]   easymock:easymock:jar:1.2_Java1.3:test
> [DEBUG]   classworlds:classworlds:jar:1.1
> [DEBUG]     org.apache.maven:maven-profile:jar:2.0.6:runtime (selected for
> runtime)
> [DEBUG]     org.apache.maven:maven-model:jar:2.0.6:runtime (selected for
> runtime)
> [DEBUG] Adding managed dependencies for unknown:maven-artifact-manager
> [DEBUG]   org.apache.maven:maven-model:jar:2.0.6
> [DEBUG]   org.apache.maven:maven-project:jar:2.0.6
> [DEBUG]   org.apache.maven.reporting:maven-reporting-api:jar:2.0.6
> [DEBUG]   org.apache.maven:maven-repository-metadata:jar:2.0.6
> [DEBUG]   org.apache.maven:maven-artifact:jar:2.0.6
> [DEBUG]   org.apache.maven:maven-artifact-manager:jar:2.0.6
> [DEBUG]   org.apache.maven:maven-artifact-test:jar:2.0.6
> [DEBUG]   org.apache.maven:maven-settings:jar:2.0.6
> [DEBUG]   org.apache.maven:maven-plugin-parameter-documenter:jar:2.0.6
> [DEBUG]   org.apache.maven:maven-profile:jar:2.0.6
> [DEBUG]   org.apache.maven:maven-plugin-registry:jar:2.0.6
> [DEBUG]   org.apache.maven:maven-plugin-api:jar:2.0.6
> [DEBUG]   org.apache.maven:maven-monitor:jar:2.0.6
> [DEBUG]
> org.codehaus.plexus:plexus-container-default:jar:1.0-alpha-9-stable-1
> [DEBUG]   org.codehaus.plexus:plexus-utils:jar:1.4.1
> [DEBUG]   org.apache.maven.wagon:wagon-provider-api:jar:1.0-beta-2
> [DEBUG]   org.apache.maven.wagon:wagon-ssh:jar:1.0-beta-2
> [DEBUG]   org.apache.maven.wagon:wagon-ssh-external:jar:1.0-beta-2
> [DEBUG]   org.apache.maven.wagon:wagon-file:jar:1.0-beta-2
> [DEBUG]   org.apache.maven.wagon:wagon-http-lightweight:jar:1.0-beta-2
> [DEBUG]   easymock:easymock:jar:1.2_Java1.3:test
> [DEBUG]   classworlds:classworlds:jar:1.1
> [DEBUG]     org.apache.maven:maven-artifact-manager:jar:2.0.6:runtime
> (selected for runtime)
> [DEBUG] Adding managed dependencies for unknown:maven-repository-metadata
> [DEBUG]   org.apache.maven:maven-model:jar:2.0.6
> [DEBUG]   org.apache.maven:maven-project:jar:2.0.6
> [DEBUG]   org.apache.maven.reporting:maven-reporting-api:jar:2.0.6
> [DEBUG]   org.apache.maven:maven-repository-metadata:jar:2.0.6
> [DEBUG]   org.apache.maven:maven-artifact:jar:2.0.6
> [DEBUG]   org.apache.maven:maven-artifact-manager:jar:2.0.6
> [DEBUG]   org.apache.maven:maven-artifact-test:jar:2.0.6
> [DEBUG]   org.apache.maven:maven-settings:jar:2.0.6
> [DEBUG]   org.apache.maven:maven-plugin-parameter-documenter:jar:2.0.6
> [DEBUG]   org.apache.maven:maven-profile:jar:2.0.6
> [DEBUG]   org.apache.maven:maven-plugin-registry:jar:2.0.6
> [DEBUG]   org.apache.maven:maven-plugin-api:jar:2.0.6
> [DEBUG]   org.apache.maven:maven-monitor:jar:2.0.6
> [DEBUG]
> org.codehaus.plexus:plexus-container-default:jar:1.0-alpha-9-stable-1
> [DEBUG]   org.codehaus.plexus:plexus-utils:jar:1.4.1
> [DEBUG]   org.apache.maven.wagon:wagon-provider-api:jar:1.0-beta-2
> [DEBUG]   org.apache.maven.wagon:wagon-ssh:jar:1.0-beta-2
> [DEBUG]   org.apache.maven.wagon:wagon-ssh-external:jar:1.0-beta-2
> [DEBUG]   org.apache.maven.wagon:wagon-file:jar:1.0-beta-2
> [DEBUG]   org.apache.maven.wagon:wagon-http-lightweight:jar:1.0-beta-2
> [DEBUG]   easymock:easymock:jar:1.2_Java1.3:test
> [DEBUG]   classworlds:classworlds:jar:1.1
> [DEBUG]       org.apache.maven:maven-repository-metadata:jar:2.0.6:runtime
> (selected for runtime)
> [DEBUG] Adding managed dependencies for unknown:maven-artifact
> [DEBUG]   org.apache.maven:maven-model:jar:2.0.6
> [DEBUG]   org.apache.maven:maven-project:jar:2.0.6
> [DEBUG]   org.apache.maven.reporting:maven-reporting-api:jar:2.0.6
> [DEBUG]   org.apache.maven:maven-repository-metadata:jar:2.0.6
> [DEBUG]   org.apache.maven:maven-artifact:jar:2.0.6
> [DEBUG]   org.apache.maven:maven-artifact-manager:jar:2.0.6
> [DEBUG]   org.apache.maven:maven-artifact-test:jar:2.0.6
> [DEBUG]   org.apache.maven:maven-settings:jar:2.0.6
> [DEBUG]   org.apache.maven:maven-plugin-parameter-documenter:jar:2.0.6
> [DEBUG]   org.apache.maven:maven-profile:jar:2.0.6
> [DEBUG]   org.apache.maven:maven-plugin-registry:jar:2.0.6
> [DEBUG]   org.apache.maven:maven-plugin-api:jar:2.0.6
> [DEBUG]   org.apache.maven:maven-monitor:jar:2.0.6
> [DEBUG]
> org.codehaus.plexus:plexus-container-default:jar:1.0-alpha-9-stable-1
> [DEBUG]   org.codehaus.plexus:plexus-utils:jar:1.4.1
> [DEBUG]   org.apache.maven.wagon:wagon-provider-api:jar:1.0-beta-2
> [DEBUG]   org.apache.maven.wagon:wagon-ssh:jar:1.0-beta-2
> [DEBUG]   org.apache.maven.wagon:wagon-ssh-external:jar:1.0-beta-2
> [DEBUG]   org.apache.maven.wagon:wagon-file:jar:1.0-beta-2
> [DEBUG]   org.apache.maven.wagon:wagon-http-lightweight:jar:1.0-beta-2
> [DEBUG]   easymock:easymock:jar:1.2_Java1.3:test
> [DEBUG]   classworlds:classworlds:jar:1.1
> [DEBUG]       org.apache.maven:maven-artifact:jar:2.0.6:runtime (selected
> for runtime)
> [DEBUG] Retrieving parent-POM: org.apache.maven.wagon:wagon:pom:1.0-beta-2
> for project: null:wagon-provider-api:jar:1.0-beta-2 from the repository.
> [DEBUG] Retrieving parent-POM: org.apache.maven:maven-parent:pom:4 for
> project: org.apache.maven.wagon:wagon:pom:1.0-beta-2 from the repository.
> [DEBUG] Adding managed dependencies for unknown:wagon-provider-api
> [DEBUG]   org.apache.maven.wagon:wagon-provider-api:jar:1.0-beta-2
> [DEBUG]   org.apache.maven.wagon:wagon-provider-test:jar:1.0-beta-2
> [DEBUG]   org.apache.maven.wagon:wagon-ssh-common-test:jar:1.0-beta-2
> [DEBUG]   org.apache.maven.wagon:wagon-ssh-common:jar:1.0-beta-2
> [DEBUG]   junit:junit:jar:3.8.1
> [DEBUG]   org.codehaus.plexus:plexus-interactivity-api:jar:1.0-alpha-4
> [DEBUG]   org.codehaus.plexus:plexus-container-default:jar:1.0-alpha-8
> [DEBUG]   org.codehaus.plexus:plexus-utils:jar:1.0.4
> [DEBUG]
> org.apache.maven.wagon:wagon-provider-api:jar:1.0-beta-2:runtime (selected
> for runtime)
> [DEBUG]         org.codehaus.plexus:plexus-utils:jar:1.0.4:runtime (removed
> - nearer found: 1.4.1)
> [DEBUG] Adding managed dependencies for
> org.apache.maven:maven-plugin-registry
> [DEBUG]   org.apache.maven:maven-model:jar:2.0.6
> [DEBUG]   org.apache.maven:maven-project:jar:2.0.6
> [DEBUG]   org.apache.maven.reporting:maven-reporting-api:jar:2.0.6
> [DEBUG]   org.apache.maven:maven-repository-metadata:jar:2.0.6
> [DEBUG]   org.apache.maven:maven-artifact:jar:2.0.6
> [DEBUG]   org.apache.maven:maven-artifact-manager:jar:2.0.6
> [DEBUG]   org.apache.maven:maven-artifact-test:jar:2.0.6
> [DEBUG]   org.apache.maven:maven-settings:jar:2.0.6
> [DEBUG]   org.apache.maven:maven-plugin-parameter-documenter:jar:2.0.6
> [DEBUG]   org.apache.maven:maven-profile:jar:2.0.6
> [DEBUG]   org.apache.maven:maven-plugin-registry:jar:2.0.6
> [DEBUG]   org.apache.maven:maven-plugin-api:jar:2.0.6
> [DEBUG]   org.apache.maven:maven-monitor:jar:2.0.6
> [DEBUG]
> org.codehaus.plexus:plexus-container-default:jar:1.0-alpha-9-stable-1
> [DEBUG]   org.codehaus.plexus:plexus-utils:jar:1.4.1
> [DEBUG]   org.apache.maven.wagon:wagon-provider-api:jar:1.0-beta-2
> [DEBUG]   org.apache.maven.wagon:wagon-ssh:jar:1.0-beta-2
> [DEBUG]   org.apache.maven.wagon:wagon-ssh-external:jar:1.0-beta-2
> [DEBUG]   org.apache.maven.wagon:wagon-file:jar:1.0-beta-2
> [DEBUG]   org.apache.maven.wagon:wagon-http-lightweight:jar:1.0-beta-2
> [DEBUG]   easymock:easymock:jar:1.2_Java1.3:test
> [DEBUG]   classworlds:classworlds:jar:1.1
> [DEBUG]     org.apache.maven:maven-plugin-registry:jar:2.0.6:runtime
> (selected for runtime)
> [DEBUG]     org.codehaus.plexus:plexus-utils:jar:1.4.1:runtime (selected
> for runtime)
> [DEBUG]     org.apache.maven:maven-artifact:jar:2.0.6:runtime (selected for
> runtime)
> [DEBUG]
> org.codehaus.plexus:plexus-container-default:jar:1.0-alpha-9-stable-1:runtime
> (selected for runtime)
> [DEBUG]       junit:junit:jar:3.8.1:runtime (selected for runtime)
> [DEBUG]       org.codehaus.plexus:plexus-utils:jar:1.0.4:runtime (removed -
> nearer found: 1.4.1)
> [DEBUG]       classworlds:classworlds:jar:1.1-alpha-2:runtime (selected for
> runtime)
> [DEBUG] Retrieving parent-POM: org.codehaus.plexus:plexus:pom:1.0.12 for
> project: null:plexus-utils:jar:1.5.6 from the repository.
> [DEBUG]   org.codehaus.plexus:plexus-utils:jar:1.4.1:runtime (removed -
> nearer found: 1.5.6)
> [DEBUG]   org.codehaus.plexus:plexus-utils:jar:1.5.6:runtime (selected for
> runtime)
> [DEBUG] Retrieving parent-POM:
> org.apache.maven.shared:maven-shared-components:pom:10 for project:
> org.apache.maven.shared:maven-filtering:jar:1.0-beta-2 from the repository.
> [DEBUG]   org.apache.maven.shared:maven-filtering:jar:1.0-beta-2:runtime
> (selected for runtime)
> [DEBUG] Adding managed dependencies for unknown:maven-core
> [DEBUG]   org.apache.maven:maven-model:jar:2.0.6
> [DEBUG]   org.apache.maven:maven-project:jar:2.0.6
> [DEBUG]   org.apache.maven.reporting:maven-reporting-api:jar:2.0.6
> [DEBUG]   org.apache.maven:maven-repository-metadata:jar:2.0.6
> [DEBUG]   org.apache.maven:maven-artifact:jar:2.0.6
> [DEBUG]   org.apache.maven:maven-artifact-manager:jar:2.0.6
> [DEBUG]   org.apache.maven:maven-artifact-test:jar:2.0.6
> [DEBUG]   org.apache.maven:maven-settings:jar:2.0.6
> [DEBUG]   org.apache.maven:maven-plugin-parameter-documenter:jar:2.0.6
> [DEBUG]   org.apache.maven:maven-profile:jar:2.0.6
> [DEBUG]   org.apache.maven:maven-plugin-registry:jar:2.0.6
> [DEBUG]   org.apache.maven:maven-plugin-api:jar:2.0.6
> [DEBUG]   org.apache.maven:maven-monitor:jar:2.0.6
> [DEBUG]
> org.codehaus.plexus:plexus-container-default:jar:1.0-alpha-9-stable-1
> [DEBUG]   org.codehaus.plexus:plexus-utils:jar:1.4.1
> [DEBUG]   org.apache.maven.wagon:wagon-provider-api:jar:1.0-beta-2
> [DEBUG]   org.apache.maven.wagon:wagon-ssh:jar:1.0-beta-2
> [DEBUG]   org.apache.maven.wagon:wagon-ssh-external:jar:1.0-beta-2
> [DEBUG]   org.apache.maven.wagon:wagon-file:jar:1.0-beta-2
> [DEBUG]   org.apache.maven.wagon:wagon-http-lightweight:jar:1.0-beta-2
> [DEBUG]   easymock:easymock:jar:1.2_Java1.3:test
> [DEBUG]   classworlds:classworlds:jar:1.1
> [DEBUG]     org.apache.maven:maven-core:jar:2.0.6:runtime (selected for
> runtime)
> [DEBUG] Retrieving parent-POM:
> org.apache.maven.wagon:wagon-providers:pom:1.0-beta-2 for project:
> null:wagon-file:jar:1.0-beta-2 from the repository.
> [DEBUG] Adding managed dependencies for unknown:wagon-file
> [DEBUG]   org.apache.maven.wagon:wagon-ssh-common:jar:1.0-beta-2
> [DEBUG]   org.apache.maven.wagon:wagon-ssh-common-test:jar:1.0-beta-2:test
> [DEBUG]   org.apache.maven.wagon:wagon-provider-api:jar:1.0-beta-2
> [DEBUG]   org.apache.maven.wagon:wagon-provider-test:jar:1.0-beta-2
> [DEBUG]   junit:junit:jar:3.8.1
> [DEBUG]   org.codehaus.plexus:plexus-interactivity-api:jar:1.0-alpha-4
> [DEBUG]   org.codehaus.plexus:plexus-container-default:jar:1.0-alpha-8
> [DEBUG]   org.codehaus.plexus:plexus-utils:jar:1.0.4
> [DEBUG]       org.apache.maven.wagon:wagon-file:jar:1.0-beta-2:runtime
> (selected for runtime)
> [DEBUG] Adding managed dependencies for
> unknown:maven-plugin-parameter-documenter
> [DEBUG]   org.apache.maven:maven-model:jar:2.0.6
> [DEBUG]   org.apache.maven:maven-project:jar:2.0.6
> [DEBUG]   org.apache.maven.reporting:maven-reporting-api:jar:2.0.6
> [DEBUG]   org.apache.maven:maven-repository-metadata:jar:2.0.6
> [DEBUG]   org.apache.maven:maven-artifact:jar:2.0.6
> [DEBUG]   org.apache.maven:maven-artifact-manager:jar:2.0.6
> [DEBUG]   org.apache.maven:maven-artifact-test:jar:2.0.6
> [DEBUG]   org.apache.maven:maven-settings:jar:2.0.6
> [DEBUG]   org.apache.maven:maven-plugin-parameter-documenter:jar:2.0.6
> [DEBUG]   org.apache.maven:maven-profile:jar:2.0.6
> [DEBUG]   org.apache.maven:maven-plugin-registry:jar:2.0.6
> [DEBUG]   org.apache.maven:maven-plugin-api:jar:2.0.6
> [DEBUG]   org.apache.maven:maven-monitor:jar:2.0.6
> [DEBUG]
> org.codehaus.plexus:plexus-container-default:jar:1.0-alpha-9-stable-1
> [DEBUG]   org.codehaus.plexus:plexus-utils:jar:1.4.1
> [DEBUG]   org.apache.maven.wagon:wagon-provider-api:jar:1.0-beta-2
> [DEBUG]   org.apache.maven.wagon:wagon-ssh:jar:1.0-beta-2
> [DEBUG]   org.apache.maven.wagon:wagon-ssh-external:jar:1.0-beta-2
> [DEBUG]   org.apache.maven.wagon:wagon-file:jar:1.0-beta-2
> [DEBUG]   org.apache.maven.wagon:wagon-http-lightweight:jar:1.0-beta-2
> [DEBUG]   easymock:easymock:jar:1.2_Java1.3:test
> [DEBUG]   classworlds:classworlds:jar:1.1
> [DEBUG]
> org.apache.maven:maven-plugin-parameter-documenter:jar:2.0.6:runtime
> (selected for runtime)
> [DEBUG]         org.codehaus.plexus:plexus-utils:jar:1.4.1:runtime (removed
> - nearer found: 1.5.6)
> [DEBUG] Adding managed dependencies for unknown:wagon-http-lightweight
> [DEBUG]   org.apache.maven.wagon:wagon-ssh-common:jar:1.0-beta-2
> [DEBUG]   org.apache.maven.wagon:wagon-ssh-common-test:jar:1.0-beta-2:test
> [DEBUG]   org.apache.maven.wagon:wagon-provider-api:jar:1.0-beta-2
> [DEBUG]   org.apache.maven.wagon:wagon-provider-test:jar:1.0-beta-2
> [DEBUG]   junit:junit:jar:3.8.1
> [DEBUG]   org.codehaus.plexus:plexus-interactivity-api:jar:1.0-alpha-4
> [DEBUG]   org.codehaus.plexus:plexus-container-default:jar:1.0-alpha-8
> [DEBUG]   org.codehaus.plexus:plexus-utils:jar:1.0.4
> [DEBUG]
> org.apache.maven.wagon:wagon-http-lightweight:jar:1.0-beta-2:runtime
> (selected for runtime)
> [DEBUG] Adding managed dependencies for unknown:wagon-http-shared
> [DEBUG]   org.apache.maven.wagon:wagon-ssh-common:jar:1.0-beta-2
> [DEBUG]   org.apache.maven.wagon:wagon-ssh-common-test:jar:1.0-beta-2:test
> [DEBUG]   org.apache.maven.wagon:wagon-provider-api:jar:1.0-beta-2
> [DEBUG]   org.apache.maven.wagon:wagon-provider-test:jar:1.0-beta-2
> [DEBUG]   junit:junit:jar:3.8.1
> [DEBUG]   org.codehaus.plexus:plexus-interactivity-api:jar:1.0-alpha-4
> [DEBUG]   org.codehaus.plexus:plexus-container-default:jar:1.0-alpha-8
> [DEBUG]   org.codehaus.plexus:plexus-utils:jar:1.0.4
> [DEBUG]
> org.apache.maven.wagon:wagon-http-shared:jar:1.0-beta-2:runtime (selected
> for runtime)
> [DEBUG]           jtidy:jtidy:jar:4aug2000r7-dev:runtime (selected for
> runtime)
> [DEBUG]         xml-apis:xml-apis:jar:1.0.b2:runtime (selected for runtime)
> [DEBUG] Retrieving parent-POM:
> org.apache.maven.reporting:maven-reporting:pom:2.0.6 for project:
> null:maven-reporting-api:jar:null from the repository.
> [DEBUG] Adding managed dependencies for unknown:maven-reporting-api
> [DEBUG]   org.apache.maven:maven-model:jar:2.0.6
> [DEBUG]   org.apache.maven:maven-project:jar:2.0.6
> [DEBUG]   org.apache.maven.reporting:maven-reporting-api:jar:2.0.6
> [DEBUG]   org.apache.maven:maven-repository-metadata:jar:2.0.6
> [DEBUG]   org.apache.maven:maven-artifact:jar:2.0.6
> [DEBUG]   org.apache.maven:maven-artifact-manager:jar:2.0.6
> [DEBUG]   org.apache.maven:maven-artifact-test:jar:2.0.6
> [DEBUG]   org.apache.maven:maven-settings:jar:2.0.6
> [DEBUG]   org.apache.maven:maven-plugin-parameter-documenter:jar:2.0.6
> [DEBUG]   org.apache.maven:maven-profile:jar:2.0.6
> [DEBUG]   org.apache.maven:maven-plugin-registry:jar:2.0.6
> [DEBUG]   org.apache.maven:maven-plugin-api:jar:2.0.6
> [DEBUG]   org.apache.maven:maven-monitor:jar:2.0.6
> [DEBUG]
> org.codehaus.plexus:plexus-container-default:jar:1.0-alpha-9-stable-1
> [DEBUG]   org.codehaus.plexus:plexus-utils:jar:1.4.1
> [DEBUG]   org.apache.maven.wagon:wagon-provider-api:jar:1.0-beta-2
> [DEBUG]   org.apache.maven.wagon:wagon-ssh:jar:1.0-beta-2
> [DEBUG]   org.apache.maven.wagon:wagon-ssh-external:jar:1.0-beta-2
> [DEBUG]   org.apache.maven.wagon:wagon-file:jar:1.0-beta-2
> [DEBUG]   org.apache.maven.wagon:wagon-http-lightweight:jar:1.0-beta-2
> [DEBUG]   easymock:easymock:jar:1.2_Java1.3:test
> [DEBUG]   classworlds:classworlds:jar:1.1
> [DEBUG]
> org.apache.maven.reporting:maven-reporting-api:jar:2.0.6:runtime (selected
> for runtime)
> [DEBUG] Retrieving parent-POM: org.apache.maven.doxia:doxia:pom:1.0-alpha-7
> for project: null:doxia-sink-api:jar:1.0-alpha-7 from the repository.
> [DEBUG]
> org.apache.maven.doxia:doxia-sink-api:jar:1.0-alpha-7:runtime (selected for
> runtime)
> [DEBUG] Adding managed dependencies for unknown:maven-error-diagnostics
> [DEBUG]   org.apache.maven:maven-model:jar:2.0.6
> [DEBUG]   org.apache.maven:maven-project:jar:2.0.6
> [DEBUG]   org.apache.maven.reporting:maven-reporting-api:jar:2.0.6
> [DEBUG]   org.apache.maven:maven-repository-metadata:jar:2.0.6
> [DEBUG]   org.apache.maven:maven-artifact:jar:2.0.6
> [DEBUG]   org.apache.maven:maven-artifact-manager:jar:2.0.6
> [DEBUG]   org.apache.maven:maven-artifact-test:jar:2.0.6
> [DEBUG]   org.apache.maven:maven-settings:jar:2.0.6
> [DEBUG]   org.apache.maven:maven-plugin-parameter-documenter:jar:2.0.6
> [DEBUG]   org.apache.maven:maven-profile:jar:2.0.6
> [DEBUG]   org.apache.maven:maven-plugin-registry:jar:2.0.6
> [DEBUG]   org.apache.maven:maven-plugin-api:jar:2.0.6
> [DEBUG]   org.apache.maven:maven-monitor:jar:2.0.6
> [DEBUG]
> org.codehaus.plexus:plexus-container-default:jar:1.0-alpha-9-stable-1
> [DEBUG]   org.codehaus.plexus:plexus-utils:jar:1.4.1
> [DEBUG]   org.apache.maven.wagon:wagon-provider-api:jar:1.0-beta-2
> [DEBUG]   org.apache.maven.wagon:wagon-ssh:jar:1.0-beta-2
> [DEBUG]   org.apache.maven.wagon:wagon-ssh-external:jar:1.0-beta-2
> [DEBUG]   org.apache.maven.wagon:wagon-file:jar:1.0-beta-2
> [DEBUG]   org.apache.maven.wagon:wagon-http-lightweight:jar:1.0-beta-2
> [DEBUG]   easymock:easymock:jar:1.2_Java1.3:test
> [DEBUG]   classworlds:classworlds:jar:1.1
> [DEBUG]       org.apache.maven:maven-error-diagnostics:jar:2.0.6:runtime
> (selected for runtime)
> [DEBUG]       commons-cli:commons-cli:jar:1.0:runtime (selected for
> runtime)
> [DEBUG] Adding managed dependencies for unknown:wagon-ssh-external
> [DEBUG]   org.apache.maven.wagon:wagon-ssh-common:jar:1.0-beta-2
> [DEBUG]   org.apache.maven.wagon:wagon-ssh-common-test:jar:1.0-beta-2:test
> [DEBUG]   org.apache.maven.wagon:wagon-provider-api:jar:1.0-beta-2
> [DEBUG]   org.apache.maven.wagon:wagon-provider-test:jar:1.0-beta-2
> [DEBUG]   junit:junit:jar:3.8.1
> [DEBUG]   org.codehaus.plexus:plexus-interactivity-api:jar:1.0-alpha-4
> [DEBUG]   org.codehaus.plexus:plexus-container-default:jar:1.0-alpha-8
> [DEBUG]   org.codehaus.plexus:plexus-utils:jar:1.0.4
> [DEBUG]
> org.apache.maven.wagon:wagon-ssh-external:jar:1.0-beta-2:runtime (selected
> for runtime)
> [DEBUG]         org.codehaus.plexus:plexus-utils:jar:1.0.4:runtime (removed
> - nearer found: 1.5.6)
> [DEBUG] Adding managed dependencies for unknown:wagon-ssh-common
> [DEBUG]   org.apache.maven.wagon:wagon-ssh-common:jar:1.0-beta-2
> [DEBUG]   org.apache.maven.wagon:wagon-ssh-common-test:jar:1.0-beta-2:test
> [DEBUG]   org.apache.maven.wagon:wagon-provider-api:jar:1.0-beta-2
> [DEBUG]   org.apache.maven.wagon:wagon-provider-test:jar:1.0-beta-2
> [DEBUG]   junit:junit:jar:3.8.1
> [DEBUG]   org.codehaus.plexus:plexus-interactivity-api:jar:1.0-alpha-4
> [DEBUG]   org.codehaus.plexus:plexus-container-default:jar:1.0-alpha-8
> [DEBUG]   org.codehaus.plexus:plexus-utils:jar:1.0.4
> [DEBUG]
> org.apache.maven.wagon:wagon-ssh-common:jar:1.0-beta-2:runtime (selected for
> runtime)
> [DEBUG]           org.codehaus.plexus:plexus-utils:jar:1.0.4:runtime
> (removed - nearer found: 1.5.6)
> [DEBUG]
> org.codehaus.plexus:plexus-interactivity-api:jar:1.0-alpha-4:runtime
> (selected for runtime)
> [DEBUG] Retrieving parent-POM: plexus:plexus-containers:pom:1.0.2 for
> project: org.codehaus.plexus:plexus-container-default:jar:1.0-alpha-7 from
> the repository.
> [DEBUG] Retrieving parent-POM: plexus:plexus-root:pom:1.0.3 for project:
> plexus:plexus-containers:pom:1.0.2 from the repository.
> [DEBUG]
> org.codehaus.plexus:plexus-container-default:jar:1.0-alpha-7:runtime
> (removed - nearer found: 1.0-alpha-9-stable-1)
> [DEBUG]             plexus:plexus-utils:jar:1.0.2:runtime (selected for
> runtime)
> [DEBUG] Adding managed dependencies for unknown:maven-plugin-descriptor
> [DEBUG]   org.apache.maven:maven-model:jar:2.0.6
> [DEBUG]   org.apache.maven:maven-project:jar:2.0.6
> [DEBUG]   org.apache.maven.reporting:maven-reporting-api:jar:2.0.6
> [DEBUG]   org.apache.maven:maven-repository-metadata:jar:2.0.6
> [DEBUG]   org.apache.maven:maven-artifact:jar:2.0.6
> [DEBUG]   org.apache.maven:maven-artifact-manager:jar:2.0.6
> [DEBUG]   org.apache.maven:maven-artifact-test:jar:2.0.6
> [DEBUG]   org.apache.maven:maven-settings:jar:2.0.6
> [DEBUG]   org.apache.maven:maven-plugin-parameter-documenter:jar:2.0.6
> [DEBUG]   org.apache.maven:maven-profile:jar:2.0.6
> [DEBUG]   org.apache.maven:maven-plugin-registry:jar:2.0.6
> [DEBUG]   org.apache.maven:maven-plugin-api:jar:2.0.6
> [DEBUG]   org.apache.maven:maven-monitor:jar:2.0.6
> [DEBUG]
> org.codehaus.plexus:plexus-container-default:jar:1.0-alpha-9-stable-1
> [DEBUG]   org.codehaus.plexus:plexus-utils:jar:1.4.1
> [DEBUG]   org.apache.maven.wagon:wagon-provider-api:jar:1.0-beta-2
> [DEBUG]   org.apache.maven.wagon:wagon-ssh:jar:1.0-beta-2
> [DEBUG]   org.apache.maven.wagon:wagon-ssh-external:jar:1.0-beta-2
> [DEBUG]   org.apache.maven.wagon:wagon-file:jar:1.0-beta-2
> [DEBUG]   org.apache.maven.wagon:wagon-http-lightweight:jar:1.0-beta-2
> [DEBUG]   easymock:easymock:jar:1.2_Java1.3:test
> [DEBUG]   classworlds:classworlds:jar:1.1
> [DEBUG]       org.apache.maven:maven-plugin-descriptor:jar:2.0.6:runtime
> (selected for runtime)
> [DEBUG]
> org.codehaus.plexus:plexus-interactivity-api:jar:1.0-alpha-4:runtime
> (selected for runtime)
> [DEBUG] Adding managed dependencies for unknown:maven-monitor
> [DEBUG]   org.apache.maven:maven-model:jar:2.0.6
> [DEBUG]   org.apache.maven:maven-project:jar:2.0.6
> [DEBUG]   org.apache.maven.reporting:maven-reporting-api:jar:2.0.6
> [DEBUG]   org.apache.maven:maven-repository-metadata:jar:2.0.6
> [DEBUG]   org.apache.maven:maven-artifact:jar:2.0.6
> [DEBUG]   org.apache.maven:maven-artifact-manager:jar:2.0.6
> [DEBUG]   org.apache.maven:maven-artifact-test:jar:2.0.6
> [DEBUG]   org.apache.maven:maven-settings:jar:2.0.6
> [DEBUG]   org.apache.maven:maven-plugin-parameter-documenter:jar:2.0.6
> [DEBUG]   org.apache.maven:maven-profile:jar:2.0.6
> [DEBUG]   org.apache.maven:maven-plugin-registry:jar:2.0.6
> [DEBUG]   org.apache.maven:maven-plugin-api:jar:2.0.6
> [DEBUG]   org.apache.maven:maven-monitor:jar:2.0.6
> [DEBUG]
> org.codehaus.plexus:plexus-container-default:jar:1.0-alpha-9-stable-1
> [DEBUG]   org.codehaus.plexus:plexus-utils:jar:1.4.1
> [DEBUG]   org.apache.maven.wagon:wagon-provider-api:jar:1.0-beta-2
> [DEBUG]   org.apache.maven.wagon:wagon-ssh:jar:1.0-beta-2
> [DEBUG]   org.apache.maven.wagon:wagon-ssh-external:jar:1.0-beta-2
> [DEBUG]   org.apache.maven.wagon:wagon-file:jar:1.0-beta-2
> [DEBUG]   org.apache.maven.wagon:wagon-http-lightweight:jar:1.0-beta-2
> [DEBUG]   easymock:easymock:jar:1.2_Java1.3:test
> [DEBUG]   classworlds:classworlds:jar:1.1
> [DEBUG]       org.apache.maven:maven-monitor:jar:2.0.6:runtime (selected
> for runtime)
> [DEBUG] Adding managed dependencies for unknown:wagon-ssh
> [DEBUG]   org.apache.maven.wagon:wagon-ssh-common:jar:1.0-beta-2
> [DEBUG]   org.apache.maven.wagon:wagon-ssh-common-test:jar:1.0-beta-2:test
> [DEBUG]   org.apache.maven.wagon:wagon-provider-api:jar:1.0-beta-2
> [DEBUG]   org.apache.maven.wagon:wagon-provider-test:jar:1.0-beta-2
> [DEBUG]   junit:junit:jar:3.8.1
> [DEBUG]   org.codehaus.plexus:plexus-interactivity-api:jar:1.0-alpha-4
> [DEBUG]   org.codehaus.plexus:plexus-container-default:jar:1.0-alpha-8
> [DEBUG]   org.codehaus.plexus:plexus-utils:jar:1.0.4
> [DEBUG]       org.apache.maven.wagon:wagon-ssh:jar:1.0-beta-2:runtime
> (selected for runtime)
> [DEBUG]         com.jcraft:jsch:jar:0.1.27:runtime (selected for runtime)
> [DEBUG]         org.codehaus.plexus:plexus-utils:jar:1.0.4:runtime (removed
> - nearer found: 1.5.6)
> [DEBUG]       org.codehaus.plexus:plexus-utils:jar:1.4.1:runtime (removed -
> nearer found: 1.5.6)
> [DEBUG]       classworlds:classworlds:jar:1.1:runtime (removed - nearer
> found: 1.1-alpha-2)
> [DEBUG]     org.apache.maven:maven-monitor:jar:2.0.6:runtime (selected for
> runtime)
> [DEBUG]     org.codehaus.plexus:plexus-interpolation:jar:1.6:runtime
> (selected for runtime)
> [DEBUG]  The following artifacts were filtered out for plugin:
> org.apache.maven.plugins:maven-resources-plugin:2.3 because they're already
> in the core of Maven:
>
> org.apache.maven:maven-plugin-api:jar:2.0.6:runtime
> org.apache.maven:maven-project:jar:2.0.6:runtime
>
> These will use the artifact files already in the core ClassRealm instead,
> to allow them to be included in PluginDescriptor.getArtifacts().
>
>
> [DEBUG] Configuring mojo
> 'org.apache.maven.plugins:maven-resources-plugin:2.3:resources' -->
> [DEBUG]   (f) filters = []
> [DEBUG]   (s) includeEmptyDirs = false
> [DEBUG]   (s) outputDirectory =
> /home/mwinter/workspace/arquillian-example/target/classes
> [DEBUG]   (s) overwrite = false
> [DEBUG]   (f) project = MavenProject:
> org.jboss.jsfunit:arquillian-example:1.0-SNAPSHOT @
> /home/mwinter/workspace/arquillian-example/pom.xml
> [DEBUG]   (s) resources = [Resource {targetPath: null, filtering: false,
> FileSet {directory:
> /home/mwinter/workspace/arquillian-example/src/main/resources, PatternSet
> [includes: {}, excludes: {}]}}]
> [DEBUG]   (f) session = org.apache.maven.execution.MavenSession@1c54796
> [DEBUG] -- end configuration --
> [INFO] [resources:resources {execution: default-resources}]
> [DEBUG] properties used {java.vendor=Sun Microsystems Inc.,
> env.SESSION_MANAGER=local/mwinter:@/tmp/.ICE-unix/1434,unix/mwinter:/tmp/.ICE-unix/1434,
> env.LESSOPEN=| /usr/bin/lesspipe %s, sun.java.launcher=SUN_STANDARD,
> sun.management.compiler=HotSpot Tiered Compilers, os.name=Linux,
> sun.boot.class.path=/usr/lib/jvm/java-6-sun-1.6.0.22/jre/lib/resources.jar:/usr/lib/jvm/java-6-sun-1.6.0.22/jre/lib/rt.jar:/usr/lib/jvm/java-6-sun-1.6.0.22/jre/lib/sunrsasign.jar:/usr/lib/jvm/java-6-sun-1.6.0.22/jre/lib/jsse.jar:/usr/lib/jvm/java-6-sun-1.6.0.22/jre/lib/jce.jar:/usr/lib/jvm/java-6-sun-1.6.0.22/jre/lib/charsets.jar:/usr/lib/jvm/java-6-sun-1.6.0.22/jre/classes,
> env.PWD=/home/mwinter/workspace/arquillian-example,
> env.XDG_SESSION_COOKIE=58ba4814ca4f1dd55fd48bc54bf0147d-1288664918.939876-1207876750,
> jsfunit.version=1.3.0.Final, sun.desktop=gnome, env.LANG=de_DE.utf8,
> java.vm.specification.vendor=Sun Microsystems Inc.,
> java.runtime.version=1.6.0_22-b04,
> env.DEFAULTS_PATH=/usr/share/gconf/gnome.default.path, env.DISPLAY=:0.0,
> user.name=mwinter, env._=/usr/bin/mvn, env.USER=mwinter,
> env.SHELL=/bin/bash, env.DESKTOP_SESSION=gnome,
> env.XDG_DATA_DIRS=/usr/share/gnome:/usr/local/share/:/usr/share/,
> env.NLSPATH=/usr/dt/lib/nls/msg/%L/%N.cat,
> env.PATH=/usr/local/sbin:/usr/local/bin:/usr/sbin:/usr/bin:/sbin:/bin:/usr/games,
> user.language=de,
> sun.boot.library.path=/usr/lib/jvm/java-6-sun-1.6.0.22/jre/lib/i386,
> classworlds.conf=/usr/share/maven2/bin/m2.conf, java.version=1.6.0_22,
> user.timezone=Europe/Berlin,
> env.DBUS_SESSION_BUS_ADDRESS=unix:abstract=/tmp/dbus-DXidbLqKlk,guid=36f19188c428e2754abb21e14ccf7757,
> sun.arch.data.model=32, env.SSH_AGENT_PID=1468,
> java.endorsed.dirs=/usr/lib/jvm/java-6-sun-1.6.0.22/jre/lib/endorsed,
> sun.cpu.isalist=, sun.jnu.encoding=UTF-8, file.encoding.pkg=sun.io,
> env.SHLVL=1, file.separator=/, java.specification.name=Java Platform API
> Specification, env.GNOME_DESKTOP_SESSION_ID=this-is-deprecated,
> java.class.version=50.0, env.GDMSESSION=gnome, env.GDM_KEYBOARD_LAYOUT=de
>  nodeadkeys, user.country=DE, env.GNOME_KEYRING_PID=1416,
> java.home=/usr/lib/jvm/java-6-sun-1.6.0.22/jre, java.vm.info=mixed mode,
> env.LOGNAME=mwinter, os.version=2.6.32-25-generic, path.separator=:,
> java.vm.version=17.1-b03, java.awt.printerjob=sun.print.PSPrinterJob,
> env.TERM=xterm, sun.io.unicode.encoding=UnicodeLittle,
> env.GDM_LANG=de_DE.utf8, user.home=/home/mwinter,
> version.jboss_60=6.0.0.20100721-M4, env.OLDPWD=/home/mwinter,
> java.specification.vendor=Sun Microsystems Inc., env.WINDOWID=83886083,
> java.library.path=/usr/lib/jvm/java-6-sun-1.6.0.22/jre/lib/i386/server:/usr/lib/jvm/java-6-sun-1.6.0.22/jre/lib/i386:/usr/lib/jvm/java-6-sun-1.6.0.22/jre/../lib/i386:/usr/java/packages/lib/i386:/lib:/usr/lib,
> java.vendor.url=http://java.sun.com/, java.vm.vendor=Sun Microsystems
> Inc., maven.home=/usr/share/maven2, java.runtime.name=Java(TM) SE Runtime
> Environment, java.class.path=/usr/share/maven2/boot/classworlds.jar,
> env.XFILESEARCHPATH=/usr/dt/app-defaults/%L/Dt, java.vm.specification.name=Java
> Virtual Machine Specification, java.vm.specification.version=1.0,
> sun.os.patch.level=unknown, sun.cpu.endian=little, env.HOME=/home/mwinter,
> env.LD_LIBRARY_PATH=/usr/lib/jvm/java-6-sun-1.6.0.22/jre/lib/i386/server:/usr/lib/jvm/java-6-sun-1.6.0.22/jre/lib/i386:/usr/lib/jvm/java-6-sun-1.6.0.22/jre/../lib/i386,
> java.io.tmpdir=/tmp,
> env.LS_COLORS=rs=0:di=01;34:ln=01;36:hl=44;37:pi=40;33:so=01;35:do=01;35:bd=40;33;01:cd=40;33;01:or=40;31;01:su=37;41:sg=30;43:ca=30;41:tw=30;42:ow=34;42:st=37;44:ex=01;32:*.tar=01;31:*.tgz=01;31:*.arj=01;31:*.taz=01;31:*.lzh=01;31:*.lzma=01;31:*.zip=01;31:*.z=01;31:*.Z=01;31:*.dz=01;31:*.gz=01;31:*.bz2=01;31:*.bz=01;31:*.tbz2=01;31:*.tz=01;31:*.deb=01;31:*.rpm=01;31:*.jar=01;31:*.rar=01;31:*.ace=01;31:*.zoo=01;31:*.cpio=01;31:*.7z=01;31:*.rz=01;31:*.jpg=01;35:*.jpeg=01;35:*.gif=01;35:*.bmp=01;35:*.pbm=01;35:*.pgm=01;35:*.ppm=01;35:*.tga=01;35:*.xbm=01;35:*.xpm=01;35:*.tif=01;35:*.tiff=01;35:*.png=01;35:*.svg=01;35:*.svgz=01;35:*.mng=01;35:*.pcx=01;35:*.mov=01;35:*.mpg=01;35:*.mpeg=01;35:*.m2v=01;35:*.mkv=01;35:*.ogm=01;35:*.mp4=01;35:*.m4v=01;35:*.mp4v=01;35:*.vob=01;35:*.qt=01;35:*.nuv=01;35:*.wmv=01;35:*.asf=01;35:*.rm=01;35:*.rmvb=01;35:*.flc=01;35:*.avi=01;35:*.fli=01;35:*.flv=01;35:*.gl=01;35:*.dl=01;35:*.xcf=01;35:*.xwd=01;35:*.yuv=01;35:*.axv=01;35:*.anx=01;35:*.ogv=01;35:*.ogx=01;35:*.aac=00;36:*.au=00;36:*.flac=00;36:*.mid=00;36:*.midi=00;36:*.mka=00;36:*.mp3=00;36:*.mpc=00;36:*.ogg=00;36:*.ra=00;36:*.wav=00;36:*.axa=00;36:*.oga=00;36:*.spx=00;36:*.xspf=00;36:,
> java.vendor.url.bug=http://java.sun.com/cgi-bin/bugreport.cgi,
> env.SSH_AUTH_SOCK=/tmp/keyring-IZ9Mr8/ssh,
> java.awt.graphicsenv=sun.awt.X11GraphicsEnvironment, os.arch=i386,
> java.ext.dirs=/usr/lib/jvm/java-6-sun-1.6.0.22/jre/lib/ext:/usr/java/packages/lib/ext,
> user.dir=/home/mwinter/workspace/arquillian-example,
> env.XAUTHORITY=/var/run/gdm/auth-for-mwinter-PqDLd6/database,
> env.MANDATORY_PATH=/usr/share/gconf/gnome.mandatory.path,
> env.SPEECHD_PORT=7560, env.GTK_MODULES=canberra-gtk-module, line.separator=
> , java.vm.name=Java HotSpot(TM) Server VM, env.COLORTERM=gnome-terminal,
> env.ORBIT_SOCKETDIR=/tmp/orbit-mwinter, env.USERNAME=mwinter,
> file.encoding=UTF-8, java.specification.version=1.6,
> arquillian.version=1.0.0.Alpha4,
> env.GNOME_KEYRING_CONTROL=/tmp/keyring-IZ9Mr8,
> env.XDG_CONFIG_DIRS=/etc/xdg/xdg-gnome:/etc/xdg,
> env.LESSCLOSE=/usr/bin/lesspipe %s %s}
> [WARNING] Using platform encoding (UTF-8 actually) to copy filtered
> resources, i.e. build is platform dependent!
> [DEBUG] resource with targetPath null
> directory /home/mwinter/workspace/arquillian-example/src/main/resources
> excludes []
> includes []
> [INFO] skip non existing resourceDirectory
> /home/mwinter/workspace/arquillian-example/src/main/resources
> [DEBUG] org.jboss.jsfunit:arquillian-example:war:1.0-SNAPSHOT (selected for
> null)
> [DEBUG] Retrieving parent-POM: org.glassfish.extras:extras:pom:3.0.1 for
> project: null:glassfish-embedded-all:jar:null from the repository.
> [DEBUG] Retrieving parent-POM: org.glassfish:glassfish-parent:pom:3.0.1 for
> project: org.glassfish.extras:extras:pom:null from the repository.
> [DEBUG] Retrieving parent-POM: org.glassfish:pom:pom:8 for project:
> org.glassfish:glassfish-parent:pom:3.0.1 from the repository.
> [DEBUG] Adding managed dependencies for unknown:glassfish-embedded-all
> [DEBUG]   com.sun.enterprise:hk2:jar:1.0.0
> [DEBUG]   com.sun.enterprise:hk2-core:jar:1.0.0
> [DEBUG]   com.sun.enterprise:hk2-maven:jar:1.0.0
> [DEBUG]   com.sun.enterprise:osgi-adapter:jar:1.0.0
> [DEBUG]   com.sun.enterprise:osgi-main:jar:1.0.0
> [DEBUG]   com.sun.enterprise:stax-osgi:jar:1.0.0
> [DEBUG]   com.sun.enterprise:auto-depends:jar:1.0.0
> [DEBUG]   com.sun.enterprise:config-types:jar:1.0.0
> [DEBUG]   com.sun.faces:jsf-api:jar:2.0.2-b10
> [DEBUG]   com.sun.grizzly:grizzly-utils:jar:1.9.18-o
> [DEBUG]   com.sun.grizzly:grizzly-framework:jar:1.9.18-o
> [DEBUG]   com.sun.grizzly:grizzly-portunif:jar:1.9.18-o
> [DEBUG]   com.sun.grizzly:grizzly-http:jar:1.9.18-o
> [DEBUG]   com.sun.grizzly:grizzly-rcm:jar:1.9.18-o
> [DEBUG]   com.sun.grizzly:grizzly-compat:jar:1.9.18-o
> [DEBUG]   com.sun.grizzly:grizzly-cometd:jar:1.9.18-o
> [DEBUG]   com.sun.grizzly:grizzly-comet:jar:1.9.18-o
> [DEBUG]   com.sun.grizzly:grizzly-messagesbus:jar:1.9.18-o
> [DEBUG]   com.sun.grizzly:grizzly-config:jar:1.9.18-o
> [DEBUG]   org.netbeans.modules:org-netbeans-modules-dbschema:jar:RELEASE60
> [DEBUG]   org.netbeans.api:org-netbeans-modules-schema2beans:jar:RELEASE55
> [DEBUG]   org.eclipse.persistence:javax.persistence:jar:2.0.0
> [DEBUG]   org.eclipse.persistence:org.eclipse.persistence.core:jar:2.0.1
> [DEBUG]   org.eclipse.persistence:org.eclipse.persistence.jpa:jar:2.0.1
> [DEBUG]   org.eclipse.persistence:org.eclipse.persistence.oracle:jar:2.0.1
> [DEBUG]   org.eclipse.persistence:org.eclipse.persistence.antlr:jar:2.0.1
> [DEBUG]   org.eclipse.persistence:org.eclipse.persistence.asm:jar:2.0.1
> [DEBUG]   antlr:antlr:jar:2.7.6
> [DEBUG]   com.ctc.wstx:woodstox-osgi:jar:3.2.1
> [DEBUG]   com.sun.xml.ws:webservices-osgi:jar:2.0.1
> [DEBUG]   javax.xml:webservices-api-osgi:jar:2.0.1
> [DEBUG]   com.sun.xml.bind:jaxb-osgi:jar:2.2.1.1-promoted-b2
> [DEBUG]   javax.xml.bind:jaxb-api-osgi:jar:2.2.1.1-promoted-b2
> [DEBUG]   com.sun.grizzly:grizzly-http-servlet:jar:1.9.18-o
> [DEBUG]   javax.jbi:jbi:jar:1.0
> [DEBUG]   wsdl4j:wsdl4j:jar:1.6.2
> [DEBUG]   org.glassfish.external:management-api:jar:3.0.0-b012
> [DEBUG]   org.glassfish.gmbal:gmbal:jar:3.0.0-b023
> [DEBUG]   org.jboss.weld:weld-osgi-bundle:jar:1.0.1-SP3
> [DEBUG]   com.sun.faces:jsf-impl:jar:2.0.2-b10
> [DEBUG]   org.apache.felix:org.osgi.core:jar:1.2.0
> [DEBUG]   org.apache.felix:org.osgi.compendium:jar:1.2.0
> [DEBUG]   org.apache.felix:org.apache.felix.main:jar:1.0.3
> [DEBUG]   org.osgi:osgi_R4_core:jar:1.0
> [DEBUG]   com.sun.pkg:pkg-client:jar:1.122-38.2791
> [DEBUG]   com.sun.pkg:pkg-bootstrap:jar:1.122-38.2791
> [DEBUG]   org.glassfish.web:jsp-impl:jar:2.2.1
> [DEBUG]   org.glassfish.web:el-impl:jar:2.2
> [DEBUG]   com.sun.jersey:jersey-server:jar:1.1.5
> [DEBUG]
> com.sun.faces.extensions:jsf-extensions-dynamic-faces:jar:jsftemplating:0.2
> [DEBUG]   com.sun.faces.extensions:jsf-extensions-common:jar:0.2
> [DEBUG]   com.sun.woodstock:webui-jsf:jar:4.0.2.5
> [DEBUG]   com.sun.woodstock:webui-jsf-suntheme:jar:4.0.2.5
> [DEBUG]   org.glassfish.admingui:console-common-help:jar:3.0.1-b03
> [DEBUG]   org.glassfish.admingui:console-corba-plugin-help:jar:3.0.1-b03
> [DEBUG]   org.glassfish.admingui:console-ejb-lite-plugin-help:jar:3.0.1-b03
> [DEBUG]   org.glassfish.admingui:console-ejb-plugin-help:jar:3.0.1-b03
> [DEBUG]   org.glassfish.admingui:console-jca-plugin-help:jar:3.0.1-b03
> [DEBUG]   org.glassfish.admingui:console-jdbc-plugin-help:jar:3.0.1-b03
> [DEBUG]
> org.glassfish.admingui:console-common-full-plugin-help:jar:3.0.1-b03
> [DEBUG]   org.glassfish.admingui:console-jms-plugin-help:jar:3.0.1-b03
> [DEBUG]   org.glassfish.admingui:console-jruby-plugin-help:jar:3.0.1-b03
> [DEBUG]   org.glassfish.admingui:console-jts-plugin-help:jar:3.0.1-b03
> [DEBUG]   org.glassfish.admingui:console-web-plugin-help:jar:3.0.1-b03
> [DEBUG]   com.sun.jsftemplating:jsftemplating:jar:2.0.2
> [DEBUG]   com.sun.jsftemplating:jsftemplating-dt:jar:2.0.2
> [DEBUG]   com.sun.woodstock.dependlibs:json:jar:1.0
> [DEBUG]   com.sun.woodstock.dependlibs:dojo-ajax:jar:0.4.1
> [DEBUG]   com.sun.woodstock.dependlibs:prototype:jar:1.5.0
> [DEBUG]   com.sun.woodstock.dependlibs:dataprovider:jar:1.0
> [DEBUG]   commons-fileupload:commons-fileupload:jar:1.1.1
> [DEBUG]   com.sun.messaging.mq:imqjmx:jar:4.3
> [DEBUG]   org.jvnet:mimepull:jar:1.4
> [DEBUG]   com.sun.jersey.contribs:jersey-multipart:jar:1.1.5
> [DEBUG]   javax.help:javahelp:jar:2.0.02
> [DEBUG]   com.sun.tools.btrace:btrace-agent:jar:1.0.5
> [DEBUG]   com.sun.tools.btrace:btrace-boot:jar:1.0.5
> [DEBUG]
> org.glassfish.external:opendmk_jmxremote_optional_jar:jar:1.0-b01-ea
> [DEBUG]   com.sun.corba:glassfish-corba-orb:jar:3.0.1-b002
> [DEBUG]   com.sun.corba:glassfish-corba-orbgeneric:jar:3.0.1-b002
> [DEBUG]   com.sun.corba:glassfish-corba-omgapi:jar:3.0.1-b002
> [DEBUG]   com.sun.corba:glassfish-corba-codegen:jar:3.0.1-b002
> [DEBUG]   com.sun.corba:glassfish-corba-asm:jar:3.0.1-b002
> [DEBUG]   com.sun.corba:glassfish-corba-csiv2-idl:jar:3.0.1-b002
> [DEBUG]   com.sun.corba:glassfish-corba-newtimer:jar:3.0.1-b002
> [DEBUG]   org.kohsuke.metainf-services:metainf-services:jar:1.1
> [DEBUG]   javax.xml.stream:stax-api:jar:1.0-2
> [DEBUG]   com.sun.xml.stream:sjsxp:jar:1.0
> [DEBUG]   junit:junit:jar:4.3.1
> [DEBUG]   javax.mail:mail:jar:1.4.3
> [DEBUG]   org.glassfish:mq-distribution:jar:4.4.2-005
> [DEBUG]   org.apache.maven:maven-core:jar:2.0.7
> [DEBUG]   commons-io:commons-io:jar:1.3.1
> [DEBUG]   org.apache.maven:maven-plugin-api:jar:2.0
> [DEBUG]   org.apache.maven.scm:maven-scm-api:jar:1.0-beta-3
> [DEBUG]   org.apache.maven.plugins:maven-scm-plugin:jar:1.0-beta-3
> [DEBUG]   org.apache.maven:maven-project:jar:2.0
> [DEBUG]   org.apache.maven:maven-archiver:jar:2.0
> [DEBUG]   org.apache.ant:ant:jar:1.7.0
> [DEBUG]   org.apache.ant:ant-launcher:jar:1.7.0
> [DEBUG]   javax.jms:jms-api:jar:1.1-rev-1
> [DEBUG]   javax.jws:jsr181-api:jar:1.0-MR1
> [DEBUG]   javax.servlet.jsp:jsp-api:jar:2.2
> [DEBUG]   javax.el:el-api:jar:2.2
> [DEBUG]   javax.servlet.jsp.jstl:jstl-api:jar:1.2
> [DEBUG]   org.glassfish.web:jstl-impl:jar:1.2
> [DEBUG]   javax.xml:jaxrpc-api:jar:1.1
> [DEBUG]   javax.xml.soap:saaj-api:jar:1.3
> [DEBUG]   org.glassfish:genericra:jar:2.0-20081121
> [DEBUG]   com.sun.scn:sysnet-registration:jar:1.0.2
> [DEBUG]   com.sun:ldapbp:jar:1.0
> [DEBUG]   commons-codec:commons-codec:jar:1.3
> [DEBUG]   asm:asm-commons:jar:3.1
> [DEBUG]   org.glassfish.extras:glassfish-embedded-all:jar:3.0.1:provided
> (selected for provided)
> [DEBUG] Retrieving parent-POM:
> org.jboss.arquillian:arquillian-build:pom:1.0.0.Alpha4 for project:
> org.jboss.arquillian.container:arquillian-glassfish-embedded-3:jar:null from
> the repository.
> [DEBUG] Retrieving parent-POM: org.jboss:jboss-parent:pom:5 for project:
> org.jboss.arquillian:arquillian-build:pom:1.0.0.Alpha4 from the repository.
> [DEBUG] Adding managed dependencies for
> org.jboss.arquillian.container:arquillian-glassfish-embedded-3
> [DEBUG]   javax.inject:javax.inject:jar:1
> [DEBUG]   org.jboss.logging:jboss-logging-spi:jar:2.1.0.GA
> [DEBUG]   org.jboss.logging:jboss-logging-log4j:jar:2.1.0.GA
> [DEBUG]   org.jboss.osgi:jboss-osgi-spi:jar:1.0.10
> [DEBUG]   org.jboss.osgi.vfs:jboss-osgi-vfs:jar:1.0.0
> [DEBUG]   org.jboss.osgi.vfs:jboss-osgi-vfs30:jar:1.0.0
> [DEBUG]   org.jboss.shrinkwrap:shrinkwrap-api:jar:1.0.0-alpha-11
> [DEBUG]   org.jboss.shrinkwrap:shrinkwrap-spi:jar:1.0.0-alpha-11
> [DEBUG]   org.jboss.shrinkwrap:shrinkwrap-impl-base:jar:1.0.0-alpha-11
> [DEBUG]
> org.jboss.shrinkwrap:shrinkwrap-extension-glassfish:jar:1.0.0-alpha-11
> [DEBUG]   org.jboss.shrinkwrap:shrinkwrap-extension-vdf:jar:1.0.0-alpha-11
> [DEBUG]   org.jboss.shrinkwrap:shrinkwrap-extension-vfs3:jar:1.0.0-alpha-11
> [DEBUG]
> org.jboss.shrinkwrap:shrinkwrap-extension-classloader:jar:1.0.0-alpha-11
> [DEBUG]
> org.jboss.shrinkwrap:shrinkwrap-extension-tomcat-6:jar:1.0.0-alpha-11
> [DEBUG]
> org.jboss.shrinkwrap:shrinkwrap-extension-jetty-6:jar:1.0.0-alpha-11
> [DEBUG]
> org.jboss.shrinkwrap:shrinkwrap-extension-jetty-7:jar:1.0.0-alpha-11
> [DEBUG]   javax:javaee-api:jar:6.0
> [DEBUG]   org.osgi:org.osgi.core:jar:4.2.0
> [DEBUG]   org.osgi:org.osgi.compendium:jar:4.2.0
> [DEBUG]   junit:junit:jar:4.8.1
> [DEBUG]   org.testng:testng:jar:5.12.1
> [DEBUG]   org.mortbay.jetty:jetty-embedded:jar:6.1.9
> [DEBUG]   org.mockito:mockito-all:jar:1.8.3
> [DEBUG]
> org.jboss.arquillian.container:arquillian-glassfish-embedded-3:jar:1.0.0.Alpha4:test
> (selected for test)
> [DEBUG] Adding managed dependencies for unknown:arquillian-spi
> [DEBUG]   javax.inject:javax.inject:jar:1
> [DEBUG]   org.jboss.logging:jboss-logging-spi:jar:2.1.0.GA
> [DEBUG]   org.jboss.logging:jboss-logging-log4j:jar:2.1.0.GA
> [DEBUG]   org.jboss.osgi:jboss-osgi-spi:jar:1.0.10
> [DEBUG]   org.jboss.osgi.vfs:jboss-osgi-vfs:jar:1.0.0
> [DEBUG]   org.jboss.osgi.vfs:jboss-osgi-vfs30:jar:1.0.0
> [DEBUG]   org.jboss.shrinkwrap:shrinkwrap-api:jar:1.0.0-alpha-11
> [DEBUG]   org.jboss.shrinkwrap:shrinkwrap-spi:jar:1.0.0-alpha-11
> [DEBUG]   org.jboss.shrinkwrap:shrinkwrap-impl-base:jar:1.0.0-alpha-11
> [DEBUG]
> org.jboss.shrinkwrap:shrinkwrap-extension-glassfish:jar:1.0.0-alpha-11
> [DEBUG]   org.jboss.shrinkwrap:shrinkwrap-extension-vdf:jar:1.0.0-alpha-11
> [DEBUG]   org.jboss.shrinkwrap:shrinkwrap-extension-vfs3:jar:1.0.0-alpha-11
> [DEBUG]
> org.jboss.shrinkwrap:shrinkwrap-extension-classloader:jar:1.0.0-alpha-11
> [DEBUG]
> org.jboss.shrinkwrap:shrinkwrap-extension-tomcat-6:jar:1.0.0-alpha-11
> [DEBUG]
> org.jboss.shrinkwrap:shrinkwrap-extension-jetty-6:jar:1.0.0-alpha-11
> [DEBUG]
> org.jboss.shrinkwrap:shrinkwrap-extension-jetty-7:jar:1.0.0-alpha-11
> [DEBUG]   javax:javaee-api:jar:6.0
> [DEBUG]   org.osgi:org.osgi.core:jar:4.2.0
> [DEBUG]   org.osgi:org.osgi.compendium:jar:4.2.0
> [DEBUG]   junit:junit:jar:4.8.1
> [DEBUG]   org.testng:testng:jar:5.12.1
> [DEBUG]   org.mortbay.jetty:jetty-embedded:jar:6.1.9
> [DEBUG]   org.mockito:mockito-all:jar:1.8.3
> [DEBUG]     org.jboss.arquillian:arquillian-spi:jar:1.0.0.Alpha4:test
> (selected for test)
> [DEBUG] Adding managed dependencies for unknown:arquillian-api
> [DEBUG]   javax.inject:javax.inject:jar:1
> [DEBUG]   org.jboss.logging:jboss-logging-spi:jar:2.1.0.GA
> [DEBUG]   org.jboss.logging:jboss-logging-log4j:jar:2.1.0.GA
> [DEBUG]   org.jboss.osgi:jboss-osgi-spi:jar:1.0.10
> [DEBUG]   org.jboss.osgi.vfs:jboss-osgi-vfs:jar:1.0.0
> [DEBUG]   org.jboss.osgi.vfs:jboss-osgi-vfs30:jar:1.0.0
> [DEBUG]   org.jboss.shrinkwrap:shrinkwrap-api:jar:1.0.0-alpha-11
> [DEBUG]   org.jboss.shrinkwrap:shrinkwrap-spi:jar:1.0.0-alpha-11
> [DEBUG]   org.jboss.shrinkwrap:shrinkwrap-impl-base:jar:1.0.0-alpha-11
> [DEBUG]
> org.jboss.shrinkwrap:shrinkwrap-extension-glassfish:jar:1.0.0-alpha-11
> [DEBUG]   org.jboss.shrinkwrap:shrinkwrap-extension-vdf:jar:1.0.0-alpha-11
> [DEBUG]   org.jboss.shrinkwrap:shrinkwrap-extension-vfs3:jar:1.0.0-alpha-11
> [DEBUG]
> org.jboss.shrinkwrap:shrinkwrap-extension-classloader:jar:1.0.0-alpha-11
> [DEBUG]
> org.jboss.shrinkwrap:shrinkwrap-extension-tomcat-6:jar:1.0.0-alpha-11
> [DEBUG]
> org.jboss.shrinkwrap:shrinkwrap-extension-jetty-6:jar:1.0.0-alpha-11
> [DEBUG]
> org.jboss.shrinkwrap:shrinkwrap-extension-jetty-7:jar:1.0.0-alpha-11
> [DEBUG]   javax:javaee-api:jar:6.0
> [DEBUG]   org.osgi:org.osgi.core:jar:4.2.0
> [DEBUG]   org.osgi:org.osgi.compendium:jar:4.2.0
> [DEBUG]   junit:junit:jar:4.8.1
> [DEBUG]   org.testng:testng:jar:5.12.1
> [DEBUG]   org.mortbay.jetty:jetty-embedded:jar:6.1.9
> [DEBUG]   org.mockito:mockito-all:jar:1.8.3
> [DEBUG]       org.jboss.arquillian:arquillian-api:jar:1.0.0.Alpha4:test
> (selected for test)
> [DEBUG] Retrieving parent-POM:
> org.jboss.shrinkwrap:shrinkwrap-build:pom:1.0.0-alpha-11 for project:
> null:shrinkwrap-api:jar:null from the repository.
> [DEBUG] Adding managed dependencies for unknown:shrinkwrap-api
> [DEBUG]   junit:junit:jar:4.6:test
> [DEBUG]         org.jboss.shrinkwrap:shrinkwrap-api:jar:1.0.0-alpha-11:test
> (selected for test)
> [DEBUG] Adding managed dependencies for
> unknown:shrinkwrap-extension-glassfish
> [DEBUG]   junit:junit:jar:4.6:test
> [DEBUG]
> org.jboss.shrinkwrap:shrinkwrap-extension-glassfish:jar:1.0.0-alpha-11:test
> (selected for test)
> [DEBUG]       org.jboss.shrinkwrap:shrinkwrap-api:jar:1.0.0-alpha-11:test
> (selected for test)
> [DEBUG] Adding managed dependencies for unknown:shrinkwrap-impl-base
> [DEBUG]   junit:junit:jar:4.6:test
> [DEBUG]
> org.jboss.shrinkwrap:shrinkwrap-impl-base:jar:1.0.0-alpha-11:test (selected
> for test)
> [DEBUG] Adding managed dependencies for unknown:shrinkwrap-spi
> [DEBUG]   junit:junit:jar:4.6:test
> [DEBUG]         org.jboss.shrinkwrap:shrinkwrap-spi:jar:1.0.0-alpha-11:test
> (selected for test)
> [DEBUG] Adding managed dependencies for
> org.jboss.arquillian.protocol:arquillian-protocol-servlet-3
> [DEBUG]   javax.inject:javax.inject:jar:1
> [DEBUG]   org.jboss.logging:jboss-logging-spi:jar:2.1.0.GA
> [DEBUG]   org.jboss.logging:jboss-logging-log4j:jar:2.1.0.GA
> [DEBUG]   org.jboss.osgi:jboss-osgi-spi:jar:1.0.10
> [DEBUG]   org.jboss.osgi.vfs:jboss-osgi-vfs:jar:1.0.0
> [DEBUG]   org.jboss.osgi.vfs:jboss-osgi-vfs30:jar:1.0.0
> [DEBUG]   org.jboss.shrinkwrap:shrinkwrap-api:jar:1.0.0-alpha-11
> [DEBUG]   org.jboss.shrinkwrap:shrinkwrap-spi:jar:1.0.0-alpha-11
> [DEBUG]   org.jboss.shrinkwrap:shrinkwrap-impl-base:jar:1.0.0-alpha-11
> [DEBUG]
> org.jboss.shrinkwrap:shrinkwrap-extension-glassfish:jar:1.0.0-alpha-11
> [DEBUG]   org.jboss.shrinkwrap:shrinkwrap-extension-vdf:jar:1.0.0-alpha-11
> [DEBUG]   org.jboss.shrinkwrap:shrinkwrap-extension-vfs3:jar:1.0.0-alpha-11
> [DEBUG]
> org.jboss.shrinkwrap:shrinkwrap-extension-classloader:jar:1.0.0-alpha-11
> [DEBUG]
> org.jboss.shrinkwrap:shrinkwrap-extension-tomcat-6:jar:1.0.0-alpha-11
> [DEBUG]
> org.jboss.shrinkwrap:shrinkwrap-extension-jetty-6:jar:1.0.0-alpha-11
> [DEBUG]
> org.jboss.shrinkwrap:shrinkwrap-extension-jetty-7:jar:1.0.0-alpha-11
> [DEBUG]   javax:javaee-api:jar:6.0
> [DEBUG]   org.osgi:org.osgi.core:jar:4.2.0
> [DEBUG]   org.osgi:org.osgi.compendium:jar:4.2.0
> [DEBUG]   junit:junit:jar:4.8.1
> [DEBUG]   org.testng:testng:jar:5.12.1
> [DEBUG]   org.mortbay.jetty:jetty-embedded:jar:6.1.9
> [DEBUG]   org.mockito:mockito-all:jar:1.8.3
> [DEBUG]
> org.jboss.arquillian.protocol:arquillian-protocol-servlet-3:jar:1.0.0.Alpha4:test
> (selected for test)
> [DEBUG] Adding managed dependencies for
> org.jboss.arquillian.testenricher:arquillian-testenricher-cdi
> [DEBUG]   javax.inject:javax.inject:jar:1
> [DEBUG]   org.jboss.logging:jboss-logging-spi:jar:2.1.0.GA
> [DEBUG]   org.jboss.logging:jboss-logging-log4j:jar:2.1.0.GA
> [DEBUG]   org.jboss.osgi:jboss-osgi-spi:jar:1.0.10
> [DEBUG]   org.jboss.osgi.vfs:jboss-osgi-vfs:jar:1.0.0
> [DEBUG]   org.jboss.osgi.vfs:jboss-osgi-vfs30:jar:1.0.0
> [DEBUG]   org.jboss.shrinkwrap:shrinkwrap-api:jar:1.0.0-alpha-11
> [DEBUG]   org.jboss.shrinkwrap:shrinkwrap-spi:jar:1.0.0-alpha-11
> [DEBUG]   org.jboss.shrinkwrap:shrinkwrap-impl-base:jar:1.0.0-alpha-11
> [DEBUG]
> org.jboss.shrinkwrap:shrinkwrap-extension-glassfish:jar:1.0.0-alpha-11
> [DEBUG]   org.jboss.shrinkwrap:shrinkwrap-extension-vdf:jar:1.0.0-alpha-11
> [DEBUG]   org.jboss.shrinkwrap:shrinkwrap-extension-vfs3:jar:1.0.0-alpha-11
> [DEBUG]
> org.jboss.shrinkwrap:shrinkwrap-extension-classloader:jar:1.0.0-alpha-11
> [DEBUG]
> org.jboss.shrinkwrap:shrinkwrap-extension-tomcat-6:jar:1.0.0-alpha-11
> [DEBUG]
> org.jboss.shrinkwrap:shrinkwrap-extension-jetty-6:jar:1.0.0-alpha-11
> [DEBUG]
> org.jboss.shrinkwrap:shrinkwrap-extension-jetty-7:jar:1.0.0-alpha-11
> [DEBUG]   javax:javaee-api:jar:6.0
> [DEBUG]   org.osgi:org.osgi.core:jar:4.2.0
> [DEBUG]   org.osgi:org.osgi.compendium:jar:4.2.0
> [DEBUG]   junit:junit:jar:4.8.1
> [DEBUG]   org.testng:testng:jar:5.12.1
> [DEBUG]   org.mortbay.jetty:jetty-embedded:jar:6.1.9
> [DEBUG]   org.mockito:mockito-all:jar:1.8.3
> [DEBUG]
> org.jboss.arquillian.testenricher:arquillian-testenricher-cdi:jar:1.0.0.Alpha4:test
> (selected for test)
> [DEBUG] Adding managed dependencies for
> org.jboss.arquillian.testenricher:arquillian-testenricher-ejb
> [DEBUG]   javax.inject:javax.inject:jar:1
> [DEBUG]   org.jboss.logging:jboss-logging-spi:jar:2.1.0.GA
> [DEBUG]   org.jboss.logging:jboss-logging-log4j:jar:2.1.0.GA
> [DEBUG]   org.jboss.osgi:jboss-osgi-spi:jar:1.0.10
> [DEBUG]   org.jboss.osgi.vfs:jboss-osgi-vfs:jar:1.0.0
> [DEBUG]   org.jboss.osgi.vfs:jboss-osgi-vfs30:jar:1.0.0
> [DEBUG]   org.jboss.shrinkwrap:shrinkwrap-api:jar:1.0.0-alpha-11
> [DEBUG]   org.jboss.shrinkwrap:shrinkwrap-spi:jar:1.0.0-alpha-11
> [DEBUG]   org.jboss.shrinkwrap:shrinkwrap-impl-base:jar:1.0.0-alpha-11
> [DEBUG]
> org.jboss.shrinkwrap:shrinkwrap-extension-glassfish:jar:1.0.0-alpha-11
> [DEBUG]   org.jboss.shrinkwrap:shrinkwrap-extension-vdf:jar:1.0.0-alpha-11
> [DEBUG]   org.jboss.shrinkwrap:shrinkwrap-extension-vfs3:jar:1.0.0-alpha-11
> [DEBUG]
> org.jboss.shrinkwrap:shrinkwrap-extension-classloader:jar:1.0.0-alpha-11
> [DEBUG]
> org.jboss.shrinkwrap:shrinkwrap-extension-tomcat-6:jar:1.0.0-alpha-11
> [DEBUG]
> org.jboss.shrinkwrap:shrinkwrap-extension-jetty-6:jar:1.0.0-alpha-11
> [DEBUG]
> org.jboss.shrinkwrap:shrinkwrap-extension-jetty-7:jar:1.0.0-alpha-11
> [DEBUG]   javax:javaee-api:jar:6.0
> [DEBUG]   org.osgi:org.osgi.core:jar:4.2.0
> [DEBUG]   org.osgi:org.osgi.compendium:jar:4.2.0
> [DEBUG]   junit:junit:jar:4.8.1
> [DEBUG]   org.testng:testng:jar:5.12.1
> [DEBUG]   org.mortbay.jetty:jetty-embedded:jar:6.1.9
> [DEBUG]   org.mockito:mockito-all:jar:1.8.3
> [DEBUG]
> org.jboss.arquillian.testenricher:arquillian-testenricher-ejb:jar:1.0.0.Alpha4:test
> (selected for test)
> [DEBUG] Adding managed dependencies for
> org.jboss.arquillian.testenricher:arquillian-testenricher-resource
> [DEBUG]   javax.inject:javax.inject:jar:1
> [DEBUG]   org.jboss.logging:jboss-logging-spi:jar:2.1.0.GA
> [DEBUG]   org.jboss.logging:jboss-logging-log4j:jar:2.1.0.GA
> [DEBUG]   org.jboss.osgi:jboss-osgi-spi:jar:1.0.10
> [DEBUG]   org.jboss.osgi.vfs:jboss-osgi-vfs:jar:1.0.0
> [DEBUG]   org.jboss.osgi.vfs:jboss-osgi-vfs30:jar:1.0.0
> [DEBUG]   org.jboss.shrinkwrap:shrinkwrap-api:jar:1.0.0-alpha-11
> [DEBUG]   org.jboss.shrinkwrap:shrinkwrap-spi:jar:1.0.0-alpha-11
> [DEBUG]   org.jboss.shrinkwrap:shrinkwrap-impl-base:jar:1.0.0-alpha-11
> [DEBUG]
> org.jboss.shrinkwrap:shrinkwrap-extension-glassfish:jar:1.0.0-alpha-11
> [DEBUG]   org.jboss.shrinkwrap:shrinkwrap-extension-vdf:jar:1.0.0-alpha-11
> [DEBUG]   org.jboss.shrinkwrap:shrinkwrap-extension-vfs3:jar:1.0.0-alpha-11
> [DEBUG]
> org.jboss.shrinkwrap:shrinkwrap-extension-classloader:jar:1.0.0-alpha-11
> [DEBUG]
> org.jboss.shrinkwrap:shrinkwrap-extension-tomcat-6:jar:1.0.0-alpha-11
> [DEBUG]
> org.jboss.shrinkwrap:shrinkwrap-extension-jetty-6:jar:1.0.0-alpha-11
> [DEBUG]
> org.jboss.shrinkwrap:shrinkwrap-extension-jetty-7:jar:1.0.0-alpha-11
> [DEBUG]   javax:javaee-api:jar:6.0
> [DEBUG]   org.osgi:org.osgi.core:jar:4.2.0
> [DEBUG]   org.osgi:org.osgi.compendium:jar:4.2.0
> [DEBUG]   junit:junit:jar:4.8.1
> [DEBUG]   org.testng:testng:jar:5.12.1
> [DEBUG]   org.mortbay.jetty:jetty-embedded:jar:6.1.9
> [DEBUG]   org.mockito:mockito-all:jar:1.8.3
> [DEBUG]
> org.jboss.arquillian.testenricher:arquillian-testenricher-resource:jar:1.0.0.Alpha4:test
> (selected for test)
> [DEBUG]   junit:junit:jar:4.8.1:test (selected for test)
> [DEBUG] Adding managed dependencies for unknown:arquillian-junit
> [DEBUG]   javax.inject:javax.inject:jar:1
> [DEBUG]   org.jboss.logging:jboss-logging-spi:jar:2.1.0.GA
> [DEBUG]   org.jboss.logging:jboss-logging-log4j:jar:2.1.0.GA
> [DEBUG]   org.jboss.osgi:jboss-osgi-spi:jar:1.0.10
> [DEBUG]   org.jboss.osgi.vfs:jboss-osgi-vfs:jar:1.0.0
> [DEBUG]   org.jboss.osgi.vfs:jboss-osgi-vfs30:jar:1.0.0
> [DEBUG]   org.jboss.shrinkwrap:shrinkwrap-api:jar:1.0.0-alpha-11
> [DEBUG]   org.jboss.shrinkwrap:shrinkwrap-spi:jar:1.0.0-alpha-11
> [DEBUG]   org.jboss.shrinkwrap:shrinkwrap-impl-base:jar:1.0.0-alpha-11
> [DEBUG]
> org.jboss.shrinkwrap:shrinkwrap-extension-glassfish:jar:1.0.0-alpha-11
> [DEBUG]   org.jboss.shrinkwrap:shrinkwrap-extension-vdf:jar:1.0.0-alpha-11
> [DEBUG]   org.jboss.shrinkwrap:shrinkwrap-extension-vfs3:jar:1.0.0-alpha-11
> [DEBUG]
> org.jboss.shrinkwrap:shrinkwrap-extension-classloader:jar:1.0.0-alpha-11
> [DEBUG]
> org.jboss.shrinkwrap:shrinkwrap-extension-tomcat-6:jar:1.0.0-alpha-11
> [DEBUG]
> org.jboss.shrinkwrap:shrinkwrap-extension-jetty-6:jar:1.0.0-alpha-11
> [DEBUG]
> org.jboss.shrinkwrap:shrinkwrap-extension-jetty-7:jar:1.0.0-alpha-11
> [DEBUG]   javax:javaee-api:jar:6.0
> [DEBUG]   org.osgi:org.osgi.core:jar:4.2.0
> [DEBUG]   org.osgi:org.osgi.compendium:jar:4.2.0
> [DEBUG]   junit:junit:jar:4.8.1
> [DEBUG]   org.testng:testng:jar:5.12.1
> [DEBUG]   org.mortbay.jetty:jetty-embedded:jar:6.1.9
> [DEBUG]   org.mockito:mockito-all:jar:1.8.3
> [DEBUG]   org.jboss.arquillian:arquillian-junit:jar:1.0.0.Alpha4:test
> (selected for test)
> [DEBUG] Adding managed dependencies for unknown:arquillian-impl-base
> [DEBUG]   javax.inject:javax.inject:jar:1
> [DEBUG]   org.jboss.logging:jboss-logging-spi:jar:2.1.0.GA
> [DEBUG]   org.jboss.logging:jboss-logging-log4j:jar:2.1.0.GA
> [DEBUG]   org.jboss.osgi:jboss-osgi-spi:jar:1.0.10
> [DEBUG]   org.jboss.osgi.vfs:jboss-osgi-vfs:jar:1.0.0
> [DEBUG]   org.jboss.osgi.vfs:jboss-osgi-vfs30:jar:1.0.0
> [DEBUG]   org.jboss.shrinkwrap:shrinkwrap-api:jar:1.0.0-alpha-11
> [DEBUG]   org.jboss.shrinkwrap:shrinkwrap-spi:jar:1.0.0-alpha-11
> [DEBUG]   org.jboss.shrinkwrap:shrinkwrap-impl-base:jar:1.0.0-alpha-11
> [DEBUG]
> org.jboss.shrinkwrap:shrinkwrap-extension-glassfish:jar:1.0.0-alpha-11
> [DEBUG]   org.jboss.shrinkwrap:shrinkwrap-extension-vdf:jar:1.0.0-alpha-11
> [DEBUG]   org.jboss.shrinkwrap:shrinkwrap-extension-vfs3:jar:1.0.0-alpha-11
> [DEBUG]
> org.jboss.shrinkwrap:shrinkwrap-extension-classloader:jar:1.0.0-alpha-11
> [DEBUG]
> org.jboss.shrinkwrap:shrinkwrap-extension-tomcat-6:jar:1.0.0-alpha-11
> [DEBUG]
> org.jboss.shrinkwrap:shrinkwrap-extension-jetty-6:jar:1.0.0-alpha-11
> [DEBUG]
> org.jboss.shrinkwrap:shrinkwrap-extension-jetty-7:jar:1.0.0-alpha-11
> [DEBUG]   javax:javaee-api:jar:6.0
> [DEBUG]   org.osgi:org.osgi.core:jar:4.2.0
> [DEBUG]   org.osgi:org.osgi.compendium:jar:4.2.0
> [DEBUG]   junit:junit:jar:4.8.1
> [DEBUG]   org.testng:testng:jar:5.12.1
> [DEBUG]   org.mortbay.jetty:jetty-embedded:jar:6.1.9
> [DEBUG]   org.mockito:mockito-all:jar:1.8.3
> [DEBUG]     org.jboss.arquillian:arquillian-impl-base:jar:1.0.0.Alpha4:test
> (selected for test)
> [DEBUG]       org.jboss.shrinkwrap:shrinkwrap-spi:jar:1.0.0-alpha-11:test
> (selected for test)
> [DEBUG] Adding managed dependencies for
> org.jboss.arquillian.framework:arquillian-framework-jsfunit
> [DEBUG]   javax.inject:javax.inject:jar:1
> [DEBUG]   org.jboss.logging:jboss-logging-spi:jar:2.1.0.GA
> [DEBUG]   org.jboss.logging:jboss-logging-log4j:jar:2.1.0.GA
> [DEBUG]   org.jboss.osgi:jboss-osgi-spi:jar:1.0.10
> [DEBUG]   org.jboss.osgi.vfs:jboss-osgi-vfs:jar:1.0.0
> [DEBUG]   org.jboss.osgi.vfs:jboss-osgi-vfs30:jar:1.0.0
> [DEBUG]   org.jboss.shrinkwrap:shrinkwrap-api:jar:1.0.0-alpha-11
> [DEBUG]   org.jboss.shrinkwrap:shrinkwrap-spi:jar:1.0.0-alpha-11
> [DEBUG]   org.jboss.shrinkwrap:shrinkwrap-impl-base:jar:1.0.0-alpha-11
> [DEBUG]
> org.jboss.shrinkwrap:shrinkwrap-extension-glassfish:jar:1.0.0-alpha-11
> [DEBUG]   org.jboss.shrinkwrap:shrinkwrap-extension-vdf:jar:1.0.0-alpha-11
> [DEBUG]   org.jboss.shrinkwrap:shrinkwrap-extension-vfs3:jar:1.0.0-alpha-11
> [DEBUG]
> org.jboss.shrinkwrap:shrinkwrap-extension-classloader:jar:1.0.0-alpha-11
> [DEBUG]
> org.jboss.shrinkwrap:shrinkwrap-extension-tomcat-6:jar:1.0.0-alpha-11
> [DEBUG]
> org.jboss.shrinkwrap:shrinkwrap-extension-jetty-6:jar:1.0.0-alpha-11
> [DEBUG]
> org.jboss.shrinkwrap:shrinkwrap-extension-jetty-7:jar:1.0.0-alpha-11
> [DEBUG]   javax:javaee-api:jar:6.0
> [DEBUG]   org.osgi:org.osgi.core:jar:4.2.0
> [DEBUG]   org.osgi:org.osgi.compendium:jar:4.2.0
> [DEBUG]   junit:junit:jar:4.8.1
> [DEBUG]   org.testng:testng:jar:5.12.1
> [DEBUG]   org.mortbay.jetty:jetty-embedded:jar:6.1.9
> [DEBUG]   org.mockito:mockito-all:jar:1.8.3
> [DEBUG]
> org.jboss.arquillian.framework:arquillian-framework-jsfunit:jar:1.0.0.Alpha4:test
> (selected for test)
> [DEBUG]
> org.jboss.shrinkwrap:shrinkwrap-impl-base:jar:1.0.0-alpha-11:test (selected
> for test)
> [DEBUG]     org.jboss.shrinkwrap:shrinkwrap-spi:jar:1.0.0-alpha-11:test
> (selected for test)
> [DEBUG] Retrieving parent-POM:
> org.jboss.jsfunit:jboss-jsfunit:pom:1.3.0.Final for project:
> null:jboss-jsfunit-core:jar:null from the repository.
> [DEBUG] Adding managed dependencies for unknown:jboss-jsfunit-core
> [DEBUG]   org.jboss.jsfunit:jboss-jsfunit-core:jar:1.3.0.Final
> [DEBUG]   junit:junit:jar:3.8.1
> [DEBUG]   net.sourceforge.htmlunit:htmlunit:jar:2.8
> [DEBUG]   net.sourceforge.htmlunit:htmlunit-core-js:jar:2.8
> [DEBUG]   org.apache.james:apache-mime4j:jar:0.6
> [DEBUG]   org.apache.httpcomponents:httpclient:jar:4.0.1
> [DEBUG]   org.apache.httpcomponents:httpmime:jar:4.0.1
> [DEBUG]   commons-io:commons-io:jar:1.4
> [DEBUG]   commons-codec:commons-codec:jar:1.4
> [DEBUG]   rhino:js:jar:1.7R1
> [DEBUG]   net.sourceforge.cssparser:cssparser:jar:0.9.5
> [DEBUG]   net.sourceforge.nekohtml:nekohtml:jar:1.9.14
> [DEBUG]   xalan:xalan:jar:2.7.1
> [DEBUG]   commons-lang:commons-lang:jar:2.4
> [DEBUG]   commons-collections:commons-collections:jar:3.2.1
> [DEBUG]   javax.faces:jsf-api:jar:2.0.1-FCS
> [DEBUG]   javax.faces:jsf-impl:jar:2.0.1-FCS
> [DEBUG]   jboss.web:servlet-api:jar:3.0.0-beta-2
> [DEBUG]   org.apache.myfaces.core:myfaces-impl:jar:1.1.6
> [DEBUG]   org.apache.myfaces.core:myfaces-api:jar:1.1.6
> [DEBUG]   cactus:cactus:jar:13-1.7.1
> [DEBUG]
> org.apache.cactus:cactus.core.framework.uberjar.javaEE.13:jar:1.8.0
> [DEBUG]   javax.el:el-api:jar:1.0:provided
> [DEBUG]   org.ajax4jsf:ajax4jsf:jar:1.1.1
> [DEBUG]   org.richfaces.framework:richfaces-impl:jar:3.3.3.Final
> [DEBUG]   org.richfaces.ui:richfaces-ui:jar:3.3.3.Final
> [DEBUG]   org.jboss.seam:jboss-seam:jar:2.1.2
> [DEBUG]   org.jboss.seam:jboss-seam-ui:jar:2.1.2
> [DEBUG]   apache-log4j:log4j:jar:1.2.14
> [DEBUG]   com.sun.facelets:jsf-facelets:jar:1.1.15.B1
> [DEBUG]   com.sun.faces:jsf-api:jar:2.0.0-Beta2
> [DEBUG]   com.sun.faces:jsf-impl:jar:2.0.0-Beta2
> [DEBUG]     org.jboss.jsfunit:jboss-jsfunit-core:jar:1.3.0.Final:test
> (selected for test)
> [DEBUG] Retrieving parent-POM: org.sonatype.oss:oss-parent:pom:3 for
> project: net.sourceforge.htmlunit:htmlunit:jar:2.8 from the repository.
> [DEBUG]       net.sourceforge.htmlunit:htmlunit:jar:2.8:test (selected for
> test)
> [DEBUG]         xalan:xalan:jar:2.7.1:test (selected for test)
> [DEBUG]           xalan:serializer:jar:2.7.1:test (selected for test)
> [DEBUG]             xml-apis:xml-apis:jar:1.3.04:test (selected for test)
> [DEBUG] Retrieving parent-POM: org.apache.commons:commons-parent:pom:9 for
> project: commons-collections:commons-collections:jar:3.2.1 from the
> repository.
> [DEBUG]         commons-collections:commons-collections:jar:3.2.1:test
> (selected for test)
> [DEBUG]         commons-lang:commons-lang:jar:2.4:test (selected for test)
> [DEBUG] Retrieving parent-POM:
> org.apache.httpcomponents:httpcomponents-client:pom:4.0.1 for project:
> null:httpclient:jar:null from the repository.
> [DEBUG] Retrieving parent-POM: org.apache.httpcomponents:project:pom:4.0
> for project: org.apache.httpcomponents:httpcomponents-client:pom:4.0.1 from
> the repository.
> [DEBUG]         org.apache.httpcomponents:httpclient:jar:4.0.1:test
> (selected for test)
> [DEBUG] Retrieving parent-POM:
> org.apache.httpcomponents:httpcomponents-core:pom:4.0.1 for project:
> null:httpcore:jar:null from the repository.
> [DEBUG]           org.apache.httpcomponents:httpcore:jar:4.0.1:test
> (selected for test)
> [DEBUG] Retrieving parent-POM: org.apache.commons:commons-parent:pom:5 for
> project: commons-logging:commons-logging:jar:1.1.1 from the repository.
> [DEBUG]           commons-logging:commons-logging:jar:1.1.1:test (selected
> for test)
> [DEBUG]           commons-codec:commons-codec:jar:1.3:test (selected for
> test)
> [DEBUG]         org.apache.httpcomponents:httpmime:jar:4.0.1:test (selected
> for test)
> [DEBUG] Retrieving parent-POM: org.apache.james:james-project:pom:1.2 for
> project: org.apache.james:apache-mime4j:jar:0.6 from the repository.
> [DEBUG] Retrieving parent-POM: org.apache.james:james-parent:pom:1.1 for
> project: org.apache.james:james-project:pom:1.2 from the repository.
> [DEBUG]           org.apache.james:apache-mime4j:jar:0.6:test (selected for
> test)
> [DEBUG] Retrieving parent-POM: org.apache.commons:commons-parent:pom:11 for
> project: commons-codec:commons-codec:jar:1.4 from the repository.
> [DEBUG]         commons-codec:commons-codec:jar:1.3:test (removed - nearer
> found: 1.4)
> [DEBUG]         commons-codec:commons-codec:jar:1.4:test (selected for
> test)
> [DEBUG]         net.sourceforge.htmlunit:htmlunit-core-js:jar:2.8:test
> (selected for test)
> [DEBUG]         xerces:xercesImpl:jar:2.9.1:test (selected for test)
> [DEBUG]           xml-apis:xml-apis:jar:1.3.04:test (selected for test)
> [DEBUG]         net.sourceforge.nekohtml:nekohtml:jar:1.9.14:test (selected
> for test)
> [DEBUG]         net.sourceforge.cssparser:cssparser:jar:0.9.5:test
> (selected for test)
> [DEBUG]           org.w3c.css:sac:jar:1.3:test (selected for test)
> [DEBUG] Retrieving parent-POM: org.apache.commons:commons-parent:pom:7 for
> project: commons-io:commons-io:jar:1.4 from the repository.
> [DEBUG]         commons-io:commons-io:jar:1.4:test (selected for test)
> [DEBUG]         commons-logging:commons-logging:jar:1.1.1:test (selected
> for test)
> [DEBUG]       net.sourceforge.htmlunit:htmlunit-core-js:jar:2.8:test
> (selected for test)
> [DEBUG]       org.apache.httpcomponents:httpclient:jar:4.0.1:test (selected
> for test)
> [DEBUG]         org.apache.httpcomponents:httpcore:jar:4.0.1:test (selected
> for test)
> [DEBUG]         commons-codec:commons-codec:jar:1.3:test (removed - nearer
> found: 1.4)
> [DEBUG]       org.apache.httpcomponents:httpmime:jar:4.0.1:test (selected
> for test)
> [DEBUG]         org.apache.james:apache-mime4j:jar:0.6:test (selected for
> test)
> [DEBUG]       org.apache.james:apache-mime4j:jar:0.6:test (selected for
> test)
> [DEBUG]       commons-lang:commons-lang:jar:2.4:test (selected for test)
> [DEBUG]       commons-collections:commons-collections:jar:3.2.1:test
> (selected for test)
> [DEBUG]       commons-io:commons-io:jar:1.4:test (selected for test)
> [DEBUG]       net.sourceforge.cssparser:cssparser:jar:0.9.5:test (selected
> for test)
> [DEBUG]         org.w3c.css:sac:jar:1.3:test (selected for test)
> [DEBUG]       net.sourceforge.nekohtml:nekohtml:jar:1.9.14:test (selected
> for test)
> [DEBUG]       xalan:xalan:jar:2.7.1:test (selected for test)
> [DEBUG]         xalan:serializer:jar:2.7.1:test (selected for test)
> [DEBUG]       cactus:cactus:jar:13-1.7.1:test (selected for test)
> [DEBUG]         cactus:cactus-ant:jar:13-1.7.1:test (selected for test)
> [DEBUG]         commons-httpclient:commons-httpclient:jar:2.0.2:test
> (selected for test)
> [DEBUG]           commons-logging:commons-logging:jar:1.0.3:test (removed -
> nearer found: 1.1.1)
> [DEBUG]         junit:junit:jar:3.8.1:test (removed - nearer found: 4.8.1)
> [DEBUG]         aspectj:aspectjrt:jar:1.2.1:test (selected for test)
> [DEBUG]         commons-logging:commons-logging:jar:1.0.4:test (removed -
> nearer found: 1.1.1)
> [DEBUG]         cargo:cargo:jar:0.5:test (selected for test)
> [DEBUG]           ant:ant:jar:1.5.4:test (selected for test)
> [DEBUG]   org.jboss.jsfunit:jboss-jsfunit-core:jar:1.3.0.Final:test
> (selected for test)
> [DEBUG]     net.sourceforge.htmlunit:htmlunit:jar:2.8:test (selected for
> test)
> [DEBUG]       xalan:xalan:jar:2.7.1:test (selected for test)
> [DEBUG]         xalan:serializer:jar:2.7.1:test (selected for test)
> [DEBUG]           xml-apis:xml-apis:jar:1.3.04:test (selected for test)
> [DEBUG]       commons-collections:commons-collections:jar:3.2.1:test
> (selected for test)
> [DEBUG]       commons-lang:commons-lang:jar:2.4:test (selected for test)
> [DEBUG]       org.apache.httpcomponents:httpclient:jar:4.0.1:test (selected
> for test)
> [DEBUG]         org.apache.httpcomponents:httpcore:jar:4.0.1:test (selected
> for test)
> [DEBUG]         commons-logging:commons-logging:jar:1.1.1:test (selected
> for test)
> [DEBUG]         commons-codec:commons-codec:jar:1.3:test (selected for
> test)
> [DEBUG]       org.apache.httpcomponents:httpmime:jar:4.0.1:test (selected
> for test)
> [DEBUG]         org.apache.james:apache-mime4j:jar:0.6:test (selected for
> test)
> [DEBUG]       commons-codec:commons-codec:jar:1.3:test (removed - nearer
> found: 1.4)
> [DEBUG]       commons-codec:commons-codec:jar:1.4:test (selected for test)
> [DEBUG]       net.sourceforge.htmlunit:htmlunit-core-js:jar:2.8:test
> (selected for test)
> [DEBUG]       xerces:xercesImpl:jar:2.9.1:test (selected for test)
> [DEBUG]         xml-apis:xml-apis:jar:1.3.04:test (selected for test)
> [DEBUG]       net.sourceforge.nekohtml:nekohtml:jar:1.9.14:test (selected
> for test)
> [DEBUG]       net.sourceforge.cssparser:cssparser:jar:0.9.5:test (selected
> for test)
> [DEBUG]         org.w3c.css:sac:jar:1.3:test (selected for test)
> [DEBUG]       commons-io:commons-io:jar:1.4:test (selected for test)
> [DEBUG]       commons-logging:commons-logging:jar:1.1.1:test (selected for
> test)
> [DEBUG]     net.sourceforge.htmlunit:htmlunit-core-js:jar:2.8:test
> (selected for test)
> [DEBUG]     org.apache.httpcomponents:httpclient:jar:4.0.1:test (selected
> for test)
> [DEBUG]       org.apache.httpcomponents:httpcore:jar:4.0.1:test (selected
> for test)
> [DEBUG]       commons-codec:commons-codec:jar:1.3:test (removed - nearer
> found: 1.4)
> [DEBUG]     org.apache.httpcomponents:httpmime:jar:4.0.1:test (selected for
> test)
> [DEBUG]       org.apache.james:apache-mime4j:jar:0.6:test (selected for
> test)
> [DEBUG]     org.apache.james:apache-mime4j:jar:0.6:test (selected for test)
> [DEBUG]     commons-lang:commons-lang:jar:2.4:test (selected for test)
> [DEBUG]     commons-collections:commons-collections:jar:3.2.1:test
> (selected for test)
> [DEBUG]     commons-io:commons-io:jar:1.4:test (selected for test)
> [DEBUG]     net.sourceforge.cssparser:cssparser:jar:0.9.5:test (selected
> for test)
> [DEBUG]       org.w3c.css:sac:jar:1.3:test (selected for test)
> [DEBUG]     net.sourceforge.nekohtml:nekohtml:jar:1.9.14:test (selected for
> test)
> [DEBUG]     xalan:xalan:jar:2.7.1:test (selected for test)
> [DEBUG]       xalan:serializer:jar:2.7.1:test (selected for test)
> [DEBUG]     cactus:cactus:jar:13-1.7.1:test (selected for test)
> [DEBUG]       cactus:cactus-ant:jar:13-1.7.1:test (selected for test)
> [DEBUG]       commons-httpclient:commons-httpclient:jar:2.0.2:test
> (selected for test)
> [DEBUG]         commons-logging:commons-logging:jar:1.0.3:test (removed -
> nearer found: 1.1.1)
> [DEBUG]       junit:junit:jar:3.8.1:test (removed - nearer found: 4.8.1)
> [DEBUG]       aspectj:aspectjrt:jar:1.2.1:test (selected for test)
> [DEBUG]       commons-logging:commons-logging:jar:1.0.4:test (removed -
> nearer found: 1.1.1)
> [DEBUG]       cargo:cargo:jar:0.5:test (selected for test)
> [DEBUG]         ant:ant:jar:1.5.4:test (selected for test)
> [DEBUG] Plugin dependencies for:
>
> org.apache.maven.plugins:maven-compiler-plugin:2.3.2
>
> are:
>
> org.apache.maven:maven-plugin-api:jar:2.0.6:runtime
> org.apache.maven:maven-artifact:jar:2.0.6:runtime
> org.apache.maven:maven-core:jar:2.0.6:runtime
> org.apache.maven:maven-toolchain:jar:1.0:runtime
> org.codehaus.plexus:plexus-utils:jar:2.0.5:runtime
> org.codehaus.plexus:plexus-compiler-api:jar:1.8.1:runtime
> org.codehaus.plexus:plexus-compiler-manager:jar:1.8.1:runtime
> org.codehaus.plexus:plexus-compiler-javac:jar:1.8.1:runtime
>
>
> [DEBUG]
> org.apache.maven.plugins:maven-compiler-plugin:maven-plugin:2.3.2:runtime
> (selected for runtime)
> [DEBUG]   org.apache.maven:maven-plugin-api:jar:2.0.6:runtime (selected for
> runtime)
> [DEBUG]   org.apache.maven:maven-artifact:jar:2.0.6:runtime (selected for
> runtime)
> [DEBUG]     org.codehaus.plexus:plexus-utils:jar:1.4.1:runtime (selected
> for runtime)
> [DEBUG]   org.apache.maven:maven-core:jar:2.0.6:runtime (selected for
> runtime)
> [DEBUG]     org.apache.maven:maven-settings:jar:2.0.6:runtime (selected for
> runtime)
> [DEBUG]       org.apache.maven:maven-model:jar:2.0.6:runtime (selected for
> runtime)
> [DEBUG]
> org.apache.maven:maven-plugin-parameter-documenter:jar:2.0.6:runtime
> (selected for runtime)
> [DEBUG]     org.apache.maven:maven-profile:jar:2.0.6:runtime (selected for
> runtime)
> [DEBUG]     org.apache.maven:maven-model:jar:2.0.6:runtime (selected for
> runtime)
> [DEBUG]
> org.apache.maven.wagon:wagon-provider-api:jar:1.0-beta-2:runtime (selected
> for runtime)
> [DEBUG]       org.codehaus.plexus:plexus-utils:jar:1.0.4:runtime (removed -
> nearer found: 1.4.1)
> [DEBUG]     org.apache.maven:maven-repository-metadata:jar:2.0.6:runtime
> (selected for runtime)
> [DEBUG]     org.apache.maven:maven-error-diagnostics:jar:2.0.6:runtime
> (selected for runtime)
> [DEBUG]     org.apache.maven:maven-project:jar:2.0.6:runtime (selected for
> runtime)
> [DEBUG]       org.apache.maven:maven-artifact-manager:jar:2.0.6:runtime
> (selected for runtime)
> [DEBUG]       org.apache.maven:maven-plugin-registry:jar:2.0.6:runtime
> (selected for runtime)
> [DEBUG]     org.apache.maven:maven-plugin-descriptor:jar:2.0.6:runtime
> (selected for runtime)
> [DEBUG]     org.apache.maven:maven-artifact-manager:jar:2.0.6:runtime
> (selected for runtime)
> [DEBUG]     org.apache.maven:maven-monitor:jar:2.0.6:runtime (selected for
> runtime)
> [DEBUG] Adding managed dependencies for unknown:maven-toolchain
> [DEBUG]   org.apache.maven:maven-model:jar:2.0.6
> [DEBUG]   org.apache.maven:maven-project:jar:2.0.6
> [DEBUG]   org.apache.maven.reporting:maven-reporting-api:jar:2.0.6
> [DEBUG]   org.apache.maven:maven-repository-metadata:jar:2.0.6
> [DEBUG]   org.apache.maven:maven-artifact:jar:2.0.6
> [DEBUG]   org.apache.maven:maven-artifact-manager:jar:2.0.6
> [DEBUG]   org.apache.maven:maven-artifact-test:jar:2.0.6
> [DEBUG]   org.apache.maven:maven-settings:jar:2.0.6
> [DEBUG]   org.apache.maven:maven-plugin-parameter-documenter:jar:2.0.6
> [DEBUG]   org.apache.maven:maven-profile:jar:2.0.6
> [DEBUG]   org.apache.maven:maven-plugin-registry:jar:2.0.6
> [DEBUG]   org.apache.maven:maven-plugin-api:jar:2.0.6
> [DEBUG]   org.apache.maven:maven-monitor:jar:2.0.6
> [DEBUG]
> org.codehaus.plexus:plexus-container-default:jar:1.0-alpha-9-stable-1
> [DEBUG]   org.codehaus.plexus:plexus-utils:jar:1.4.1
> [DEBUG]   org.apache.maven.wagon:wagon-provider-api:jar:1.0-beta-2
> [DEBUG]   org.apache.maven.wagon:wagon-ssh:jar:1.0-beta-2
> [DEBUG]   org.apache.maven.wagon:wagon-ssh-external:jar:1.0-beta-2
> [DEBUG]   org.apache.maven.wagon:wagon-file:jar:1.0-beta-2
> [DEBUG]   org.apache.maven.wagon:wagon-http-lightweight:jar:1.0-beta-2
> [DEBUG]   easymock:easymock:jar:1.2_Java1.3:test
> [DEBUG]   classworlds:classworlds:jar:1.1
> [DEBUG]   org.apache.maven:maven-toolchain:jar:1.0:runtime (selected for
> runtime)
> [DEBUG] Retrieving parent-POM: org.codehaus.plexus:plexus:pom:2.0.6 for
> project: null:plexus-utils:jar:2.0.5 from the repository.
> [DEBUG]   org.codehaus.plexus:plexus-utils:jar:1.4.1:runtime (removed -
> nearer found: 2.0.5)
> [DEBUG]   org.codehaus.plexus:plexus-utils:jar:2.0.5:runtime (selected for
> runtime)
> [DEBUG] Retrieving parent-POM:
> org.codehaus.plexus:plexus-compiler:pom:1.8.1 for project:
> null:plexus-compiler-api:jar:null from the repository.
> [DEBUG] Retrieving parent-POM:
> org.codehaus.plexus:plexus-components:pom:1.1.18 for project:
> null:plexus-compiler:pom:1.8.1 from the repository.
> [DEBUG] Retrieving parent-POM: org.codehaus.plexus:plexus:pom:2.0.7 for
> project: org.codehaus.plexus:plexus-components:pom:1.1.18 from the
> repository.
> [DEBUG] Adding managed dependencies for unknown:plexus-compiler-api
> [DEBUG]   org.codehaus.plexus:plexus-compiler-api:jar:1.8.1
> [DEBUG]   org.codehaus.plexus:plexus-compiler-test:jar:1.8.1
> [DEBUG]
> org.codehaus.plexus:plexus-container-default:jar:1.0-alpha-9-stable-1
> [DEBUG]   org.codehaus.plexus:plexus-utils:jar:1.5.5
> [DEBUG]   junit:junit:jar:3.8.2:test
> [DEBUG]   org.codehaus.plexus:plexus-compiler-api:jar:1.8.1:runtime
> (selected for runtime)
> [DEBUG]     org.codehaus.plexus:plexus-utils:jar:1.5.5:runtime (removed -
> nearer found: 2.0.5)
> [DEBUG] Adding managed dependencies for unknown:plexus-compiler-manager
> [DEBUG]   org.codehaus.plexus:plexus-compiler-api:jar:1.8.1
> [DEBUG]   org.codehaus.plexus:plexus-compiler-test:jar:1.8.1
> [DEBUG]
> org.codehaus.plexus:plexus-container-default:jar:1.0-alpha-9-stable-1
> [DEBUG]   org.codehaus.plexus:plexus-utils:jar:1.5.5
> [DEBUG]   junit:junit:jar:3.8.2:test
> [DEBUG]   org.codehaus.plexus:plexus-compiler-manager:jar:1.8.1:runtime
> (selected for runtime)
> [DEBUG] Retrieving parent-POM:
> org.codehaus.plexus:plexus-compilers:pom:1.8.1 for project:
> null:plexus-compiler-javac:jar:null from the repository.
> [DEBUG] Adding managed dependencies for unknown:plexus-compiler-javac
> [DEBUG]   org.codehaus.plexus:plexus-compiler-api:jar:1.8.1
> [DEBUG]   org.codehaus.plexus:plexus-compiler-test:jar:1.8.1
> [DEBUG]
> org.codehaus.plexus:plexus-container-default:jar:1.0-alpha-9-stable-1
> [DEBUG]   org.codehaus.plexus:plexus-utils:jar:1.5.5
> [DEBUG]   junit:junit:jar:3.8.2:test
> [DEBUG]   org.codehaus.plexus:plexus-compiler-javac:jar:1.8.1:runtime
> (selected for runtime)
> [DEBUG]     org.codehaus.plexus:plexus-utils:jar:1.5.5:runtime (removed -
> nearer found: 2.0.5)
> [DEBUG]  The following artifacts were filtered out for plugin:
> org.apache.maven.plugins:maven-compiler-plugin:2.3.2 because they're already
> in the core of Maven:
>
> org.apache.maven:maven-plugin-api:jar:2.0.6:runtime
> org.apache.maven:maven-artifact:jar:2.0.6:runtime
> org.apache.maven:maven-core:jar:2.0.6:runtime
> org.apache.maven:maven-toolchain:jar:1.0:runtime
>
> These will use the artifact files already in the core ClassRealm instead,
> to allow them to be included in PluginDescriptor.getArtifacts().
>
>
> [DEBUG] Configuring mojo
> 'org.apache.maven.plugins:maven-compiler-plugin:2.3.2:compile' -->
> [DEBUG]   (f) basedir = /home/mwinter/workspace/arquillian-example
> [DEBUG]   (f) buildDirectory =
> /home/mwinter/workspace/arquillian-example/target
> [DEBUG]   (f) classpathElements =
> [/home/mwinter/workspace/arquillian-example/target/classes,
> /home/mwinter/.m2/repository/org/glassfish/extras/glassfish-embedded-all/3.0.1/glassfish-embedded-all-3.0.1.jar]
> [DEBUG]   (f) compileSourceRoots =
> [/home/mwinter/workspace/arquillian-example/src/main/java]
> [DEBUG]   (f) compilerId = javac
> [DEBUG]   (f) debug = true
> [DEBUG]   (f) failOnError = true
> [DEBUG]   (f) fork = false
> [DEBUG]   (f) generatedSourcesDirectory =
> /home/mwinter/workspace/arquillian-example/target/generated-sources/annotations
> [DEBUG]   (f) optimize = false
> [DEBUG]   (f) outputDirectory =
> /home/mwinter/workspace/arquillian-example/target/classes
> [DEBUG]   (f) outputFileName = arquillian-example-1.0-SNAPSHOT
> [DEBUG]   (f) projectArtifact =
> org.jboss.jsfunit:arquillian-example:war:1.0-SNAPSHOT
> [DEBUG]   (f) session = org.apache.maven.execution.MavenSession@1c54796
> [DEBUG]   (f) showDeprecation = false
> [DEBUG]   (f) showWarnings = false
> [DEBUG]   (f) source = 1.6
> [DEBUG]   (f) staleMillis = 0
> [DEBUG]   (f) target = 1.6
> [DEBUG]   (f) verbose = false
> [DEBUG] -- end configuration --
> [INFO] [compiler:compile {execution: default-compile}]
> [DEBUG] Using compiler 'javac'.
> [DEBUG] Source directories:
> [/home/mwinter/workspace/arquillian-example/src/main/java]
> [DEBUG] Classpath:
> [/home/mwinter/workspace/arquillian-example/target/classes
>
>  /home/mwinter/.m2/repository/org/glassfish/extras/glassfish-embedded-all/3.0.1/glassfish-embedded-all-3.0.1.jar]
> [DEBUG] Output directory:
> /home/mwinter/workspace/arquillian-example/target/classes
> [INFO] Nothing to compile - all classes are up to date
> [DEBUG] Configuring mojo
> 'org.apache.maven.plugins:maven-resources-plugin:2.3:testResources' -->
> [DEBUG]   (f) filters = []
> [DEBUG]   (s) includeEmptyDirs = false
> [DEBUG]   (s) outputDirectory =
> /home/mwinter/workspace/arquillian-example/target/test-classes
> [DEBUG]   (s) overwrite = false
> [DEBUG]   (f) project = MavenProject:
> org.jboss.jsfunit:arquillian-example:1.0-SNAPSHOT @
> /home/mwinter/workspace/arquillian-example/pom.xml
> [DEBUG]   (s) resources = [Resource {targetPath: null, filtering: false,
> FileSet {directory:
> /home/mwinter/workspace/arquillian-example/src/test/resources, PatternSet
> [includes: {}, excludes: {}]}}]
> [DEBUG]   (f) session = org.apache.maven.execution.MavenSession@1c54796
> [DEBUG] -- end configuration --
> [INFO] [resources:testResources {execution: default-testResources}]
> [DEBUG] properties used {java.vendor=Sun Microsystems Inc.,
> env.SESSION_MANAGER=local/mwinter:@/tmp/.ICE-unix/1434,unix/mwinter:/tmp/.ICE-unix/1434,
> env.LESSOPEN=| /usr/bin/lesspipe %s, sun.java.launcher=SUN_STANDARD,
> sun.management.compiler=HotSpot Tiered Compilers, os.name=Linux,
> sun.boot.class.path=/usr/lib/jvm/java-6-sun-1.6.0.22/jre/lib/resources.jar:/usr/lib/jvm/java-6-sun-1.6.0.22/jre/lib/rt.jar:/usr/lib/jvm/java-6-sun-1.6.0.22/jre/lib/sunrsasign.jar:/usr/lib/jvm/java-6-sun-1.6.0.22/jre/lib/jsse.jar:/usr/lib/jvm/java-6-sun-1.6.0.22/jre/lib/jce.jar:/usr/lib/jvm/java-6-sun-1.6.0.22/jre/lib/charsets.jar:/usr/lib/jvm/java-6-sun-1.6.0.22/jre/classes,
> env.PWD=/home/mwinter/workspace/arquillian-example,
> env.XDG_SESSION_COOKIE=58ba4814ca4f1dd55fd48bc54bf0147d-1288664918.939876-1207876750,
> jsfunit.version=1.3.0.Final, sun.desktop=gnome, env.LANG=de_DE.utf8,
> java.vm.specification.vendor=Sun Microsystems Inc.,
> java.runtime.version=1.6.0_22-b04,
> env.DEFAULTS_PATH=/usr/share/gconf/gnome.default.path, env.DISPLAY=:0.0,
> user.name=mwinter, env._=/usr/bin/mvn, env.USER=mwinter,
> env.SHELL=/bin/bash, env.DESKTOP_SESSION=gnome,
> env.XDG_DATA_DIRS=/usr/share/gnome:/usr/local/share/:/usr/share/,
> env.NLSPATH=/usr/dt/lib/nls/msg/%L/%N.cat,
> env.PATH=/usr/local/sbin:/usr/local/bin:/usr/sbin:/usr/bin:/sbin:/bin:/usr/games,
> user.language=de,
> sun.boot.library.path=/usr/lib/jvm/java-6-sun-1.6.0.22/jre/lib/i386,
> classworlds.conf=/usr/share/maven2/bin/m2.conf, java.version=1.6.0_22,
> user.timezone=Europe/Berlin,
> env.DBUS_SESSION_BUS_ADDRESS=unix:abstract=/tmp/dbus-DXidbLqKlk,guid=36f19188c428e2754abb21e14ccf7757,
> sun.arch.data.model=32, env.SSH_AGENT_PID=1468,
> java.endorsed.dirs=/usr/lib/jvm/java-6-sun-1.6.0.22/jre/lib/endorsed,
> sun.cpu.isalist=, sun.jnu.encoding=UTF-8, file.encoding.pkg=sun.io,
> env.SHLVL=1, file.separator=/, java.specification.name=Java Platform API
> Specification, env.GNOME_DESKTOP_SESSION_ID=this-is-deprecated,
> java.class.version=50.0, env.GDMSESSION=gnome, env.GDM_KEYBOARD_LAYOUT=de
>  nodeadkeys, user.country=DE, env.GNOME_KEYRING_PID=1416,
> java.home=/usr/lib/jvm/java-6-sun-1.6.0.22/jre, java.vm.info=mixed mode,
> env.LOGNAME=mwinter, os.version=2.6.32-25-generic, path.separator=:,
> java.vm.version=17.1-b03, java.awt.printerjob=sun.print.PSPrinterJob,
> env.TERM=xterm, sun.io.unicode.encoding=UnicodeLittle,
> env.GDM_LANG=de_DE.utf8, user.home=/home/mwinter,
> version.jboss_60=6.0.0.20100721-M4, env.OLDPWD=/home/mwinter,
> java.specification.vendor=Sun Microsystems Inc., env.WINDOWID=83886083,
> java.library.path=/usr/lib/jvm/java-6-sun-1.6.0.22/jre/lib/i386/server:/usr/lib/jvm/java-6-sun-1.6.0.22/jre/lib/i386:/usr/lib/jvm/java-6-sun-1.6.0.22/jre/../lib/i386:/usr/java/packages/lib/i386:/lib:/usr/lib,
> java.vendor.url=http://java.sun.com/, java.vm.vendor=Sun Microsystems
> Inc., maven.home=/usr/share/maven2, java.runtime.name=Java(TM) SE Runtime
> Environment, java.class.path=/usr/share/maven2/boot/classworlds.jar,
> env.XFILESEARCHPATH=/usr/dt/app-defaults/%L/Dt, java.vm.specification.name=Java
> Virtual Machine Specification, java.vm.specification.version=1.0,
> sun.os.patch.level=unknown, sun.cpu.endian=little, env.HOME=/home/mwinter,
> env.LD_LIBRARY_PATH=/usr/lib/jvm/java-6-sun-1.6.0.22/jre/lib/i386/server:/usr/lib/jvm/java-6-sun-1.6.0.22/jre/lib/i386:/usr/lib/jvm/java-6-sun-1.6.0.22/jre/../lib/i386,
> java.io.tmpdir=/tmp,
> env.LS_COLORS=rs=0:di=01;34:ln=01;36:hl=44;37:pi=40;33:so=01;35:do=01;35:bd=40;33;01:cd=40;33;01:or=40;31;01:su=37;41:sg=30;43:ca=30;41:tw=30;42:ow=34;42:st=37;44:ex=01;32:*.tar=01;31:*.tgz=01;31:*.arj=01;31:*.taz=01;31:*.lzh=01;31:*.lzma=01;31:*.zip=01;31:*.z=01;31:*.Z=01;31:*.dz=01;31:*.gz=01;31:*.bz2=01;31:*.bz=01;31:*.tbz2=01;31:*.tz=01;31:*.deb=01;31:*.rpm=01;31:*.jar=01;31:*.rar=01;31:*.ace=01;31:*.zoo=01;31:*.cpio=01;31:*.7z=01;31:*.rz=01;31:*.jpg=01;35:*.jpeg=01;35:*.gif=01;35:*.bmp=01;35:*.pbm=01;35:*.pgm=01;35:*.ppm=01;35:*.tga=01;35:*.xbm=01;35:*.xpm=01;35:*.tif=01;35:*.tiff=01;35:*.png=01;35:*.svg=01;35:*.svgz=01;35:*.mng=01;35:*.pcx=01;35:*.mov=01;35:*.mpg=01;35:*.mpeg=01;35:*.m2v=01;35:*.mkv=01;35:*.ogm=01;35:*.mp4=01;35:*.m4v=01;35:*.mp4v=01;35:*.vob=01;35:*.qt=01;35:*.nuv=01;35:*.wmv=01;35:*.asf=01;35:*.rm=01;35:*.rmvb=01;35:*.flc=01;35:*.avi=01;35:*.fli=01;35:*.flv=01;35:*.gl=01;35:*.dl=01;35:*.xcf=01;35:*.xwd=01;35:*.yuv=01;35:*.axv=01;35:*.anx=01;35:*.ogv=01;35:*.ogx=01;35:*.aac=00;36:*.au=00;36:*.flac=00;36:*.mid=00;36:*.midi=00;36:*.mka=00;36:*.mp3=00;36:*.mpc=00;36:*.ogg=00;36:*.ra=00;36:*.wav=00;36:*.axa=00;36:*.oga=00;36:*.spx=00;36:*.xspf=00;36:,
> java.vendor.url.bug=http://java.sun.com/cgi-bin/bugreport.cgi,
> env.SSH_AUTH_SOCK=/tmp/keyring-IZ9Mr8/ssh,
> java.awt.graphicsenv=sun.awt.X11GraphicsEnvironment, os.arch=i386,
> java.ext.dirs=/usr/lib/jvm/java-6-sun-1.6.0.22/jre/lib/ext:/usr/java/packages/lib/ext,
> user.dir=/home/mwinter/workspace/arquillian-example,
> env.XAUTHORITY=/var/run/gdm/auth-for-mwinter-PqDLd6/database,
> env.MANDATORY_PATH=/usr/share/gconf/gnome.mandatory.path,
> env.SPEECHD_PORT=7560, env.GTK_MODULES=canberra-gtk-module, line.separator=
> , java.vm.name=Java HotSpot(TM) Server VM, env.COLORTERM=gnome-terminal,
> env.ORBIT_SOCKETDIR=/tmp/orbit-mwinter, env.USERNAME=mwinter,
> file.encoding=UTF-8, java.specification.version=1.6,
> arquillian.version=1.0.0.Alpha4,
> env.GNOME_KEYRING_CONTROL=/tmp/keyring-IZ9Mr8,
> env.XDG_CONFIG_DIRS=/etc/xdg/xdg-gnome:/etc/xdg,
> env.LESSCLOSE=/usr/bin/lesspipe %s %s}
> [WARNING] Using platform encoding (UTF-8 actually) to copy filtered
> resources, i.e. build is platform dependent!
> [DEBUG] resource with targetPath null
> directory /home/mwinter/workspace/arquillian-example/src/test/resources
> excludes []
> includes []
> [INFO] Copying 1 resource
> [DEBUG] file arquillian.xml has a filtered file extension
> [DEBUG] copy
> /home/mwinter/workspace/arquillian-example/src/test/resources/arquillian.xml
> to
> /home/mwinter/workspace/arquillian-example/target/test-classes/arquillian.xml
> [DEBUG] org.jboss.jsfunit:arquillian-example:war:1.0-SNAPSHOT (selected for
> null)
> [DEBUG]   org.glassfish.extras:glassfish-embedded-all:jar:3.0.1:provided
> (selected for provided)
> [DEBUG]
> org.jboss.arquillian.container:arquillian-glassfish-embedded-3:jar:1.0.0.Alpha4:test
> (selected for test)
> [DEBUG]     org.jboss.arquillian:arquillian-spi:jar:1.0.0.Alpha4:test
> (selected for test)
> [DEBUG]       org.jboss.arquillian:arquillian-api:jar:1.0.0.Alpha4:test
> (selected for test)
> [DEBUG]         org.jboss.shrinkwrap:shrinkwrap-api:jar:1.0.0-alpha-11:test
> (selected for test)
> [DEBUG]
> org.jboss.shrinkwrap:shrinkwrap-extension-glassfish:jar:1.0.0-alpha-11:test
> (selected for test)
> [DEBUG]       org.jboss.shrinkwrap:shrinkwrap-api:jar:1.0.0-alpha-11:test
> (selected for test)
> [DEBUG]
> org.jboss.shrinkwrap:shrinkwrap-impl-base:jar:1.0.0-alpha-11:test (selected
> for test)
> [DEBUG]         org.jboss.shrinkwrap:shrinkwrap-spi:jar:1.0.0-alpha-11:test
> (selected for test)
> [DEBUG]
> org.jboss.arquillian.protocol:arquillian-protocol-servlet-3:jar:1.0.0.Alpha4:test
> (selected for test)
> [DEBUG]
> org.jboss.arquillian.testenricher:arquillian-testenricher-cdi:jar:1.0.0.Alpha4:test
> (selected for test)
> [DEBUG]
> org.jboss.arquillian.testenricher:arquillian-testenricher-ejb:jar:1.0.0.Alpha4:test
> (selected for test)
> [DEBUG]
> org.jboss.arquillian.testenricher:arquillian-testenricher-resource:jar:1.0.0.Alpha4:test
> (selected for test)
> [DEBUG]   junit:junit:jar:4.8.1:test (selected for test)
> [DEBUG]   org.jboss.arquillian:arquillian-junit:jar:1.0.0.Alpha4:test
> (selected for test)
> [DEBUG]     org.jboss.arquillian:arquillian-impl-base:jar:1.0.0.Alpha4:test
> (selected for test)
> [DEBUG]       org.jboss.shrinkwrap:shrinkwrap-spi:jar:1.0.0-alpha-11:test
> (selected for test)
> [DEBUG]
> org.jboss.arquillian.framework:arquillian-framework-jsfunit:jar:1.0.0.Alpha4:test
> (selected for test)
> [DEBUG]
> org.jboss.shrinkwrap:shrinkwrap-impl-base:jar:1.0.0-alpha-11:test (selected
> for test)
> [DEBUG]     org.jboss.shrinkwrap:shrinkwrap-spi:jar:1.0.0-alpha-11:test
> (selected for test)
> [DEBUG]     org.jboss.jsfunit:jboss-jsfunit-core:jar:1.3.0.Final:test
> (selected for test)
> [DEBUG]       net.sourceforge.htmlunit:htmlunit:jar:2.8:test (selected for
> test)
> [DEBUG]         xalan:xalan:jar:2.7.1:test (selected for test)
> [DEBUG]           xalan:serializer:jar:2.7.1:test (selected for test)
> [DEBUG]             xml-apis:xml-apis:jar:1.3.04:test (selected for test)
> [DEBUG]         commons-collections:commons-collections:jar:3.2.1:test
> (selected for test)
> [DEBUG]         commons-lang:commons-lang:jar:2.4:test (selected for test)
> [DEBUG]         org.apache.httpcomponents:httpclient:jar:4.0.1:test
> (selected for test)
> [DEBUG]           org.apache.httpcomponents:httpcore:jar:4.0.1:test
> (selected for test)
> [DEBUG]           commons-logging:commons-logging:jar:1.1.1:test (selected
> for test)
> [DEBUG]           commons-codec:commons-codec:jar:1.3:test (selected for
> test)
> [DEBUG]         org.apache.httpcomponents:httpmime:jar:4.0.1:test (selected
> for test)
> [DEBUG]           org.apache.james:apache-mime4j:jar:0.6:test (selected for
> test)
> [DEBUG]         commons-codec:commons-codec:jar:1.3:test (removed - nearer
> found: 1.4)
> [DEBUG]         commons-codec:commons-codec:jar:1.4:test (selected for
> test)
> [DEBUG]         net.sourceforge.htmlunit:htmlunit-core-js:jar:2.8:test
> (selected for test)
> [DEBUG]         xerces:xercesImpl:jar:2.9.1:test (selected for test)
> [DEBUG]           xml-apis:xml-apis:jar:1.3.04:test (selected for test)
> [DEBUG]         net.sourceforge.nekohtml:nekohtml:jar:1.9.14:test (selected
> for test)
> [DEBUG]         net.sourceforge.cssparser:cssparser:jar:0.9.5:test
> (selected for test)
> [DEBUG]           org.w3c.css:sac:jar:1.3:test (selected for test)
> [DEBUG]         commons-io:commons-io:jar:1.4:test (selected for test)
> [DEBUG]         commons-logging:commons-logging:jar:1.1.1:test (selected
> for test)
> [DEBUG]       net.sourceforge.htmlunit:htmlunit-core-js:jar:2.8:test
> (selected for test)
> [DEBUG]       org.apache.httpcomponents:httpclient:jar:4.0.1:test (selected
> for test)
> [DEBUG]         org.apache.httpcomponents:httpcore:jar:4.0.1:test (selected
> for test)
> [DEBUG]         commons-codec:commons-codec:jar:1.3:test (removed - nearer
> found: 1.4)
> [DEBUG]       org.apache.httpcomponents:httpmime:jar:4.0.1:test (selected
> for test)
> [DEBUG]         org.apache.james:apache-mime4j:jar:0.6:test (selected for
> test)
> [DEBUG]       org.apache.james:apache-mime4j:jar:0.6:test (selected for
> test)
> [DEBUG]       commons-lang:commons-lang:jar:2.4:test (selected for test)
> [DEBUG]       commons-collections:commons-collections:jar:3.2.1:test
> (selected for test)
> [DEBUG]       commons-io:commons-io:jar:1.4:test (selected for test)
> [DEBUG]       net.sourceforge.cssparser:cssparser:jar:0.9.5:test (selected
> for test)
> [DEBUG]         org.w3c.css:sac:jar:1.3:test (selected for test)
> [DEBUG]       net.sourceforge.nekohtml:nekohtml:jar:1.9.14:test (selected
> for test)
> [DEBUG]       xalan:xalan:jar:2.7.1:test (selected for test)
> [DEBUG]         xalan:serializer:jar:2.7.1:test (selected for test)
> [DEBUG]       cactus:cactus:jar:13-1.7.1:test (selected for test)
> [DEBUG]         cactus:cactus-ant:jar:13-1.7.1:test (selected for test)
> [DEBUG]         commons-httpclient:commons-httpclient:jar:2.0.2:test
> (selected for test)
> [DEBUG]           commons-logging:commons-logging:jar:1.0.3:test (removed -
> nearer found: 1.1.1)
> [DEBUG]         junit:junit:jar:3.8.1:test (removed - nearer found: 4.8.1)
> [DEBUG]         aspectj:aspectjrt:jar:1.2.1:test (selected for test)
> [DEBUG]         commons-logging:commons-logging:jar:1.0.4:test (removed -
> nearer found: 1.1.1)
> [DEBUG]         cargo:cargo:jar:0.5:test (selected for test)
> [DEBUG]           ant:ant:jar:1.5.4:test (selected for test)
> [DEBUG]   org.jboss.jsfunit:jboss-jsfunit-core:jar:1.3.0.Final:test
> (selected for test)
> [DEBUG]     net.sourceforge.htmlunit:htmlunit:jar:2.8:test (selected for
> test)
> [DEBUG]       xalan:xalan:jar:2.7.1:test (selected for test)
> [DEBUG]         xalan:serializer:jar:2.7.1:test (selected for test)
> [DEBUG]           xml-apis:xml-apis:jar:1.3.04:test (selected for test)
> [DEBUG]       commons-collections:commons-collections:jar:3.2.1:test
> (selected for test)
> [DEBUG]       commons-lang:commons-lang:jar:2.4:test (selected for test)
> [DEBUG]       org.apache.httpcomponents:httpclient:jar:4.0.1:test (selected
> for test)
> [DEBUG]         org.apache.httpcomponents:httpcore:jar:4.0.1:test (selected
> for test)
> [DEBUG]         commons-logging:commons-logging:jar:1.1.1:test (selected
> for test)
> [DEBUG]         commons-codec:commons-codec:jar:1.3:test (selected for
> test)
> [DEBUG]       org.apache.httpcomponents:httpmime:jar:4.0.1:test (selected
> for test)
> [DEBUG]         org.apache.james:apache-mime4j:jar:0.6:test (selected for
> test)
> [DEBUG]       commons-codec:commons-codec:jar:1.3:test (removed - nearer
> found: 1.4)
> [DEBUG]       commons-codec:commons-codec:jar:1.4:test (selected for test)
> [DEBUG]       net.sourceforge.htmlunit:htmlunit-core-js:jar:2.8:test
> (selected for test)
> [DEBUG]       xerces:xercesImpl:jar:2.9.1:test (selected for test)
> [DEBUG]         xml-apis:xml-apis:jar:1.3.04:test (selected for test)
> [DEBUG]       net.sourceforge.nekohtml:nekohtml:jar:1.9.14:test (selected
> for test)
> [DEBUG]       net.sourceforge.cssparser:cssparser:jar:0.9.5:test (selected
> for test)
> [DEBUG]         org.w3c.css:sac:jar:1.3:test (selected for test)
> [DEBUG]       commons-io:commons-io:jar:1.4:test (selected for test)
> [DEBUG]       commons-logging:commons-logging:jar:1.1.1:test (selected for
> test)
> [DEBUG]     net.sourceforge.htmlunit:htmlunit-core-js:jar:2.8:test
> (selected for test)
> [DEBUG]     org.apache.httpcomponents:httpclient:jar:4.0.1:test (selected
> for test)
> [DEBUG]       org.apache.httpcomponents:httpcore:jar:4.0.1:test (selected
> for test)
> [DEBUG]       commons-codec:commons-codec:jar:1.3:test (removed - nearer
> found: 1.4)
> [DEBUG]     org.apache.httpcomponents:httpmime:jar:4.0.1:test (selected for
> test)
> [DEBUG]       org.apache.james:apache-mime4j:jar:0.6:test (selected for
> test)
> [DEBUG]     org.apache.james:apache-mime4j:jar:0.6:test (selected for test)
> [DEBUG]     commons-lang:commons-lang:jar:2.4:test (selected for test)
> [DEBUG]     commons-collections:commons-collections:jar:3.2.1:test
> (selected for test)
> [DEBUG]     commons-io:commons-io:jar:1.4:test (selected for test)
> [DEBUG]     net.sourceforge.cssparser:cssparser:jar:0.9.5:test (selected
> for test)
> [DEBUG]       org.w3c.css:sac:jar:1.3:test (selected for test)
> [DEBUG]     net.sourceforge.nekohtml:nekohtml:jar:1.9.14:test (selected for
> test)
> [DEBUG]     xalan:xalan:jar:2.7.1:test (selected for test)
> [DEBUG]       xalan:serializer:jar:2.7.1:test (selected for test)
> [DEBUG]     cactus:cactus:jar:13-1.7.1:test (selected for test)
> [DEBUG]       cactus:cactus-ant:jar:13-1.7.1:test (selected for test)
> [DEBUG]       commons-httpclient:commons-httpclient:jar:2.0.2:test
> (selected for test)
> [DEBUG]         commons-logging:commons-logging:jar:1.0.3:test (removed -
> nearer found: 1.1.1)
> [DEBUG]       junit:junit:jar:3.8.1:test (removed - nearer found: 4.8.1)
> [DEBUG]       aspectj:aspectjrt:jar:1.2.1:test (selected for test)
> [DEBUG]       commons-logging:commons-logging:jar:1.0.4:test (removed -
> nearer found: 1.1.1)
> [DEBUG]       cargo:cargo:jar:0.5:test (selected for test)
> [DEBUG]         ant:ant:jar:1.5.4:test (selected for test)
> [DEBUG] Configuring mojo
> 'org.apache.maven.plugins:maven-compiler-plugin:2.3.2:testCompile' -->
> [DEBUG]   (f) basedir = /home/mwinter/workspace/arquillian-example
> [DEBUG]   (f) buildDirectory =
> /home/mwinter/workspace/arquillian-example/target
> [DEBUG]   (f) classpathElements =
> [/home/mwinter/workspace/arquillian-example/target/test-classes,
> /home/mwinter/workspace/arquillian-example/target/classes,
> /home/mwinter/.m2/repository/org/glassfish/extras/glassfish-embedded-all/3.0.1/glassfish-embedded-all-3.0.1.jar,
> /home/mwinter/.m2/repository/org/jboss/arquillian/container/arquillian-glassfish-embedded-3/1.0.0.Alpha4/arquillian-glassfish-embedded-3-1.0.0.Alpha4.jar,
> /home/mwinter/.m2/repository/org/jboss/arquillian/arquillian-spi/1.0.0.Alpha4/arquillian-spi-1.0.0.Alpha4.jar,
> /home/mwinter/.m2/repository/org/jboss/arquillian/arquillian-api/1.0.0.Alpha4/arquillian-api-1.0.0.Alpha4.jar,
> /home/mwinter/.m2/repository/org/jboss/shrinkwrap/shrinkwrap-api/1.0.0-alpha-11/shrinkwrap-api-1.0.0-alpha-11.jar,
> /home/mwinter/.m2/repository/org/jboss/shrinkwrap/shrinkwrap-extension-glassfish/1.0.0-alpha-11/shrinkwrap-extension-glassfish-1.0.0-alpha-11.jar,
> /home/mwinter/.m2/repository/org/jboss/shrinkwrap/shrinkwrap-impl-base/1.0.0-alpha-11/shrinkwrap-impl-base-1.0.0-alpha-11.jar,
> /home/mwinter/.m2/repository/org/jboss/shrinkwrap/shrinkwrap-spi/1.0.0-alpha-11/shrinkwrap-spi-1.0.0-alpha-11.jar,
> /home/mwinter/.m2/repository/org/jboss/arquillian/protocol/arquillian-protocol-servlet-3/1.0.0.Alpha4/arquillian-protocol-servlet-3-1.0.0.Alpha4.jar,
> /home/mwinter/.m2/repository/org/jboss/arquillian/testenricher/arquillian-testenricher-cdi/1.0.0.Alpha4/arquillian-testenricher-cdi-1.0.0.Alpha4.jar,
> /home/mwinter/.m2/repository/org/jboss/arquillian/testenricher/arquillian-testenricher-ejb/1.0.0.Alpha4/arquillian-testenricher-ejb-1.0.0.Alpha4.jar,
> /home/mwinter/.m2/repository/org/jboss/arquillian/testenricher/arquillian-testenricher-resource/1.0.0.Alpha4/arquillian-testenricher-resource-1.0.0.Alpha4.jar,
> /home/mwinter/.m2/repository/junit/junit/4.8.1/junit-4.8.1.jar,
> /home/mwinter/.m2/repository/org/jboss/arquillian/arquillian-junit/1.0.0.Alpha4/arquillian-junit-1.0.0.Alpha4.jar,
> /home/mwinter/.m2/repository/org/jboss/arquillian/arquillian-impl-base/1.0.0.Alpha4/arquillian-impl-base-1.0.0.Alpha4.jar,
> /home/mwinter/.m2/repository/org/jboss/arquillian/framework/arquillian-framework-jsfunit/1.0.0.Alpha4/arquillian-framework-jsfunit-1.0.0.Alpha4.jar,
> /home/mwinter/.m2/repository/org/jboss/jsfunit/jboss-jsfunit-core/1.3.0.Final/jboss-jsfunit-core-1.3.0.Final.jar,
> /home/mwinter/.m2/repository/net/sourceforge/htmlunit/htmlunit/2.8/htmlunit-2.8.jar,
> /home/mwinter/.m2/repository/xalan/xalan/2.7.1/xalan-2.7.1.jar,
> /home/mwinter/.m2/repository/xalan/serializer/2.7.1/serializer-2.7.1.jar,
> /home/mwinter/.m2/repository/xml-apis/xml-apis/1.3.04/xml-apis-1.3.04.jar,
> /home/mwinter/.m2/repository/commons-collections/commons-collections/3.2.1/commons-collections-3.2.1.jar,
> /home/mwinter/.m2/repository/commons-lang/commons-lang/2.4/commons-lang-2.4.jar,
> /home/mwinter/.m2/repository/org/apache/httpcomponents/httpclient/4.0.1/httpclient-4.0.1.jar,
> /home/mwinter/.m2/repository/org/apache/httpcomponents/httpcore/4.0.1/httpcore-4.0.1.jar,
> /home/mwinter/.m2/repository/commons-logging/commons-logging/1.1.1/commons-logging-1.1.1.jar,
> /home/mwinter/.m2/repository/commons-codec/commons-codec/1.4/commons-codec-1.4.jar,
> /home/mwinter/.m2/repository/org/apache/httpcomponents/httpmime/4.0.1/httpmime-4.0.1.jar,
> /home/mwinter/.m2/repository/org/apache/james/apache-mime4j/0.6/apache-mime4j-0.6.jar,
> /home/mwinter/.m2/repository/net/sourceforge/htmlunit/htmlunit-core-js/2.8/htmlunit-core-js-2.8.jar,
> /home/mwinter/.m2/repository/xerces/xercesImpl/2.9.1/xercesImpl-2.9.1.jar,
> /home/mwinter/.m2/repository/net/sourceforge/nekohtml/nekohtml/1.9.14/nekohtml-1.9.14.jar,
> /home/mwinter/.m2/repository/net/sourceforge/cssparser/cssparser/0.9.5/cssparser-0.9.5.jar,
> /home/mwinter/.m2/repository/org/w3c/css/sac/1.3/sac-1.3.jar,
> /home/mwinter/.m2/repository/commons-io/commons-io/1.4/commons-io-1.4.jar,
> /home/mwinter/.m2/repository/cactus/cactus/13-1.7.1/cactus-13-1.7.1.jar,
> /home/mwinter/.m2/repository/cactus/cactus-ant/13-1.7.1/cactus-ant-13-1.7.1.jar,
> /home/mwinter/.m2/repository/commons-httpclient/commons-httpclient/2.0.2/commons-httpclient-2.0.2.jar,
> /home/mwinter/.m2/repository/aspectj/aspectjrt/1.2.1/aspectjrt-1.2.1.jar,
> /home/mwinter/.m2/repository/cargo/cargo/0.5/cargo-0.5.jar,
> /home/mwinter/.m2/repository/ant/ant/1.5.4/ant-1.5.4.jar]
> [DEBUG]   (f) compileSourceRoots =
> [/home/mwinter/workspace/arquillian-example/src/test/java]
> [DEBUG]   (f) compilerId = javac
> [DEBUG]   (f) debug = true
> [DEBUG]   (f) failOnError = true
> [DEBUG]   (f) fork = false
> [DEBUG]   (f) generatedTestSourcesDirectory =
> /home/mwinter/workspace/arquillian-example/target/generated-sources/test-annotations
> [DEBUG]   (f) optimize = false
> [DEBUG]   (f) outputDirectory =
> /home/mwinter/workspace/arquillian-example/target/test-classes
> [DEBUG]   (f) outputFileName = arquillian-example-1.0-SNAPSHOT
> [DEBUG]   (f) session = org.apache.maven.execution.MavenSession@1c54796
> [DEBUG]   (f) showDeprecation = false
> [DEBUG]   (f) showWarnings = false
> [DEBUG]   (f) source = 1.6
> [DEBUG]   (f) staleMillis = 0
> [DEBUG]   (f) target = 1.6
> [DEBUG]   (f) verbose = false
> [DEBUG] -- end configuration --
> [INFO] [compiler:testCompile {execution: default-testCompile}]
> [DEBUG] Using compiler 'javac'.
> [DEBUG] Source directories:
> [/home/mwinter/workspace/arquillian-example/src/test/java]
> [DEBUG] Classpath:
> [/home/mwinter/workspace/arquillian-example/target/test-classes
>  /home/mwinter/workspace/arquillian-example/target/classes
>
>  /home/mwinter/.m2/repository/org/glassfish/extras/glassfish-embedded-all/3.0.1/glassfish-embedded-all-3.0.1.jar
>
>  /home/mwinter/.m2/repository/org/jboss/arquillian/container/arquillian-glassfish-embedded-3/1.0.0.Alpha4/arquillian-glassfish-embedded-3-1.0.0.Alpha4.jar
>
>  /home/mwinter/.m2/repository/org/jboss/arquillian/arquillian-spi/1.0.0.Alpha4/arquillian-spi-1.0.0.Alpha4.jar
>
>  /home/mwinter/.m2/repository/org/jboss/arquillian/arquillian-api/1.0.0.Alpha4/arquillian-api-1.0.0.Alpha4.jar
>
>  /home/mwinter/.m2/repository/org/jboss/shrinkwrap/shrinkwrap-api/1.0.0-alpha-11/shrinkwrap-api-1.0.0-alpha-11.jar
>
>  /home/mwinter/.m2/repository/org/jboss/shrinkwrap/shrinkwrap-extension-glassfish/1.0.0-alpha-11/shrinkwrap-extension-glassfish-1.0.0-alpha-11.jar
>
>  /home/mwinter/.m2/repository/org/jboss/shrinkwrap/shrinkwrap-impl-base/1.0.0-alpha-11/shrinkwrap-impl-base-1.0.0-alpha-11.jar
>
>  /home/mwinter/.m2/repository/org/jboss/shrinkwrap/shrinkwrap-spi/1.0.0-alpha-11/shrinkwrap-spi-1.0.0-alpha-11.jar
>
>  /home/mwinter/.m2/repository/org/jboss/arquillian/protocol/arquillian-protocol-servlet-3/1.0.0.Alpha4/arquillian-protocol-servlet-3-1.0.0.Alpha4.jar
>
>  /home/mwinter/.m2/repository/org/jboss/arquillian/testenricher/arquillian-testenricher-cdi/1.0.0.Alpha4/arquillian-testenricher-cdi-1.0.0.Alpha4.jar
>
>  /home/mwinter/.m2/repository/org/jboss/arquillian/testenricher/arquillian-testenricher-ejb/1.0.0.Alpha4/arquillian-testenricher-ejb-1.0.0.Alpha4.jar
>
>  /home/mwinter/.m2/repository/org/jboss/arquillian/testenricher/arquillian-testenricher-resource/1.0.0.Alpha4/arquillian-testenricher-resource-1.0.0.Alpha4.jar
>  /home/mwinter/.m2/repository/junit/junit/4.8.1/junit-4.8.1.jar
>
>  /home/mwinter/.m2/repository/org/jboss/arquillian/arquillian-junit/1.0.0.Alpha4/arquillian-junit-1.0.0.Alpha4.jar
>
>  /home/mwinter/.m2/repository/org/jboss/arquillian/arquillian-impl-base/1.0.0.Alpha4/arquillian-impl-base-1.0.0.Alpha4.jar
>
>  /home/mwinter/.m2/repository/org/jboss/arquillian/framework/arquillian-framework-jsfunit/1.0.0.Alpha4/arquillian-framework-jsfunit-1.0.0.Alpha4.jar
>
>  /home/mwinter/.m2/repository/org/jboss/jsfunit/jboss-jsfunit-core/1.3.0.Final/jboss-jsfunit-core-1.3.0.Final.jar
>
>  /home/mwinter/.m2/repository/net/sourceforge/htmlunit/htmlunit/2.8/htmlunit-2.8.jar
>  /home/mwinter/.m2/repository/xalan/xalan/2.7.1/xalan-2.7.1.jar
>  /home/mwinter/.m2/repository/xalan/serializer/2.7.1/serializer-2.7.1.jar
>  /home/mwinter/.m2/repository/xml-apis/xml-apis/1.3.04/xml-apis-1.3.04.jar
>
>  /home/mwinter/.m2/repository/commons-collections/commons-collections/3.2.1/commons-collections-3.2.1.jar
>
>  /home/mwinter/.m2/repository/commons-lang/commons-lang/2.4/commons-lang-2.4.jar
>
>  /home/mwinter/.m2/repository/org/apache/httpcomponents/httpclient/4.0.1/httpclient-4.0.1.jar
>
>  /home/mwinter/.m2/repository/org/apache/httpcomponents/httpcore/4.0.1/httpcore-4.0.1.jar
>
>  /home/mwinter/.m2/repository/commons-logging/commons-logging/1.1.1/commons-logging-1.1.1.jar
>
>  /home/mwinter/.m2/repository/commons-codec/commons-codec/1.4/commons-codec-1.4.jar
>
>  /home/mwinter/.m2/repository/org/apache/httpcomponents/httpmime/4.0.1/httpmime-4.0.1.jar
>
>  /home/mwinter/.m2/repository/org/apache/james/apache-mime4j/0.6/apache-mime4j-0.6.jar
>
>  /home/mwinter/.m2/repository/net/sourceforge/htmlunit/htmlunit-core-js/2.8/htmlunit-core-js-2.8.jar
>  /home/mwinter/.m2/repository/xerces/xercesImpl/2.9.1/xercesImpl-2.9.1.jar
>
>  /home/mwinter/.m2/repository/net/sourceforge/nekohtml/nekohtml/1.9.14/nekohtml-1.9.14.jar
>
>  /home/mwinter/.m2/repository/net/sourceforge/cssparser/cssparser/0.9.5/cssparser-0.9.5.jar
>  /home/mwinter/.m2/repository/org/w3c/css/sac/1.3/sac-1.3.jar
>  /home/mwinter/.m2/repository/commons-io/commons-io/1.4/commons-io-1.4.jar
>  /home/mwinter/.m2/repository/cactus/cactus/13-1.7.1/cactus-13-1.7.1.jar
>
>  /home/mwinter/.m2/repository/cactus/cactus-ant/13-1.7.1/cactus-ant-13-1.7.1.jar
>
>  /home/mwinter/.m2/repository/commons-httpclient/commons-httpclient/2.0.2/commons-httpclient-2.0.2.jar
>  /home/mwinter/.m2/repository/aspectj/aspectjrt/1.2.1/aspectjrt-1.2.1.jar
>  /home/mwinter/.m2/repository/cargo/cargo/0.5/cargo-0.5.jar
>  /home/mwinter/.m2/repository/ant/ant/1.5.4/ant-1.5.4.jar]
> [DEBUG] Output directory:
> /home/mwinter/workspace/arquillian-example/target/test-classes
> [INFO] Nothing to compile - all classes are up to date
> [DEBUG] org.jboss.jsfunit:arquillian-example:war:1.0-SNAPSHOT (selected for
> null)
> [DEBUG]   org.glassfish.extras:glassfish-embedded-all:jar:3.0.1:provided
> (selected for provided)
> [DEBUG]
> org.jboss.arquillian.container:arquillian-glassfish-embedded-3:jar:1.0.0.Alpha4:test
> (selected for test)
> [DEBUG]     org.jboss.arquillian:arquillian-spi:jar:1.0.0.Alpha4:test
> (selected for test)
> [DEBUG]       org.jboss.arquillian:arquillian-api:jar:1.0.0.Alpha4:test
> (selected for test)
> [DEBUG]         org.jboss.shrinkwrap:shrinkwrap-api:jar:1.0.0-alpha-11:test
> (selected for test)
> [DEBUG]
> org.jboss.shrinkwrap:shrinkwrap-extension-glassfish:jar:1.0.0-alpha-11:test
> (selected for test)
> [DEBUG]       org.jboss.shrinkwrap:shrinkwrap-api:jar:1.0.0-alpha-11:test
> (selected for test)
> [DEBUG]
> org.jboss.shrinkwrap:shrinkwrap-impl-base:jar:1.0.0-alpha-11:test (selected
> for test)
> [DEBUG]         org.jboss.shrinkwrap:shrinkwrap-spi:jar:1.0.0-alpha-11:test
> (selected for test)
> [DEBUG]
> org.jboss.arquillian.protocol:arquillian-protocol-servlet-3:jar:1.0.0.Alpha4:test
> (selected for test)
> [DEBUG]
> org.jboss.arquillian.testenricher:arquillian-testenricher-cdi:jar:1.0.0.Alpha4:test
> (selected for test)
> [DEBUG]
> org.jboss.arquillian.testenricher:arquillian-testenricher-ejb:jar:1.0.0.Alpha4:test
> (selected for test)
> [DEBUG]
> org.jboss.arquillian.testenricher:arquillian-testenricher-resource:jar:1.0.0.Alpha4:test
> (selected for test)
> [DEBUG]   junit:junit:jar:4.8.1:test (selected for test)
> [DEBUG]   org.jboss.arquillian:arquillian-junit:jar:1.0.0.Alpha4:test
> (selected for test)
> [DEBUG]     org.jboss.arquillian:arquillian-impl-base:jar:1.0.0.Alpha4:test
> (selected for test)
> [DEBUG]       org.jboss.shrinkwrap:shrinkwrap-spi:jar:1.0.0-alpha-11:test
> (selected for test)
> [DEBUG]
> org.jboss.arquillian.framework:arquillian-framework-jsfunit:jar:1.0.0.Alpha4:test
> (selected for test)
> [DEBUG]
> org.jboss.shrinkwrap:shrinkwrap-impl-base:jar:1.0.0-alpha-11:test (selected
> for test)
> [DEBUG]     org.jboss.shrinkwrap:shrinkwrap-spi:jar:1.0.0-alpha-11:test
> (selected for test)
> [DEBUG]     org.jboss.jsfunit:jboss-jsfunit-core:jar:1.3.0.Final:test
> (selected for test)
> [DEBUG]       net.sourceforge.htmlunit:htmlunit:jar:2.8:test (selected for
> test)
> [DEBUG]         xalan:xalan:jar:2.7.1:test (selected for test)
> [DEBUG]           xalan:serializer:jar:2.7.1:test (selected for test)
> [DEBUG]             xml-apis:xml-apis:jar:1.3.04:test (selected for test)
> [DEBUG]         commons-collections:commons-collections:jar:3.2.1:test
> (selected for test)
> [DEBUG]         commons-lang:commons-lang:jar:2.4:test (selected for test)
> [DEBUG]         org.apache.httpcomponents:httpclient:jar:4.0.1:test
> (selected for test)
> [DEBUG]           org.apache.httpcomponents:httpcore:jar:4.0.1:test
> (selected for test)
> [DEBUG]           commons-logging:commons-logging:jar:1.1.1:test (selected
> for test)
> [DEBUG]           commons-codec:commons-codec:jar:1.3:test (selected for
> test)
> [DEBUG]         org.apache.httpcomponents:httpmime:jar:4.0.1:test (selected
> for test)
> [DEBUG]           org.apache.james:apache-mime4j:jar:0.6:test (selected for
> test)
> [DEBUG]         commons-codec:commons-codec:jar:1.3:test (removed - nearer
> found: 1.4)
> [DEBUG]         commons-codec:commons-codec:jar:1.4:test (selected for
> test)
> [DEBUG]         net.sourceforge.htmlunit:htmlunit-core-js:jar:2.8:test
> (selected for test)
> [DEBUG]         xerces:xercesImpl:jar:2.9.1:test (selected for test)
> [DEBUG]           xml-apis:xml-apis:jar:1.3.04:test (selected for test)
> [DEBUG]         net.sourceforge.nekohtml:nekohtml:jar:1.9.14:test (selected
> for test)
> [DEBUG]         net.sourceforge.cssparser:cssparser:jar:0.9.5:test
> (selected for test)
> [DEBUG]           org.w3c.css:sac:jar:1.3:test (selected for test)
> [DEBUG]         commons-io:commons-io:jar:1.4:test (selected for test)
> [DEBUG]         commons-logging:commons-logging:jar:1.1.1:test (selected
> for test)
> [DEBUG]       net.sourceforge.htmlunit:htmlunit-core-js:jar:2.8:test
> (selected for test)
> [DEBUG]       org.apache.httpcomponents:httpclient:jar:4.0.1:test (selected
> for test)
> [DEBUG]         org.apache.httpcomponents:httpcore:jar:4.0.1:test (selected
> for test)
> [DEBUG]         commons-codec:commons-codec:jar:1.3:test (removed - nearer
> found: 1.4)
> [DEBUG]       org.apache.httpcomponents:httpmime:jar:4.0.1:test (selected
> for test)
> [DEBUG]         org.apache.james:apache-mime4j:jar:0.6:test (selected for
> test)
> [DEBUG]       org.apache.james:apache-mime4j:jar:0.6:test (selected for
> test)
> [DEBUG]       commons-lang:commons-lang:jar:2.4:test (selected for test)
> [DEBUG]       commons-collections:commons-collections:jar:3.2.1:test
> (selected for test)
> [DEBUG]       commons-io:commons-io:jar:1.4:test (selected for test)
> [DEBUG]       net.sourceforge.cssparser:cssparser:jar:0.9.5:test (selected
> for test)
> [DEBUG]         org.w3c.css:sac:jar:1.3:test (selected for test)
> [DEBUG]       net.sourceforge.nekohtml:nekohtml:jar:1.9.14:test (selected
> for test)
> [DEBUG]       xalan:xalan:jar:2.7.1:test (selected for test)
> [DEBUG]         xalan:serializer:jar:2.7.1:test (selected for test)
> [DEBUG]       cactus:cactus:jar:13-1.7.1:test (selected for test)
> [DEBUG]         cactus:cactus-ant:jar:13-1.7.1:test (selected for test)
> [DEBUG]         commons-httpclient:commons-httpclient:jar:2.0.2:test
> (selected for test)
> [DEBUG]           commons-logging:commons-logging:jar:1.0.3:test (removed -
> nearer found: 1.1.1)
> [DEBUG]         junit:junit:jar:3.8.1:test (removed - nearer found: 4.8.1)
> [DEBUG]         aspectj:aspectjrt:jar:1.2.1:test (selected for test)
> [DEBUG]         commons-logging:commons-logging:jar:1.0.4:test (removed -
> nearer found: 1.1.1)
> [DEBUG]         cargo:cargo:jar:0.5:test (selected for test)
> [DEBUG]           ant:ant:jar:1.5.4:test (selected for test)
> [DEBUG]   org.jboss.jsfunit:jboss-jsfunit-core:jar:1.3.0.Final:test
> (selected for test)
> [DEBUG]     net.sourceforge.htmlunit:htmlunit:jar:2.8:test (selected for
> test)
> [DEBUG]       xalan:xalan:jar:2.7.1:test (selected for test)
> [DEBUG]         xalan:serializer:jar:2.7.1:test (selected for test)
> [DEBUG]           xml-apis:xml-apis:jar:1.3.04:test (selected for test)
> [DEBUG]       commons-collections:commons-collections:jar:3.2.1:test
> (selected for test)
> [DEBUG]       commons-lang:commons-lang:jar:2.4:test (selected for test)
> [DEBUG]       org.apache.httpcomponents:httpclient:jar:4.0.1:test (selected
> for test)
> [DEBUG]         org.apache.httpcomponents:httpcore:jar:4.0.1:test (selected
> for test)
> [DEBUG]         commons-logging:commons-logging:jar:1.1.1:test (selected
> for test)
> [DEBUG]         commons-codec:commons-codec:jar:1.3:test (selected for
> test)
> [DEBUG]       org.apache.httpcomponents:httpmime:jar:4.0.1:test (selected
> for test)
> [DEBUG]         org.apache.james:apache-mime4j:jar:0.6:test (selected for
> test)
> [DEBUG]       commons-codec:commons-codec:jar:1.3:test (removed - nearer
> found: 1.4)
> [DEBUG]       commons-codec:commons-codec:jar:1.4:test (selected for test)
> [DEBUG]       net.sourceforge.htmlunit:htmlunit-core-js:jar:2.8:test
> (selected for test)
> [DEBUG]       xerces:xercesImpl:jar:2.9.1:test (selected for test)
> [DEBUG]         xml-apis:xml-apis:jar:1.3.04:test (selected for test)
> [DEBUG]       net.sourceforge.nekohtml:nekohtml:jar:1.9.14:test (selected
> for test)
> [DEBUG]       net.sourceforge.cssparser:cssparser:jar:0.9.5:test (selected
> for test)
> [DEBUG]         org.w3c.css:sac:jar:1.3:test (selected for test)
> [DEBUG]       commons-io:commons-io:jar:1.4:test (selected for test)
> [DEBUG]       commons-logging:commons-logging:jar:1.1.1:test (selected for
> test)
> [DEBUG]     net.sourceforge.htmlunit:htmlunit-core-js:jar:2.8:test
> (selected for test)
> [DEBUG]     org.apache.httpcomponents:httpclient:jar:4.0.1:test (selected
> for test)
> [DEBUG]       org.apache.httpcomponents:httpcore:jar:4.0.1:test (selected
> for test)
> [DEBUG]       commons-codec:commons-codec:jar:1.3:test (removed - nearer
> found: 1.4)
> [DEBUG]     org.apache.httpcomponents:httpmime:jar:4.0.1:test (selected for
> test)
> [DEBUG]       org.apache.james:apache-mime4j:jar:0.6:test (selected for
> test)
> [DEBUG]     org.apache.james:apache-mime4j:jar:0.6:test (selected for test)
> [DEBUG]     commons-lang:commons-lang:jar:2.4:test (selected for test)
> [DEBUG]     commons-collections:commons-collections:jar:3.2.1:test
> (selected for test)
> [DEBUG]     commons-io:commons-io:jar:1.4:test (selected for test)
> [DEBUG]     net.sourceforge.cssparser:cssparser:jar:0.9.5:test (selected
> for test)
> [DEBUG]       org.w3c.css:sac:jar:1.3:test (selected for test)
> [DEBUG]     net.sourceforge.nekohtml:nekohtml:jar:1.9.14:test (selected for
> test)
> [DEBUG]     xalan:xalan:jar:2.7.1:test (selected for test)
> [DEBUG]       xalan:serializer:jar:2.7.1:test (selected for test)
> [DEBUG]     cactus:cactus:jar:13-1.7.1:test (selected for test)
> [DEBUG]       cactus:cactus-ant:jar:13-1.7.1:test (selected for test)
> [DEBUG]       commons-httpclient:commons-httpclient:jar:2.0.2:test
> (selected for test)
> [DEBUG]         commons-logging:commons-logging:jar:1.0.3:test (removed -
> nearer found: 1.1.1)
> [DEBUG]       junit:junit:jar:3.8.1:test (removed - nearer found: 4.8.1)
> [DEBUG]       aspectj:aspectjrt:jar:1.2.1:test (selected for test)
> [DEBUG]       commons-logging:commons-logging:jar:1.0.4:test (removed -
> nearer found: 1.1.1)
> [DEBUG]       cargo:cargo:jar:0.5:test (selected for test)
> [DEBUG]         ant:ant:jar:1.5.4:test (selected for test)
> [DEBUG] Plugin dependencies for:
>
> org.apache.maven.plugins:maven-surefire-plugin:2.3.1
>
> are:
>
> org.apache.maven:maven-plugin-api:jar:2.0:runtime
> org.apache.maven.surefire:surefire-booter:jar:2.3.1:runtime
> org.codehaus.plexus:plexus-utils:jar:1.1:runtime
> org.apache.maven:maven-artifact:jar:2.0:runtime
> org.apache.maven:maven-project:jar:2.0:runtime
>
>
> [DEBUG]
> org.apache.maven.plugins:maven-surefire-plugin:maven-plugin:2.3.1:runtime
> (selected for runtime)
> [DEBUG] Retrieving parent-POM: org.apache.maven:maven:pom:2.0 for project:
> org.apache.maven:maven-plugin-api:jar:2.0 from the repository.
> [DEBUG] Adding managed dependencies for org.apache.maven:maven-plugin-api
> [DEBUG]   org.codehaus.plexus:plexus-container-default:jar:1.0-alpha-8
> [DEBUG]   org.codehaus.plexus:plexus-utils:jar:1.0.4
> [DEBUG]   org.apache.maven.wagon:wagon-provider-api:jar:1.0-alpha-5
> [DEBUG]   org.apache.maven.wagon:wagon-ssh:jar:1.0-alpha-5
> [DEBUG]   org.apache.maven.wagon:wagon-file:jar:1.0-alpha-5
> [DEBUG]   org.apache.maven.wagon:wagon-http-lightweight:jar:1.0-alpha-5
> [DEBUG]   org.apache.maven:maven-plugin-api:jar:2.0:runtime (selected for
> runtime)
> [DEBUG] Adding managed dependencies for unknown:surefire-booter
> [DEBUG]   org.apache.maven.surefire:surefire-api:jar:2.3.1
> [DEBUG]   org.apache.maven.surefire:surefire-booter:jar:2.3.1
> [DEBUG]   org.apache.maven.surefire:surefire-booter:jar:2.3.1:runtime
> (selected for runtime)
> [DEBUG] Adding managed dependencies for unknown:surefire-api
> [DEBUG]   org.apache.maven.surefire:surefire-api:jar:2.3.1
> [DEBUG]   org.apache.maven.surefire:surefire-booter:jar:2.3.1
> [DEBUG]     org.apache.maven.surefire:surefire-api:jar:2.3.1:runtime
> (selected for runtime)
> [DEBUG]       org.codehaus.plexus:plexus-utils:jar:1.1:runtime (selected
> for runtime)
> [DEBUG]       commons-lang:commons-lang:jar:2.1:runtime (selected for
> runtime)
> [DEBUG]     org.codehaus.plexus:plexus-utils:jar:1.1:runtime (selected for
> runtime)
> [DEBUG] Retrieving parent-POM:
> org.codehaus.plexus:plexus-components:pom:1.1.6 for project:
> null:plexus-archiver:jar:1.0-alpha-7 from the repository.
> [DEBUG] Retrieving parent-POM: org.codehaus.plexus:plexus:pom:1.0.8 for
> project: org.codehaus.plexus:plexus-components:pom:1.1.6 from the
> repository.
> [DEBUG]     org.codehaus.plexus:plexus-archiver:jar:1.0-alpha-7:runtime
> (selected for runtime)
> [DEBUG] Retrieving parent-POM: org.codehaus.plexus:plexus:pom:1.0.5 for
> project: null:plexus-utils:jar:1.2 from the repository.
> [DEBUG]       org.codehaus.plexus:plexus-utils:jar:1.2:runtime (removed -
> nearer found: 1.1)
> [DEBUG]
> org.codehaus.plexus:plexus-container-default:jar:1.0-alpha-8:runtime
> (selected for runtime)
> [DEBUG]         org.codehaus.plexus:plexus-utils:jar:1.0.4:runtime (removed
> - nearer found: 1.1)
> [DEBUG]         junit:junit:jar:3.8.1:runtime (selected for runtime)
> [DEBUG]         classworlds:classworlds:jar:1.1-alpha-2:runtime (selected
> for runtime)
> [DEBUG]   org.codehaus.plexus:plexus-utils:jar:1.1:runtime (selected for
> runtime)
> [DEBUG] Adding managed dependencies for org.apache.maven:maven-artifact
> [DEBUG]   org.codehaus.plexus:plexus-container-default:jar:1.0-alpha-8
> [DEBUG]   org.codehaus.plexus:plexus-utils:jar:1.0.4
> [DEBUG]   org.apache.maven.wagon:wagon-provider-api:jar:1.0-alpha-5
> [DEBUG]   org.apache.maven.wagon:wagon-ssh:jar:1.0-alpha-5
> [DEBUG]   org.apache.maven.wagon:wagon-file:jar:1.0-alpha-5
> [DEBUG]   org.apache.maven.wagon:wagon-http-lightweight:jar:1.0-alpha-5
> [DEBUG]   org.apache.maven:maven-artifact:jar:2.0:runtime (selected for
> runtime)
> [DEBUG]     org.codehaus.plexus:plexus-utils:jar:1.0.4:runtime (removed -
> nearer found: 1.1)
> [DEBUG] Adding managed dependencies for unknown:maven-project
> [DEBUG]   org.codehaus.plexus:plexus-container-default:jar:1.0-alpha-8
> [DEBUG]   org.codehaus.plexus:plexus-utils:jar:1.0.4
> [DEBUG]   org.apache.maven.wagon:wagon-provider-api:jar:1.0-alpha-5
> [DEBUG]   org.apache.maven.wagon:wagon-ssh:jar:1.0-alpha-5
> [DEBUG]   org.apache.maven.wagon:wagon-file:jar:1.0-alpha-5
> [DEBUG]   org.apache.maven.wagon:wagon-http-lightweight:jar:1.0-alpha-5
> [DEBUG]   org.apache.maven:maven-project:jar:2.0:runtime (selected for
> runtime)
> [DEBUG] Adding managed dependencies for unknown:maven-profile
> [DEBUG]   org.codehaus.plexus:plexus-container-default:jar:1.0-alpha-8
> [DEBUG]   org.codehaus.plexus:plexus-utils:jar:1.0.4
> [DEBUG]   org.apache.maven.wagon:wagon-provider-api:jar:1.0-alpha-5
> [DEBUG]   org.apache.maven.wagon:wagon-ssh:jar:1.0-alpha-5
> [DEBUG]   org.apache.maven.wagon:wagon-file:jar:1.0-alpha-5
> [DEBUG]   org.apache.maven.wagon:wagon-http-lightweight:jar:1.0-alpha-5
> [DEBUG]     org.apache.maven:maven-profile:jar:2.0:runtime (selected for
> runtime)
> [DEBUG] Adding managed dependencies for org.apache.maven:maven-model
> [DEBUG]   org.codehaus.plexus:plexus-container-default:jar:1.0-alpha-8
> [DEBUG]   org.codehaus.plexus:plexus-utils:jar:1.0.4
> [DEBUG]   org.apache.maven.wagon:wagon-provider-api:jar:1.0-alpha-5
> [DEBUG]   org.apache.maven.wagon:wagon-ssh:jar:1.0-alpha-5
> [DEBUG]   org.apache.maven.wagon:wagon-file:jar:1.0-alpha-5
> [DEBUG]   org.apache.maven.wagon:wagon-http-lightweight:jar:1.0-alpha-5
> [DEBUG]       org.apache.maven:maven-model:jar:2.0:runtime (selected for
> runtime)
> [DEBUG]         org.codehaus.plexus:plexus-utils:jar:1.0.4:runtime (removed
> - nearer found: 1.1)
> [DEBUG]       org.codehaus.plexus:plexus-utils:jar:1.0.4:runtime (removed -
> nearer found: 1.1)
> [DEBUG]     org.apache.maven:maven-model:jar:2.0:runtime (selected for
> runtime)
> [DEBUG]       org.codehaus.plexus:plexus-utils:jar:1.0.4:runtime (removed -
> nearer found: 1.1)
> [DEBUG] Adding managed dependencies for
> org.apache.maven:maven-artifact-manager
> [DEBUG]   org.codehaus.plexus:plexus-container-default:jar:1.0-alpha-8
> [DEBUG]   org.codehaus.plexus:plexus-utils:jar:1.0.4
> [DEBUG]   org.apache.maven.wagon:wagon-provider-api:jar:1.0-alpha-5
> [DEBUG]   org.apache.maven.wagon:wagon-ssh:jar:1.0-alpha-5
> [DEBUG]   org.apache.maven.wagon:wagon-file:jar:1.0-alpha-5
> [DEBUG]   org.apache.maven.wagon:wagon-http-lightweight:jar:1.0-alpha-5
> [DEBUG]     org.apache.maven:maven-artifact-manager:jar:2.0:runtime
> (selected for runtime)
> [DEBUG] Adding managed dependencies for
> org.apache.maven:maven-repository-metadata
> [DEBUG]   org.codehaus.plexus:plexus-container-default:jar:1.0-alpha-8
> [DEBUG]   org.codehaus.plexus:plexus-utils:jar:1.0.4
> [DEBUG]   org.apache.maven.wagon:wagon-provider-api:jar:1.0-alpha-5
> [DEBUG]   org.apache.maven.wagon:wagon-ssh:jar:1.0-alpha-5
> [DEBUG]   org.apache.maven.wagon:wagon-file:jar:1.0-alpha-5
> [DEBUG]   org.apache.maven.wagon:wagon-http-lightweight:jar:1.0-alpha-5
> [DEBUG]       org.apache.maven:maven-repository-metadata:jar:2.0:runtime
> (selected for runtime)
> [DEBUG]         org.codehaus.plexus:plexus-utils:jar:1.0.4:runtime (removed
> - nearer found: 1.1)
> [DEBUG]       org.codehaus.plexus:plexus-utils:jar:1.0.4:runtime (removed -
> nearer found: 1.1)
> [DEBUG]
> org.apache.maven.wagon:wagon-provider-api:jar:1.0-alpha-5:runtime (selected
> for runtime)
> [DEBUG]         org.codehaus.plexus:plexus-utils:jar:1.0.4:runtime (removed
> - nearer found: 1.1)
> [DEBUG]     org.codehaus.plexus:plexus-utils:jar:1.0.4:runtime (removed -
> nearer found: 1.1)
> [DEBUG]
> org.codehaus.plexus:plexus-container-default:jar:1.0-alpha-8:runtime
> (selected for runtime)
> [DEBUG]       org.codehaus.plexus:plexus-utils:jar:1.0.4:runtime (removed -
> nearer found: 1.1)
> [DEBUG]       junit:junit:jar:3.8.1:runtime (selected for runtime)
> [DEBUG]       classworlds:classworlds:jar:1.1-alpha-2:runtime (selected for
> runtime)
> [DEBUG]  The following artifacts were filtered out for plugin:
> org.apache.maven.plugins:maven-surefire-plugin:2.3.1 because they're already
> in the core of Maven:
>
> org.apache.maven:maven-plugin-api:jar:2.0:runtime
> org.apache.maven:maven-artifact:jar:2.0:runtime
> org.apache.maven:maven-project:jar:2.0:runtime
>
> These will use the artifact files already in the core ClassRealm instead,
> to allow them to be included in PluginDescriptor.getArtifacts().
>
>
> [DEBUG] Configuring mojo
> 'org.apache.maven.plugins:maven-surefire-plugin:2.3.1:test' -->
> [DEBUG]   (f) argLine = -Xmx512m -XX:MaxPermSize=256m
>                        -Djava.net.preferIPv4Stack=true
> [DEBUG]   (f) basedir = /home/mwinter/workspace/arquillian-example
> [DEBUG]   (f) childDelegation = false
> [DEBUG]   (f) classesDirectory =
> /home/mwinter/workspace/arquillian-example/target/classes
> [DEBUG]   (f) classpathElements =
> [/home/mwinter/workspace/arquillian-example/target/test-classes,
> /home/mwinter/workspace/arquillian-example/target/classes,
> /home/mwinter/.m2/repository/org/glassfish/extras/glassfish-embedded-all/3.0.1/glassfish-embedded-all-3.0.1.jar,
> /home/mwinter/.m2/repository/org/jboss/arquillian/container/arquillian-glassfish-embedded-3/1.0.0.Alpha4/arquillian-glassfish-embedded-3-1.0.0.Alpha4.jar,
> /home/mwinter/.m2/repository/org/jboss/arquillian/arquillian-spi/1.0.0.Alpha4/arquillian-spi-1.0.0.Alpha4.jar,
> /home/mwinter/.m2/repository/org/jboss/arquillian/arquillian-api/1.0.0.Alpha4/arquillian-api-1.0.0.Alpha4.jar,
> /home/mwinter/.m2/repository/org/jboss/shrinkwrap/shrinkwrap-api/1.0.0-alpha-11/shrinkwrap-api-1.0.0-alpha-11.jar,
> /home/mwinter/.m2/repository/org/jboss/shrinkwrap/shrinkwrap-extension-glassfish/1.0.0-alpha-11/shrinkwrap-extension-glassfish-1.0.0-alpha-11.jar,
> /home/mwinter/.m2/repository/org/jboss/shrinkwrap/shrinkwrap-impl-base/1.0.0-alpha-11/shrinkwrap-impl-base-1.0.0-alpha-11.jar,
> /home/mwinter/.m2/repository/org/jboss/shrinkwrap/shrinkwrap-spi/1.0.0-alpha-11/shrinkwrap-spi-1.0.0-alpha-11.jar,
> /home/mwinter/.m2/repository/org/jboss/arquillian/protocol/arquillian-protocol-servlet-3/1.0.0.Alpha4/arquillian-protocol-servlet-3-1.0.0.Alpha4.jar,
> /home/mwinter/.m2/repository/org/jboss/arquillian/testenricher/arquillian-testenricher-cdi/1.0.0.Alpha4/arquillian-testenricher-cdi-1.0.0.Alpha4.jar,
> /home/mwinter/.m2/repository/org/jboss/arquillian/testenricher/arquillian-testenricher-ejb/1.0.0.Alpha4/arquillian-testenricher-ejb-1.0.0.Alpha4.jar,
> /home/mwinter/.m2/repository/org/jboss/arquillian/testenricher/arquillian-testenricher-resource/1.0.0.Alpha4/arquillian-testenricher-resource-1.0.0.Alpha4.jar,
> /home/mwinter/.m2/repository/junit/junit/4.8.1/junit-4.8.1.jar,
> /home/mwinter/.m2/repository/org/jboss/arquillian/arquillian-junit/1.0.0.Alpha4/arquillian-junit-1.0.0.Alpha4.jar,
> /home/mwinter/.m2/repository/org/jboss/arquillian/arquillian-impl-base/1.0.0.Alpha4/arquillian-impl-base-1.0.0.Alpha4.jar,
> /home/mwinter/.m2/repository/org/jboss/arquillian/framework/arquillian-framework-jsfunit/1.0.0.Alpha4/arquillian-framework-jsfunit-1.0.0.Alpha4.jar,
> /home/mwinter/.m2/repository/org/jboss/jsfunit/jboss-jsfunit-core/1.3.0.Final/jboss-jsfunit-core-1.3.0.Final.jar,
> /home/mwinter/.m2/repository/net/sourceforge/htmlunit/htmlunit/2.8/htmlunit-2.8.jar,
> /home/mwinter/.m2/repository/xalan/xalan/2.7.1/xalan-2.7.1.jar,
> /home/mwinter/.m2/repository/xalan/serializer/2.7.1/serializer-2.7.1.jar,
> /home/mwinter/.m2/repository/xml-apis/xml-apis/1.3.04/xml-apis-1.3.04.jar,
> /home/mwinter/.m2/repository/commons-collections/commons-collections/3.2.1/commons-collections-3.2.1.jar,
> /home/mwinter/.m2/repository/commons-lang/commons-lang/2.4/commons-lang-2.4.jar,
> /home/mwinter/.m2/repository/org/apache/httpcomponents/httpclient/4.0.1/httpclient-4.0.1.jar,
> /home/mwinter/.m2/repository/org/apache/httpcomponents/httpcore/4.0.1/httpcore-4.0.1.jar,
> /home/mwinter/.m2/repository/commons-logging/commons-logging/1.1.1/commons-logging-1.1.1.jar,
> /home/mwinter/.m2/repository/commons-codec/commons-codec/1.4/commons-codec-1.4.jar,
> /home/mwinter/.m2/repository/org/apache/httpcomponents/httpmime/4.0.1/httpmime-4.0.1.jar,
> /home/mwinter/.m2/repository/org/apache/james/apache-mime4j/0.6/apache-mime4j-0.6.jar,
> /home/mwinter/.m2/repository/net/sourceforge/htmlunit/htmlunit-core-js/2.8/htmlunit-core-js-2.8.jar,
> /home/mwinter/.m2/repository/xerces/xercesImpl/2.9.1/xercesImpl-2.9.1.jar,
> /home/mwinter/.m2/repository/net/sourceforge/nekohtml/nekohtml/1.9.14/nekohtml-1.9.14.jar,
> /home/mwinter/.m2/repository/net/sourceforge/cssparser/cssparser/0.9.5/cssparser-0.9.5.jar,
> /home/mwinter/.m2/repository/org/w3c/css/sac/1.3/sac-1.3.jar,
> /home/mwinter/.m2/repository/commons-io/commons-io/1.4/commons-io-1.4.jar,
> /home/mwinter/.m2/repository/cactus/cactus/13-1.7.1/cactus-13-1.7.1.jar,
> /home/mwinter/.m2/repository/cactus/cactus-ant/13-1.7.1/cactus-ant-13-1.7.1.jar,
> /home/mwinter/.m2/repository/commons-httpclient/commons-httpclient/2.0.2/commons-httpclient-2.0.2.jar,
> /home/mwinter/.m2/repository/aspectj/aspectjrt/1.2.1/aspectjrt-1.2.1.jar,
> /home/mwinter/.m2/repository/cargo/cargo/0.5/cargo-0.5.jar,
> /home/mwinter/.m2/repository/ant/ant/1.5.4/ant-1.5.4.jar]
> [DEBUG]   (f) disableXmlReport = false
> [DEBUG]   (f) enableAssertions = true
> [DEBUG]   (f) forkMode = once
> [DEBUG]   (f) junitArtifactName = junit:junit
> [DEBUG]   (f) localRepository =
> Repository[local|file:///home/mwinter/.m2/repository]
> [DEBUG]   (f) parallel = false
> [DEBUG]   (f) pluginArtifactMap =
> {org.apache.maven.surefire:surefire-booter=org.apache.maven.surefire:surefire-booter:jar:2.3.1:runtime,
> org.apache.maven.surefire:surefire-api=org.apache.maven.surefire:surefire-api:jar:2.3.1:runtime,
> org.codehaus.plexus:plexus-utils=org.codehaus.plexus:plexus-utils:jar:1.1:runtime,
> commons-lang:commons-lang=commons-lang:commons-lang:jar:2.1:runtime,
> org.codehaus.plexus:plexus-archiver=org.codehaus.plexus:plexus-archiver:jar:1.0-alpha-7:runtime,
> org.apache.maven:maven-plugin-api=org.apache.maven:maven-plugin-api:jar:2.0:runtime,
> org.apache.maven:maven-artifact=org.apache.maven:maven-artifact:jar:2.0:runtime,
> org.apache.maven:maven-project=org.apache.maven:maven-project:jar:2.0:runtime}
> [DEBUG]   (f) printSummary = true
> [DEBUG]   (f) project = MavenProject:
> org.jboss.jsfunit:arquillian-example:1.0-SNAPSHOT @
> /home/mwinter/workspace/arquillian-example/pom.xml
> [DEBUG]   (f) projectArtifactMap =
> {org.glassfish.extras:glassfish-embedded-all=org.glassfish.extras:glassfish-embedded-all:jar:3.0.1:provided,
> org.jboss.arquillian.container:arquillian-glassfish-embedded-3=org.jboss.arquillian.container:arquillian-glassfish-embedded-3:jar:1.0.0.Alpha4:test,
> org.jboss.arquillian:arquillian-spi=org.jboss.arquillian:arquillian-spi:jar:1.0.0.Alpha4:test,
> org.jboss.arquillian:arquillian-api=org.jboss.arquillian:arquillian-api:jar:1.0.0.Alpha4:test,
> org.jboss.shrinkwrap:shrinkwrap-api=org.jboss.shrinkwrap:shrinkwrap-api:jar:1.0.0-alpha-11:test,
> org.jboss.shrinkwrap:shrinkwrap-extension-glassfish=org.jboss.shrinkwrap:shrinkwrap-extension-glassfish:jar:1.0.0-alpha-11:test,
> org.jboss.shrinkwrap:shrinkwrap-impl-base=org.jboss.shrinkwrap:shrinkwrap-impl-base:jar:1.0.0-alpha-11:test,
> org.jboss.shrinkwrap:shrinkwrap-spi=org.jboss.shrinkwrap:shrinkwrap-spi:jar:1.0.0-alpha-11:test,
> org.jboss.arquillian.protocol:arquillian-protocol-servlet-3=org.jboss.arquillian.protocol:arquillian-protocol-servlet-3:jar:1.0.0.Alpha4:test,
> org.jboss.arquillian.testenricher:arquillian-testenricher-cdi=org.jboss.arquillian.testenricher:arquillian-testenricher-cdi:jar:1.0.0.Alpha4:test,
> org.jboss.arquillian.testenricher:arquillian-testenricher-ejb=org.jboss.arquillian.testenricher:arquillian-testenricher-ejb:jar:1.0.0.Alpha4:test,
> org.jboss.arquillian.testenricher:arquillian-testenricher-resource=org.jboss.arquillian.testenricher:arquillian-testenricher-resource:jar:1.0.0.Alpha4:test,
> junit:junit=junit:junit:jar:4.8.1:test,
> org.jboss.arquillian:arquillian-junit=org.jboss.arquillian:arquillian-junit:jar:1.0.0.Alpha4:test,
> org.jboss.arquillian:arquillian-impl-base=org.jboss.arquillian:arquillian-impl-base:jar:1.0.0.Alpha4:test,
> org.jboss.arquillian.framework:arquillian-framework-jsfunit=org.jboss.arquillian.framework:arquillian-framework-jsfunit:jar:1.0.0.Alpha4:test,
> org.jboss.jsfunit:jboss-jsfunit-core=org.jboss.jsfunit:jboss-jsfunit-core:jar:1.3.0.Final:test,
> net.sourceforge.htmlunit:htmlunit=net.sourceforge.htmlunit:htmlunit:jar:2.8:test,
> xalan:xalan=xalan:xalan:jar:2.7.1:test,
> xalan:serializer=xalan:serializer:jar:2.7.1:test,
> xml-apis:xml-apis=xml-apis:xml-apis:jar:1.3.04:test,
> commons-collections:commons-collections=commons-collections:commons-collections:jar:3.2.1:test,
> commons-lang:commons-lang=commons-lang:commons-lang:jar:2.4:test,
> org.apache.httpcomponents:httpclient=org.apache.httpcomponents:httpclient:jar:4.0.1:test,
> org.apache.httpcomponents:httpcore=org.apache.httpcomponents:httpcore:jar:4.0.1:test,
> commons-logging:commons-logging=commons-logging:commons-logging:jar:1.1.1:test,
> commons-codec:commons-codec=commons-codec:commons-codec:jar:1.4:test,
> org.apache.httpcomponents:httpmime=org.apache.httpcomponents:httpmime:jar:4.0.1:test,
> org.apache.james:apache-mime4j=org.apache.james:apache-mime4j:jar:0.6:test,
> net.sourceforge.htmlunit:htmlunit-core-js=net.sourceforge.htmlunit:htmlunit-core-js:jar:2.8:test,
> xerces:xercesImpl=xerces:xercesImpl:jar:2.9.1:test,
> net.sourceforge.nekohtml:nekohtml=net.sourceforge.nekohtml:nekohtml:jar:1.9.14:test,
> net.sourceforge.cssparser:cssparser=net.sourceforge.cssparser:cssparser:jar:0.9.5:test,
> org.w3c.css:sac=org.w3c.css:sac:jar:1.3:test,
> commons-io:commons-io=commons-io:commons-io:jar:1.4:test,
> cactus:cactus=cactus:cactus:jar:13-1.7.1:test,
> cactus:cactus-ant=cactus:cactus-ant:jar:13-1.7.1:test,
> commons-httpclient:commons-httpclient=commons-httpclient:commons-httpclient:jar:2.0.2:test,
> aspectj:aspectjrt=aspectj:aspectjrt:jar:1.2.1:test,
> cargo:cargo=cargo:cargo:jar:0.5:test, ant:ant=ant:ant:jar:1.5.4:test}
> [DEBUG]   (f) redirectTestOutputToFile = true
> [DEBUG]   (f) remoteRepositories = [Repository[central|
> http://repo1.maven.org/maven2]]
> [DEBUG]   (f) reportFormat = brief
> [DEBUG]   (f) reportsDirectory =
> /home/mwinter/workspace/arquillian-example/target/surefire-reports
> [DEBUG]   (f) testClassesDirectory =
> /home/mwinter/workspace/arquillian-example/target/test-classes
> [DEBUG]   (f) testNGArtifactName = org.testng:testng
> [DEBUG]   (f) testSourceDirectory =
> /home/mwinter/workspace/arquillian-example/src/test/java
> [DEBUG]   (f) threadCount = 5
> [DEBUG]   (f) trimStackTrace = false
> [DEBUG]   (f) useFile = true
> [DEBUG]   (f) useSystemClassLoader = false
> [DEBUG] -- end configuration --
> [INFO] [surefire:test {execution: default-test}]
> [DEBUG] dummy:dummy:jar:1.0 (selected for null)
> [DEBUG]   org.apache.maven.surefire:surefire-booter:jar:2.3.1:runtime
> (selected for runtime)
> [DEBUG]     org.apache.maven.surefire:surefire-api:jar:2.3.1:runtime
> (selected for runtime)
> [DEBUG]       org.codehaus.plexus:plexus-utils:jar:1.1:runtime (selected
> for runtime)
> [DEBUG]       commons-lang:commons-lang:jar:2.1:runtime (selected for
> runtime)
> [DEBUG]     org.codehaus.plexus:plexus-utils:jar:1.1:runtime (selected for
> runtime)
> [DEBUG]     org.codehaus.plexus:plexus-archiver:jar:1.0-alpha-7:runtime
> (selected for runtime)
> [DEBUG]       org.codehaus.plexus:plexus-utils:jar:1.2:runtime (removed -
> nearer found: 1.1)
> [DEBUG]
> org.codehaus.plexus:plexus-container-default:jar:1.0-alpha-8:runtime
> (selected for runtime)
> [DEBUG]         org.codehaus.plexus:plexus-utils:jar:1.0.4:runtime (removed
> - nearer found: 1.1)
> [DEBUG]         junit:junit:jar:3.8.1:runtime (selected for runtime)
> [DEBUG]         classworlds:classworlds:jar:1.1-alpha-2:runtime (selected
> for runtime)
> [DEBUG] Adding to surefire booter test classpath:
> /home/mwinter/.m2/repository/org/apache/maven/surefire/surefire-booter/2.3.1/surefire-booter-2.3.1.jar
> [DEBUG] Adding to surefire booter test classpath:
> /home/mwinter/.m2/repository/org/apache/maven/surefire/surefire-api/2.3.1/surefire-api-2.3.1.jar
> [DEBUG] Adding to surefire booter test classpath:
> /home/mwinter/.m2/repository/org/codehaus/plexus/plexus-utils/1.1/plexus-utils-1.1.jar
> [DEBUG] Adding to surefire booter test classpath:
> /home/mwinter/.m2/repository/commons-lang/commons-lang/2.1/commons-lang-2.1.jar
> [DEBUG] Adding to surefire booter test classpath:
> /home/mwinter/.m2/repository/org/codehaus/plexus/plexus-archiver/1.0-alpha-7/plexus-archiver-1.0-alpha-7.jar
> [DEBUG] Adding to surefire booter test classpath:
> /home/mwinter/.m2/repository/org/codehaus/plexus/plexus-container-default/1.0-alpha-8/plexus-container-default-1.0-alpha-8.jar
> [DEBUG] Adding to surefire booter test classpath:
> /home/mwinter/.m2/repository/junit/junit/3.8.1/junit-3.8.1.jar
> [DEBUG] Adding to surefire booter test classpath:
> /home/mwinter/.m2/repository/classworlds/classworlds/1.1-alpha-2/classworlds-1.1-alpha-2.jar
> [DEBUG] dummy:dummy:jar:1.0 (selected for null)
> [DEBUG] Retrieving parent-POM:
> org.apache.maven.surefire:surefire-providers:pom:2.3.1 for project:
> null:surefire-junit4:jar:null from the repository.
> [DEBUG] Adding managed dependencies for unknown:surefire-junit4
> [DEBUG]   org.apache.maven.surefire:surefire-api:jar:2.3.1
> [DEBUG]   org.apache.maven.surefire:surefire-booter:jar:2.3.1
> [DEBUG]   org.apache.maven.surefire:surefire-junit4:jar:2.3.1:test
> (selected for test)
> [DEBUG]     junit:junit:jar:4.0:test (selected for test)
> [DEBUG]     org.apache.maven.surefire:surefire-api:jar:2.3.1:test (selected
> for test)
> [DEBUG]       org.codehaus.plexus:plexus-utils:jar:1.1:test (selected for
> test)
> [DEBUG]       commons-lang:commons-lang:jar:2.1:test (selected for test)
> [DEBUG] Adding to surefire test classpath:
> /home/mwinter/.m2/repository/org/apache/maven/surefire/surefire-junit4/2.3.1/surefire-junit4-2.3.1.jar
> [DEBUG] Adding to surefire test classpath:
> /home/mwinter/.m2/repository/junit/junit/4.0/junit-4.0.jar
> [DEBUG] Adding to surefire test classpath:
> /home/mwinter/.m2/repository/org/apache/maven/surefire/surefire-api/2.3.1/surefire-api-2.3.1.jar
> [DEBUG] Adding to surefire test classpath:
> /home/mwinter/.m2/repository/org/codehaus/plexus/plexus-utils/1.1/plexus-utils-1.1.jar
> [DEBUG] Adding to surefire test classpath:
> /home/mwinter/.m2/repository/commons-lang/commons-lang/2.1/commons-lang-2.1.jar
> [DEBUG] Test Classpath :
> [DEBUG]   /home/mwinter/workspace/arquillian-example/target/test-classes
> [DEBUG]   /home/mwinter/workspace/arquillian-example/target/classes
> [DEBUG]
> /home/mwinter/.m2/repository/org/glassfish/extras/glassfish-embedded-all/3.0.1/glassfish-embedded-all-3.0.1.jar
> [DEBUG]
> /home/mwinter/.m2/repository/org/jboss/arquillian/container/arquillian-glassfish-embedded-3/1.0.0.Alpha4/arquillian-glassfish-embedded-3-1.0.0.Alpha4.jar
> [DEBUG]
> /home/mwinter/.m2/repository/org/jboss/arquillian/arquillian-spi/1.0.0.Alpha4/arquillian-spi-1.0.0.Alpha4.jar
> [DEBUG]
> /home/mwinter/.m2/repository/org/jboss/arquillian/arquillian-api/1.0.0.Alpha4/arquillian-api-1.0.0.Alpha4.jar
> [DEBUG]
> /home/mwinter/.m2/repository/org/jboss/shrinkwrap/shrinkwrap-api/1.0.0-alpha-11/shrinkwrap-api-1.0.0-alpha-11.jar
> [DEBUG]
> /home/mwinter/.m2/repository/org/jboss/shrinkwrap/shrinkwrap-extension-glassfish/1.0.0-alpha-11/shrinkwrap-extension-glassfish-1.0.0-alpha-11.jar
> [DEBUG]
> /home/mwinter/.m2/repository/org/jboss/shrinkwrap/shrinkwrap-impl-base/1.0.0-alpha-11/shrinkwrap-impl-base-1.0.0-alpha-11.jar
> [DEBUG]
> /home/mwinter/.m2/repository/org/jboss/shrinkwrap/shrinkwrap-spi/1.0.0-alpha-11/shrinkwrap-spi-1.0.0-alpha-11.jar
> [DEBUG]
> /home/mwinter/.m2/repository/org/jboss/arquillian/protocol/arquillian-protocol-servlet-3/1.0.0.Alpha4/arquillian-protocol-servlet-3-1.0.0.Alpha4.jar
> [DEBUG]
> /home/mwinter/.m2/repository/org/jboss/arquillian/testenricher/arquillian-testenricher-cdi/1.0.0.Alpha4/arquillian-testenricher-cdi-1.0.0.Alpha4.jar
> [DEBUG]
> /home/mwinter/.m2/repository/org/jboss/arquillian/testenricher/arquillian-testenricher-ejb/1.0.0.Alpha4/arquillian-testenricher-ejb-1.0.0.Alpha4.jar
> [DEBUG]
> /home/mwinter/.m2/repository/org/jboss/arquillian/testenricher/arquillian-testenricher-resource/1.0.0.Alpha4/arquillian-testenricher-resource-1.0.0.Alpha4.jar
> [DEBUG]   /home/mwinter/.m2/repository/junit/junit/4.8.1/junit-4.8.1.jar
> [DEBUG]
> /home/mwinter/.m2/repository/org/jboss/arquillian/arquillian-junit/1.0.0.Alpha4/arquillian-junit-1.0.0.Alpha4.jar
> [DEBUG]
> /home/mwinter/.m2/repository/org/jboss/arquillian/arquillian-impl-base/1.0.0.Alpha4/arquillian-impl-base-1.0.0.Alpha4.jar
> [DEBUG]
> /home/mwinter/.m2/repository/org/jboss/arquillian/framework/arquillian-framework-jsfunit/1.0.0.Alpha4/arquillian-framework-jsfunit-1.0.0.Alpha4.jar
> [DEBUG]
> /home/mwinter/.m2/repository/org/jboss/jsfunit/jboss-jsfunit-core/1.3.0.Final/jboss-jsfunit-core-1.3.0.Final.jar
> [DEBUG]
> /home/mwinter/.m2/repository/net/sourceforge/htmlunit/htmlunit/2.8/htmlunit-2.8.jar
> [DEBUG]   /home/mwinter/.m2/repository/xalan/xalan/2.7.1/xalan-2.7.1.jar
> [DEBUG]
> /home/mwinter/.m2/repository/xalan/serializer/2.7.1/serializer-2.7.1.jar
> [DEBUG]
> /home/mwinter/.m2/repository/xml-apis/xml-apis/1.3.04/xml-apis-1.3.04.jar
> [DEBUG]
> /home/mwinter/.m2/repository/commons-collections/commons-collections/3.2.1/commons-collections-3.2.1.jar
> [DEBUG]
> /home/mwinter/.m2/repository/commons-lang/commons-lang/2.4/commons-lang-2.4.jar
> [DEBUG]
> /home/mwinter/.m2/repository/org/apache/httpcomponents/httpclient/4.0.1/httpclient-4.0.1.jar
> [DEBUG]
> /home/mwinter/.m2/repository/org/apache/httpcomponents/httpcore/4.0.1/httpcore-4.0.1.jar
> [DEBUG]
> /home/mwinter/.m2/repository/commons-logging/commons-logging/1.1.1/commons-logging-1.1.1.jar
> [DEBUG]
> /home/mwinter/.m2/repository/commons-codec/commons-codec/1.4/commons-codec-1.4.jar
> [DEBUG]
> /home/mwinter/.m2/repository/org/apache/httpcomponents/httpmime/4.0.1/httpmime-4.0.1.jar
> [DEBUG]
> /home/mwinter/.m2/repository/org/apache/james/apache-mime4j/0.6/apache-mime4j-0.6.jar
> [DEBUG]
> /home/mwinter/.m2/repository/net/sourceforge/htmlunit/htmlunit-core-js/2.8/htmlunit-core-js-2.8.jar
> [DEBUG]
> /home/mwinter/.m2/repository/xerces/xercesImpl/2.9.1/xercesImpl-2.9.1.jar
> [DEBUG]
> /home/mwinter/.m2/repository/net/sourceforge/nekohtml/nekohtml/1.9.14/nekohtml-1.9.14.jar
> [DEBUG]
> /home/mwinter/.m2/repository/net/sourceforge/cssparser/cssparser/0.9.5/cssparser-0.9.5.jar
> [DEBUG]   /home/mwinter/.m2/repository/org/w3c/css/sac/1.3/sac-1.3.jar
> [DEBUG]
> /home/mwinter/.m2/repository/commons-io/commons-io/1.4/commons-io-1.4.jar
> [DEBUG]
> /home/mwinter/.m2/repository/cactus/cactus/13-1.7.1/cactus-13-1.7.1.jar
> [DEBUG]
> /home/mwinter/.m2/repository/cactus/cactus-ant/13-1.7.1/cactus-ant-13-1.7.1.jar
> [DEBUG]
> /home/mwinter/.m2/repository/commons-httpclient/commons-httpclient/2.0.2/commons-httpclient-2.0.2.jar
> [DEBUG]
> /home/mwinter/.m2/repository/aspectj/aspectjrt/1.2.1/aspectjrt-1.2.1.jar
> [DEBUG]   /home/mwinter/.m2/repository/cargo/cargo/0.5/cargo-0.5.jar
> [DEBUG]   /home/mwinter/.m2/repository/ant/ant/1.5.4/ant-1.5.4.jar
> [DEBUG] Setting system property
> [localRepository]=[/home/mwinter/.m2/repository]
> [DEBUG] Setting system property
> [basedir]=[/home/mwinter/workspace/arquillian-example]
> [DEBUG] Using JVM: /usr/lib/jvm/java-6-sun-1.6.0.22/jre/bin/java
> [INFO] Surefire report directory:
> /home/mwinter/workspace/arquillian-example/target/surefire-reports
> Forking command line: /usr/lib/jvm/java-6-sun-1.6.0.22/jre/bin/java
> -Xmx512m -XX:MaxPermSize=256m
>                        -Djava.net.preferIPv4Stack=true -classpath
> /home/mwinter/.m2/repository/org/apache/maven/surefire/surefire-booter/2.3.1/surefire-booter-2.3.1.jar:/home/mwinter/.m2/repository/org/apache/maven/surefire/surefire-api/2.3.1/surefire-api-2.3.1.jar:/home/mwinter/.m2/repository/org/codehaus/plexus/plexus-utils/1.1/plexus-utils-1.1.jar:/home/mwinter/.m2/repository/commons-lang/commons-lang/2.1/commons-lang-2.1.jar:/home/mwinter/.m2/repository/org/codehaus/plexus/plexus-archiver/1.0-alpha-7/plexus-archiver-1.0-alpha-7.jar:/home/mwinter/.m2/repository/org/codehaus/plexus/plexus-container-default/1.0-alpha-8/plexus-container-default-1.0-alpha-8.jar:/home/mwinter/.m2/repository/junit/junit/3.8.1/junit-3.8.1.jar:/home/mwinter/.m2/repository/classworlds/classworlds/1.1-alpha-2/classworlds-1.1-alpha-2.jar
> org.apache.maven.surefire.booter.SurefireBooter
> /tmp/surefire4105736462398011437tmp /tmp/surefire7530828718614545520tmp
> [INFO]
> ------------------------------------------------------------------------
> [ERROR] BUILD FAILURE
> [INFO]
> ------------------------------------------------------------------------
> [INFO] There are test failures.
>
> Please refer to
> /home/mwinter/workspace/arquillian-example/target/surefire-reports for the
> individual test results.
> [INFO]
> ------------------------------------------------------------------------
> [DEBUG] Trace
> org.apache.maven.BuildFailureException: There are test failures.
>
> Please refer to
> /home/mwinter/workspace/arquillian-example/target/surefire-reports for the
> individual test results.
>    at
> org.apache.maven.lifecycle.DefaultLifecycleExecutor.executeGoals(DefaultLifecycleExecutor.java:715)
>    at
> org.apache.maven.lifecycle.DefaultLifecycleExecutor.executeGoalWithLifecycle(DefaultLifecycleExecutor.java:556)
>    at
> org.apache.maven.lifecycle.DefaultLifecycleExecutor.executeGoal(DefaultLifecycleExecutor.java:535)
>    at
> org.apache.maven.lifecycle.DefaultLifecycleExecutor.executeGoalAndHandleFailures(DefaultLifecycleExecutor.java:387)
>    at
> org.apache.maven.lifecycle.DefaultLifecycleExecutor.executeTaskSegments(DefaultLifecycleExecutor.java:348)
>    at
> org.apache.maven.lifecycle.DefaultLifecycleExecutor.execute(DefaultLifecycleExecutor.java:180)
>    at org.apache.maven.DefaultMaven.doExecute(DefaultMaven.java:328)
>    at org.apache.maven.DefaultMaven.execute(DefaultMaven.java:138)
>    at org.apache.maven.cli.MavenCli.main(MavenCli.java:362)
>    at
> org.apache.maven.cli.compat.CompatibleMain.main(CompatibleMain.java:60)
>    at sun.reflect.NativeMethodAccessorImpl.invoke0(Native Method)
>    at
> sun.reflect.NativeMethodAccessorImpl.invoke(NativeMethodAccessorImpl.java:39)
>    at
> sun.reflect.DelegatingMethodAccessorImpl.invoke(DelegatingMethodAccessorImpl.java:25)
>    at java.lang.reflect.Method.invoke(Method.java:597)
>    at org.codehaus.classworlds.Launcher.launchEnhanced(Launcher.java:315)
>    at org.codehaus.classworlds.Launcher.launch(Launcher.java:255)
>    at org.codehaus.classworlds.Launcher.mainWithExitCode(Launcher.java:430)
>    at org.codehaus.classworlds.Launcher.main(Launcher.java:375)
> Caused by: org.apache.maven.plugin.MojoFailureException: There are test
> failures.
>
> Please refer to
> /home/mwinter/workspace/arquillian-example/target/surefire-reports for the
> individual test results.
>    at
> org.apache.maven.plugin.surefire.SurefirePlugin.execute(SurefirePlugin.java:455)
>    at
> org.apache.maven.plugin.DefaultPluginManager.executeMojo(DefaultPluginManager.java:490)
>    at
> org.apache.maven.lifecycle.DefaultLifecycleExecutor.executeGoals(DefaultLifecycleExecutor.java:694)
>    ... 17 more
> [INFO]
> ------------------------------------------------------------------------
> [INFO] Total time: 3 seconds
> [INFO] Finished at: Wed Nov 03 21:58:30 CET 2010
> [INFO] Final Memory: 15M/151M
> [INFO]
> ------------------------------------------------------------------------
>
> Am 03.11.2010 12:21, schrieb Anders Hammar:
>
>> Well, posting the output could help. There ought to be something useful in
>> there...
>>
>> /Anders
>>
>> On Wed, Nov 3, 2010 at 11:44, Moritz Winter
>> <moritz.a.winter@googlemail.com>wrote:
>>
>>
>>
>>> Hi,
>>> thanks for the answer. This is a example-project especially aimed at
>>> setting up the test-envoirnment (JsfUnit + Arquillian) e.g. a
>>> proof-of-concept. Iam quite sure skipping some tests won't work because
>>> the
>>> chances are slim that the tests do actually run (no
>>> glassfish-embedded-starting up) and I'm quite positive that the error
>>> occurs
>>> in the test-initialization!
>>> I already tried the -X and -e parameters, they don't show me any
>>> error-messages! The last thing i could try is to set -Dmaven.repo.local
>>> to
>>> ensure that nothing in my local repository is causing trouble but i doubt
>>> this will help!
>>>
>>> Am 03.11.2010 10:12, schrieb Anders Hammar:
>>>
>>>  Weird. But executing
>>>
>>>
>>>> mvn clean test -X
>>>> will give you debug output and should give you some kind of hint what's
>>>> wrong.
>>>> At least, it will tell you which plugin is running into trouble (I
>>>> believe
>>>> it's the surefire-plugin based on your mail).
>>>>
>>>> You could also try skipping tests to narrow things down. There are
>>>> several
>>>> different ways:
>>>> mvn clean test -DskipTests
>>>> which will compile the tests but not execute them
>>>> mvn clean test -Dmaven.test.skip=true
>>>> which will even skip compilation of tests and some other related tasks
>>>>
>>>> Doing "clean" in all steps is just to ensure a full build now when you
>>>> are
>>>> having troubles. You shouldn't do this normally for every execution.
>>>> You could also delete your local repo to ensure there's nothing there
>>>> causing trouble.
>>>>
>>>> /Anders
>>>>
>>>> On Wed, Nov 3, 2010 at 08:02, Moritz Winter
>>>> <moritz.a.winter@googlemail.com>wrote:
>>>>
>>>>  Hi,
>>>>
>>>>
>>>>>
>>>>> First of all I would like to mention that this is my first post on this
>>>>> list, I hope that this question is posted in the right place. I have
>>>>> tried
>>>>> finding a solution for my problem, but it either doesn't exist, or my
>>>>> limited brain can't manage to figure out how to do it (I strongly hope
>>>>> it
>>>>> is
>>>>> the latter).
>>>>>
>>>>> If I call "mvn test" on a project of mine, the last lines show me the
>>>>> BuildFailureExeception and "Please refer to
>>>>> [..]/target/surefire-reports
>>>>> for
>>>>> the individual test results."
>>>>> Problem is, there isn't a directory "surefire-reports" in the target of
>>>>> the
>>>>> project. Adding -e and -X, trying -Dmaven.test.failure.ignore=true
>>>>> generated
>>>>> a empty report and -Dsurefire.useFile=false didnt help either. Any
>>>>> suggestions how to get to the root cause of the error?
>>>>>
>>>>> Used version is surefire 2.6, but i did try 2.2 - 2.6 and none worked!
>>>>>
>>>>> Project: http://rapidshare.com/files/428614057/arquillian-example.zip
>>>>>
>>>>>
>>>>>
>>>>> ---------------------------------------------------------------------
>>>>> To unsubscribe, e-mail: users-unsubscribe@maven.apache.org
>>>>> For additional commands, e-mail: users-help@maven.apache.org
>>>>>
>>>>>
>>>>>
>>>>>
>>>>>
>>>> ---------------------------------------------------------------------
>>> To unsubscribe, e-mail: users-unsubscribe@maven.apache.org
>>> For additional commands, e-mail: users-help@maven.apache.org
>>>
>>>
>>>
>>>
>>
>>
>
>
>
> ---------------------------------------------------------------------
> To unsubscribe, e-mail: users-unsubscribe@maven.apache.org
> For additional commands, e-mail: users-help@maven.apache.org
>
>

Mime
  • Unnamed multipart/alternative (inline, None, 0 bytes)
View raw message