maven-users mailing list archives

Site index · List index
Message view « Date » · « Thread »
Top « Date » · « Thread »
From "Dan Tran" <dant...@gmail.com>
Subject Re: maven and eclipse
Date Sun, 23 Sep 2007 16:01:59 GMT
this example works

https://svn.codehaus.org/mojo/trunk/mojo/pde-maven-plugin/src/it/m2eclipse/

please run that and use it as a base

also it is best to use the full eclipse sdk to do your build

-D

On 9/23/07, Dmitri Pissarenko <dmitri.pissarenko@gmail.com> wrote:
> Hello!
>
> Thanks for your answer!
>
> On 9/23/07, Dan Tran <dantran@gmail.com> wrote:
> > it seems the problem is here
> >
> > BUILD FAILED
> > d:\silverstrike\sw\cgv-editor\target\pdeBuilder\build.xml:8: Unable to find elem
> > ent: at.silverstrike.control.presentation.eclipsercp.cgveditor.
>
> Now I can execute mvn install, if I use this POM:
>
> <project xmlns="http://maven.apache.org/POM/4.0.0"
>  xmlns:xsi="http://www.w3.org/2001/XMLSchema-instance"
>  xsi:schemaLocation="http://maven.apache.org/POM/4.0.0
> http://maven.apache.org/maven-v4_0_0.xsd">
>  <modelVersion>4.0.0</modelVersion>
>  <groupId>at.silverstrike</groupId>
>  <artifactId>cgv-editor</artifactId>
>  <packaging>jar</packaging>
>  <name>CGV Editor Plug-in</name>
>  <version>1.0-SNAPSHOT</version>
>  <description>Plugin for editing the control goal vector</description>
>     <build>
>     <plugins>
>       <plugin>
>         <groupId>org.codehaus.mojo</groupId>
>         <artifactId>pde-maven-plugin</artifactId>
>         <extensions>true</extensions>
>         <configuration>
>           <eclipseInstall>D:\silverstrike\sw\eclipse-RCP-3.3\eclipse</eclipseInstall>
>         </configuration>
>       </plugin>
>     </plugins>
>   </build>
> </project>
>
> But when I change packaging from jar to zip, I'm getting these errors
> (mvn -X install):
>
> + Error stacktraces are turned on.
> Maven version: 2.0.7
> Java version: 1.5.0_06
> OS name: "windows xp" version: "5.1" arch: "x86"
> [DEBUG] Building Maven user-level plugin registry from: 'C:\Dokumente
> und Einstellungen\user\.m2\plugin-registry.xml'
> [DEBUG] Building Maven global-level plugin registry from:
> 'c:\Programme\maven-2.0.7\conf\plugin-registry.xml'
> [INFO] Scanning for projects...
> [DEBUG] pde-maven-plugin: resolved to version 1.0-alpha-1 from
> repository central
> [DEBUG] Retrieving parent-POM: org.codehaus.mojo:mojo::13 for project:
> null:pde-maven-plugin:maven-plugin:1.0-alpha-1 from the repository.
> [INFO] ----------------------------------------------------------------------------
> [INFO] Building CGV Editor Plug-in
> [INFO]    task-segment: [install]
> [INFO] ----------------------------------------------------------------------------
> [DEBUG] Error looking up lifecycle mapping to retrieve optional mojos.
> Lifecycle ID: default. Error: Component descriptor cannot be found in
> the component repository:
> org.apache.maven.lifecycle.mapping.LifecycleMappingzip.
> org.codehaus.plexus.component.repository.exception.ComponentLookupException:
> Component descriptor cannot be found in the component repository:
> org.apache.maven.lifecycle.mapping.LifecycleMappingzip.
>        at org.codehaus.plexus.DefaultPlexusContainer.lookup(DefaultPlexusContainer.java:323)
>        at org.codehaus.plexus.DefaultPlexusContainer.lookup(DefaultPlexusContainer.java:440)
>        at org.apache.maven.execution.MavenSession.lookup(MavenSession.java:123)
>        at org.apache.maven.lifecycle.DefaultLifecycleExecutor.findOptionalMojosForLifecycle(DefaultLifecycleExecutor.java:1111)
>        at org.apache.maven.lifecycle.DefaultLifecycleExecutor.bindLifecycleForPackaging(DefaultLifecycleExecutor.java:999)
>        at org.apache.maven.lifecycle.DefaultLifecycleExecutor.constructLifecycleMappings(DefaultLifecycleExecutor.java:980)
>        at org.apache.maven.lifecycle.DefaultLifecycleExecutor.executeGoal(DefaultLifecycleExecutor.java:458)
>        at org.apache.maven.lifecycle.DefaultLifecycleExecutor.executeGoalAndHandleFailures(DefaultLifecycleExecutor.java:311)
>        at org.apache.maven.lifecycle.DefaultLifecycleExecutor.executeTaskSegments(DefaultLifecycleExecutor.java:278)
>        at org.apache.maven.lifecycle.DefaultLifecycleExecutor.execute(DefaultLifecycleExecutor.java:143)
>        at org.apache.maven.DefaultMaven.doExecute(DefaultMaven.java:334)
>        at org.apache.maven.DefaultMaven.execute(DefaultMaven.java:125)
>        at org.apache.maven.cli.MavenCli.main(MavenCli.java:280)
>        at sun.reflect.NativeMethodAccessorImpl.invoke0(Native Method)
>        at sun.reflect.NativeMethodAccessorImpl.invoke(Unknown Source)
>        at sun.reflect.DelegatingMethodAccessorImpl.invoke(Unknown Source)
>        at java.lang.reflect.Method.invoke(Unknown Source)
>        at org.codehaus.classworlds.Launcher.launchEnhanced(Launcher.java:315)
>        at org.codehaus.classworlds.Launcher.launch(Launcher.java:255)
>        at org.codehaus.classworlds.Launcher.mainWithExitCode(Launcher.java:430)
>        at org.codehaus.classworlds.Launcher.main(Launcher.java:375)
> [DEBUG] maven-resources-plugin: resolved to version 2.2 from repository central
> [DEBUG] Retrieving parent-POM:
> org.apache.maven.plugins:maven-plugins::1 for project:
> null:maven-resources-plugin:maven-plugin:2.2 from the repository.
> [DEBUG] Retrieving parent-POM: org.apache.maven:maven-parent::1 for
> project: org.apache.maven.plugins:maven-plugins:pom:1 from the
> repository.
> [DEBUG] Retrieving parent-POM: org.apache:apache::1 for project:
> org.apache.maven:maven-parent:pom:1 from the repository.
> [DEBUG] maven-compiler-plugin: resolved to version 2.0.2 from repository central
> [DEBUG] Retrieving parent-POM:
> org.apache.maven.plugins:maven-plugins::8 for project:
> null:maven-compiler-plugin:maven-plugin:2.0.2 from the repository.
> [DEBUG] Retrieving parent-POM: org.apache.maven:maven-parent::5 for
> project: org.apache.maven.plugins:maven-plugins:pom:8 from the
> repository.
> [DEBUG] Retrieving parent-POM: org.apache:apache::3 for project:
> org.apache.maven:maven-parent:pom:5 from the repository.
> [DEBUG] maven-surefire-plugin: resolved to version 2.3 from repository central
> [DEBUG] Retrieving parent-POM: org.apache.maven.surefire:surefire::2.3
> for project: org.apache.maven.plugins:maven-surefire-plugin:maven-plugin:2.3
> from the repository.
> [DEBUG] maven-install-plugin: resolved to version 2.2 from repository central
> [DEBUG] at.silverstrike:cgv-editor:zip:1.0-SNAPSHOT (selected for null)
> [DEBUG] org.codehaus.mojo:pde-maven-plugin:maven-plugin:1.0-alpha-1:runtime
> (selected for runtime)
> [DEBUG] Retrieving parent-POM: org.apache.maven:maven::2.0.4 for
> project: null:maven-project:jar:2.0.4 from the repository.
> [DEBUG] Adding managed dependencies for unknown:maven-project
> [DEBUG]   org.codehaus.plexus:plexus-container-default:jar:1.0-alpha-9
> [DEBUG]   org.codehaus.plexus:plexus-utils:jar:1.1
> [DEBUG]   org.apache.maven.wagon:wagon-provider-api:jar:1.0-alpha-6
> [DEBUG]   org.apache.maven.wagon:wagon-ssh:jar:1.0-alpha-7
> [DEBUG]   org.apache.maven.wagon:wagon-ssh-external:jar:1.0-alpha-6
> [DEBUG]   org.apache.maven.wagon:wagon-file:jar:1.0-alpha-7
> [DEBUG]   org.apache.maven.wagon:wagon-http-lightweight:jar:1.0-alpha-6
> [DEBUG]   org.apache.maven:maven-project:jar:2.0.4:runtime (selected
> for runtime)
> [DEBUG] Adding managed dependencies for unknown:maven-settings
> [DEBUG]   org.codehaus.plexus:plexus-container-default:jar:1.0-alpha-9
> [DEBUG]   org.codehaus.plexus:plexus-utils:jar:1.1
> [DEBUG]   org.apache.maven.wagon:wagon-provider-api:jar:1.0-alpha-6
> [DEBUG]   org.apache.maven.wagon:wagon-ssh:jar:1.0-alpha-7
> [DEBUG]   org.apache.maven.wagon:wagon-ssh-external:jar:1.0-alpha-6
> [DEBUG]   org.apache.maven.wagon:wagon-file:jar:1.0-alpha-7
> [DEBUG]   org.apache.maven.wagon:wagon-http-lightweight:jar:1.0-alpha-6
> [DEBUG]     org.apache.maven:maven-settings:jar:2.0.4:runtime
> (selected for runtime)
> [DEBUG] Adding managed dependencies for org.apache.maven:maven-model
> [DEBUG]   org.codehaus.plexus:plexus-container-default:jar:1.0-alpha-9
> [DEBUG]   org.codehaus.plexus:plexus-utils:jar:1.1
> [DEBUG]   org.apache.maven.wagon:wagon-provider-api:jar:1.0-alpha-6
> [DEBUG]   org.apache.maven.wagon:wagon-ssh:jar:1.0-alpha-7
> [DEBUG]   org.apache.maven.wagon:wagon-ssh-external:jar:1.0-alpha-6
> [DEBUG]   org.apache.maven.wagon:wagon-file:jar:1.0-alpha-7
> [DEBUG]   org.apache.maven.wagon:wagon-http-lightweight:jar:1.0-alpha-6
> [DEBUG]       org.apache.maven:maven-model:jar:2.0.4:runtime (selected
> for runtime)
> [DEBUG] Retrieving parent-POM: org.codehaus.plexus:plexus::1.0.4 for
> project: null:plexus-utils:jar:1.1 from the repository.
> [DEBUG]         org.codehaus.plexus:plexus-utils:jar:1.1:runtime
> (selected for runtime)
> [DEBUG]       org.codehaus.plexus:plexus-utils:jar:1.1:runtime
> (selected for runtime)
> [DEBUG] Retrieving parent-POM:
> org.codehaus.plexus:plexus-containers::1.0.3 for project:
> null:plexus-container-default:jar:1.0-alpha-9 from the repository.
> [DEBUG]       org.codehaus.plexus:plexus-container-default:jar:1.0-alpha-9:runtime
> (selected for runtime)
> [DEBUG]         junit:junit:jar:3.8.1:runtime (selected for runtime)
> [DEBUG]         org.codehaus.plexus:plexus-utils:jar:1.0.4:runtime
> (removed - nearer found: 1.1)
> [DEBUG]         classworlds:classworlds:jar:1.1-alpha-2:runtime
> (selected for runtime)
> [DEBUG] Adding managed dependencies for unknown:maven-profile
> [DEBUG]   org.codehaus.plexus:plexus-container-default:jar:1.0-alpha-9
> [DEBUG]   org.codehaus.plexus:plexus-utils:jar:1.1
> [DEBUG]   org.apache.maven.wagon:wagon-provider-api:jar:1.0-alpha-6
> [DEBUG]   org.apache.maven.wagon:wagon-ssh:jar:1.0-alpha-7
> [DEBUG]   org.apache.maven.wagon:wagon-ssh-external:jar:1.0-alpha-6
> [DEBUG]   org.apache.maven.wagon:wagon-file:jar:1.0-alpha-7
> [DEBUG]   org.apache.maven.wagon:wagon-http-lightweight:jar:1.0-alpha-6
> [DEBUG]     org.apache.maven:maven-profile:jar:2.0.4:runtime (selected
> for runtime)
> [DEBUG]     org.apache.maven:maven-model:jar:2.0.4:runtime (selected
> for runtime)
> [DEBUG] Adding managed dependencies for org.apache.maven:maven-artifact-manager
> [DEBUG]   org.codehaus.plexus:plexus-container-default:jar:1.0-alpha-9
> [DEBUG]   org.codehaus.plexus:plexus-utils:jar:1.1
> [DEBUG]   org.apache.maven.wagon:wagon-provider-api:jar:1.0-alpha-6
> [DEBUG]   org.apache.maven.wagon:wagon-ssh:jar:1.0-alpha-7
> [DEBUG]   org.apache.maven.wagon:wagon-ssh-external:jar:1.0-alpha-6
> [DEBUG]   org.apache.maven.wagon:wagon-file:jar:1.0-alpha-7
> [DEBUG]   org.apache.maven.wagon:wagon-http-lightweight:jar:1.0-alpha-6
> [DEBUG]     org.apache.maven:maven-artifact-manager:jar:2.0.4:runtime
> (selected for runtime)
> [DEBUG] Adding managed dependencies for
> org.apache.maven:maven-repository-metadata
> [DEBUG]   org.codehaus.plexus:plexus-container-default:jar:1.0-alpha-9
> [DEBUG]   org.codehaus.plexus:plexus-utils:jar:1.1
> [DEBUG]   org.apache.maven.wagon:wagon-provider-api:jar:1.0-alpha-6
> [DEBUG]   org.apache.maven.wagon:wagon-ssh:jar:1.0-alpha-7
> [DEBUG]   org.apache.maven.wagon:wagon-ssh-external:jar:1.0-alpha-6
> [DEBUG]   org.apache.maven.wagon:wagon-file:jar:1.0-alpha-7
> [DEBUG]   org.apache.maven.wagon:wagon-http-lightweight:jar:1.0-alpha-6
> [DEBUG]       org.apache.maven:maven-repository-metadata:jar:2.0.4:runtime
> (selected for runtime)
> [DEBUG] Adding managed dependencies for org.apache.maven:maven-artifact
> [DEBUG]   org.codehaus.plexus:plexus-container-default:jar:1.0-alpha-9
> [DEBUG]   org.codehaus.plexus:plexus-utils:jar:1.1
> [DEBUG]   org.apache.maven.wagon:wagon-provider-api:jar:1.0-alpha-6
> [DEBUG]   org.apache.maven.wagon:wagon-ssh:jar:1.0-alpha-7
> [DEBUG]   org.apache.maven.wagon:wagon-ssh-external:jar:1.0-alpha-6
> [DEBUG]   org.apache.maven.wagon:wagon-file:jar:1.0-alpha-7
> [DEBUG]   org.apache.maven.wagon:wagon-http-lightweight:jar:1.0-alpha-6
> [DEBUG]       org.apache.maven:maven-artifact:jar:2.0.4:runtime
> (selected for runtime)
> [DEBUG] Retrieving parent-POM:
> org.apache.maven.wagon:wagon::1.0-alpha-6 for project:
> null:wagon-provider-api:jar:1.0-alpha-6 from the repository.
> [DEBUG] Adding managed dependencies for unknown:wagon-provider-api
> [DEBUG]   org.apache.maven.wagon:wagon-provider-api:jar:1.0-alpha-6
> [DEBUG]   org.apache.maven.wagon:wagon-provider-test:jar:1.0-alpha-6
> [DEBUG]   junit:junit:jar:3.8.1
> [DEBUG]   org.codehaus.plexus:plexus-container-default:jar:1.0-alpha-8
> [DEBUG]   org.codehaus.plexus:plexus-utils:jar:1.0.4
> [DEBUG]       org.apache.maven.wagon:wagon-provider-api:jar:1.0-alpha-6:runtime
> (selected for runtime)
> [DEBUG]         org.codehaus.plexus:plexus-utils:jar:1.0.4:runtime
> (removed - nearer found: 1.1)
> [DEBUG]     org.codehaus.plexus:plexus-utils:jar:1.1:runtime (selected
> for runtime)
> [DEBUG]     org.apache.maven:maven-artifact:jar:2.0.4:runtime
> (selected for runtime)
> [DEBUG]     org.codehaus.plexus:plexus-container-default:jar:1.0-alpha-9:runtime
> (selected for runtime)
> [DEBUG]       junit:junit:jar:3.8.1:runtime (selected for runtime)
> [DEBUG]       org.codehaus.plexus:plexus-utils:jar:1.0.4:runtime
> (removed - nearer found: 1.1)
> [DEBUG]       classworlds:classworlds:jar:1.1-alpha-2:runtime
> (selected for runtime)
> [DEBUG]   commons-configuration:commons-configuration:jar:1.3:runtime
> (selected for runtime)
> [DEBUG]     commons-collections:commons-collections:jar:3.1:runtime
> (selected for runtime)
> [DEBUG]     commons-lang:commons-lang:jar:2.1:runtime (selected for runtime)
> [DEBUG]     commons-logging:commons-logging-api:jar:1.0.4:runtime
> (selected for runtime)
> [DEBUG]     commons-digester:commons-digester:jar:1.6:runtime
> (selected for runtime)
> [DEBUG]       commons-beanutils:commons-beanutils:jar:1.6:runtime
> (selected for runtime)
> [DEBUG]         commons-logging:commons-logging:jar:1.0:runtime
> (selected for runtime)
> [DEBUG]
> commons-collections:commons-collections:jar:2.0:runtime (removed -
> nearer found: 3.1)
> [DEBUG]       commons-logging:commons-logging:jar:1.0:runtime
> (selected for runtime)
> [DEBUG]       commons-collections:commons-collections:jar:2.1:runtime
> (removed - nearer found: 3.1)
> [DEBUG]       xml-apis:xml-apis:jar:1.0.b2:runtime (selected for runtime)
> [DEBUG]     commons-beanutils:commons-beanutils-core:jar:1.7.0:runtime
> (selected for runtime)
> [DEBUG]       commons-collections:commons-collections:jar:2.0:runtime
> (removed - nearer found: 3.1)
> [DEBUG]     commons-codec:commons-codec:jar:1.3:runtime (selected for runtime)
> [DEBUG]     commons-jxpath:commons-jxpath:jar:1.2:runtime (selected for runtime)
> [DEBUG]       xerces:xerces:jar:1.2.3:runtime (selected for runtime)
> [DEBUG] While downloading servletapi:servletapi:2.2
>  This artifact has been relocated to javax.servlet:servlet-api:2.2.
>
>
> [DEBUG]       javax.servlet:servlet-api:jar:2.2:runtime (selected for runtime)
> [DEBUG]       junit:junit:jar:3.8:runtime (removed - nearer found: 3.8.1)
> [DEBUG]       ant:ant-optional:jar:1.5.1:runtime (selected for runtime)
> [DEBUG] While downloading xml-apis:xml-apis:2.0.2
>  This artifact has been relocated to xml-apis:xml-apis:1.0.b2.
>
>
> [DEBUG]       jdom:jdom:jar:b9:runtime (selected for runtime)
> [DEBUG]       commons-beanutils:commons-beanutils:jar:1.4:runtime
> (removed - nearer found: 1.6)
> [DEBUG]       commons-collections:commons-collections:jar:2.0:runtime
> (removed - nearer found: 3.1)
> [DEBUG] While downloading xerces:xerces:2.2.1
>  This artifact has been relocated to xerces:xercesImpl:2.2.1.
>
>
> [DEBUG]     xerces:xercesImpl:jar:2.2.1:runtime (selected for runtime)
> [DEBUG]     xalan:xalan:jar:2.7.0:runtime (selected for runtime)
> [DEBUG] While downloading xml-apis:xml-apis:2.0.2
>  This artifact has been relocated to xml-apis:xml-apis:1.0.b2.
>
>
> [DEBUG] While downloading xml-apis:xml-apis:2.0.2
>  This artifact has been relocated to xml-apis:xml-apis:1.0.b2.
>
>
> [DEBUG]     xml-apis:xml-apis:jar:1.0.b2:runtime (selected for runtime)
> [DEBUG] Adding managed dependencies for org.apache.maven:maven-plugin-api
> [DEBUG]   org.codehaus.plexus:plexus-container-default:jar:1.0-alpha-9
> [DEBUG]   org.codehaus.plexus:plexus-utils:jar:1.1
> [DEBUG]   org.apache.maven.wagon:wagon-provider-api:jar:1.0-alpha-6
> [DEBUG]   org.apache.maven.wagon:wagon-ssh:jar:1.0-alpha-7
> [DEBUG]   org.apache.maven.wagon:wagon-ssh-external:jar:1.0-alpha-6
> [DEBUG]   org.apache.maven.wagon:wagon-file:jar:1.0-alpha-7
> [DEBUG]   org.apache.maven.wagon:wagon-http-lightweight:jar:1.0-alpha-6
> [DEBUG]   org.apache.maven:maven-plugin-api:jar:2.0.4:runtime
> (selected for runtime)
> [DEBUG] Retrieving parent-POM: org.codehaus.plexus:plexus::1.0.5 for
> project: null:plexus-utils:jar:1.2 from the repository.
> [DEBUG]   org.codehaus.plexus:plexus-utils:jar:1.1:runtime (removed -
> nearer found: 1.2)
> [DEBUG]   org.codehaus.plexus:plexus-utils:jar:1.2:runtime (selected
> for runtime)
> [DEBUG] Configuring mojo
> 'org.codehaus.mojo:pde-maven-plugin:1.0-alpha-1:ext' -->
> [DEBUG]   (f) antDebug = false
> [DEBUG]   (f) antVerbose = false
> [DEBUG]   (f) eclipseInstall = D:\silverstrike\sw\eclipse-RCP-3.3\eclipse
> [DEBUG]   (f) pdeBuildConfigDirectory = buildConfiguration
> [DEBUG]   (f) pdeBuildTempFolder = d:\silverstrike\sw\cgv-editor\target\pdeTemp
> [DEBUG]   (f) pdeDirectory = d:\silverstrike\sw\cgv-editor
> [DEBUG]   (f) project = org.apache.maven.project.MavenProject@4e445de9
> [DEBUG] -- end configuration --
> [INFO] [pde:ext]
> [INFO] java -classpath
> D:\silverstrike\sw\eclipse-RCP-3.3\eclipse\startup.jar
> org.eclipse.core.launcher.Main -application
> org.eclipse.ant.core.antRunner -buildfile
> d:\silverstrike\sw\cgv-editor\target\pdeBuilder\build.xml
> [INFO] ------------------------------------------------------------------------
> [ERROR] BUILD ERROR
> [INFO] ------------------------------------------------------------------------
> [INFO] Error executing command line. Exit code:13
> [INFO] ------------------------------------------------------------------------
> [DEBUG] Trace
> org.apache.maven.lifecycle.LifecycleExecutionException: Error
> executing command line. Exit code:13
>        at org.apache.maven.lifecycle.DefaultLifecycleExecutor.executeGoals(DefaultLifecycleExecutor.java:564)
>        at org.apache.maven.lifecycle.DefaultLifecycleExecutor.executeGoalWithLifecycle(DefaultLifecycleExecutor.java:480)
>        at org.apache.maven.lifecycle.DefaultLifecycleExecutor.executeGoal(DefaultLifecycleExecutor.java:459)
>        at org.apache.maven.lifecycle.DefaultLifecycleExecutor.executeGoalAndHandleFailures(DefaultLifecycleExecutor.java:311)
>        at org.apache.maven.lifecycle.DefaultLifecycleExecutor.executeTaskSegments(DefaultLifecycleExecutor.java:278)
>        at org.apache.maven.lifecycle.DefaultLifecycleExecutor.execute(DefaultLifecycleExecutor.java:143)
>        at org.apache.maven.DefaultMaven.doExecute(DefaultMaven.java:334)
>        at org.apache.maven.DefaultMaven.execute(DefaultMaven.java:125)
>        at org.apache.maven.cli.MavenCli.main(MavenCli.java:280)
>        at sun.reflect.NativeMethodAccessorImpl.invoke0(Native Method)
>        at sun.reflect.NativeMethodAccessorImpl.invoke(Unknown Source)
>        at sun.reflect.DelegatingMethodAccessorImpl.invoke(Unknown Source)
>        at java.lang.reflect.Method.invoke(Unknown Source)
>        at org.codehaus.classworlds.Launcher.launchEnhanced(Launcher.java:315)
>        at org.codehaus.classworlds.Launcher.launch(Launcher.java:255)
>        at org.codehaus.classworlds.Launcher.mainWithExitCode(Launcher.java:430)
>        at org.codehaus.classworlds.Launcher.main(Launcher.java:375)
> Caused by: org.apache.maven.plugin.MojoExecutionException: Error
> executing command line. Exit code:13
>        at org.codehaus.mojo.pde.AbstractEclipsePDEMojo.executeCommandLine(AbstractEclipsePDEMojo.java:228)
>        at org.codehaus.mojo.pde.EclipsePDEMojo.execute(EclipsePDEMojo.java:99)
>        at org.codehaus.mojo.pde.EclipsePDEExtMojo.execute(EclipsePDEExtMojo.java:48)
>        at org.apache.maven.plugin.DefaultPluginManager.executeMojo(DefaultPluginManager.java:443)
>        at org.apache.maven.lifecycle.DefaultLifecycleExecutor.executeGoals(DefaultLifecycleExecutor.java:539)
>        ... 16 more
> [INFO] ------------------------------------------------------------------------
> [INFO] Total time: 4 seconds
> [INFO] Finished at: Sun Sep 23 17:18:52 CEST 2007
> [INFO] Final Memory: 4M/9M
> [INFO] ------------------------------------------------------------------------
>
> AFAIK PDE builder has some log file, where it writes detailed error
> message (see http://jira.codehaus.org/browse/MOJO-827).
>
> Where can I find this log file?
>
> TIA
>
> Dmitri Pissarenko
>
> --
> http://www.xing.com/profile/Dmitri_Pissarenko
> http://dapissarenko.blogspot.com/
>
> ---------------------------------------------------------------------
> To unsubscribe, e-mail: users-unsubscribe@maven.apache.org
> For additional commands, e-mail: users-help@maven.apache.org
>
>

---------------------------------------------------------------------
To unsubscribe, e-mail: users-unsubscribe@maven.apache.org
For additional commands, e-mail: users-help@maven.apache.org


Mime
View raw message