maven-users mailing list archives

Site index · List index
Message view « Date » · « Thread »
Top « Date » · « Thread »
From EP...@upstate.com
Subject Cactus Plugin Issues again
Date Tue, 03 Dec 2002 00:01:30 GMT
Hi all,

Using a fresh CVS checkout from Maven, my cactus tests have started failing.
I am running cactus:webapp, and all the imports of the cactus classes are
failing.  Do I need to define the cactus jar's in my project.xml?  I don't
seem to remember having to do that before. 

Here is my error:
    [unwar] Expanding: C:\portal\target\portal.war into
C:\portal\target\cactus\
portal
java:prepare-filesystem:

java:compile:

cactus:compile:
    [mkdir] Created dir: C:\portal\target\cactus\classes
    [javac] Compiling 1 source file to C:\portal\target\cactus\classes
    [javac] [ERROR]
C:\portal\src\test-cactus\com\upstate\customerservice\credit
cards\service\CactusTestJetspeedCreditCardTransactionService.java:63: cannot
res
olve symbol
    [javac] [ERROR] symbol  : class ServletTestCase
    [javac] [ERROR] location: package cactus
    [javac] [ERROR] import org.apache.cactus.ServletTestCase;
    [javac] [ERROR]                          ^
    [javac] [ERROR]
C:\portal\src\test-cactus\com\upstate\customerservice\credit
cards\service\CactusTestJetspeedCreditCardTransactionService.java:64: cannot
res
olve symbol
    [javac] [ERROR] symbol  : class WebRequest
    [javac] [ERROR] location: package cactus
    [javac] [ERROR] import org.apache.cactus.WebRequest;
    [javac] [ERROR]                          ^
    [javac] [ERROR]
C:\portal\src\test-cactus\com\upstate\customerservice\credit
cards\service\CactusTestJetspeedCreditCardTransactionService.java:83: cannot
res
olve symbol
    [javac] [ERROR] symbol  : class ServletTestCase
    [javac] [ERROR] location: class
com.upstate.customerservice.creditcards.serv
ice.CactusTestJetspeedCreditCardTransactionService
    [javac] [ERROR] public class
CactusTestJetspeedCreditCardTransactionService
extends ServletTestCase {
    [javac] [ERROR]
        ^
    [javac] [ERROR] Note:
C:\portal\src\test-cactus\com\upstate\customerservice\
creditcards\service\CactusTestJetspeedCreditCardTransactionService.java uses
or
overrides a deprecated API.
    [javac] [ERROR] Note: Recompile with -deprecation for details.
    [javac] [ERROR] 3 errors

[ERROR] BUILD FAILED
[ERROR] Compile failed; see the compiler error output for details.
Total time:  4 seconds


C:\portal>


Thanks,
Eric Pugh

Mime
  • Unnamed multipart/alternative (inline, None, 0 bytes)
View raw message