maven-users mailing list archives

Site index · List index
Message view « Date » · « Thread »
Top « Date » · « Thread »
From Brett Dargan <bdar...@iprimus.com.au>
Subject build-bootstrap fails building struts plugin?
Date Thu, 05 Dec 2002 06:11:53 GMT
on doing ant -f build-bootstrap.xml I get the following error:

   [exec] +----------------------------------------
     [exec] | Building Maven Struts Plugin
     [exec] +----------------------------------------
     [exec] clean:clean:
     [exec]     [delete] Deleting directory
/home/jdev01/work/cache2/jakarta-turbine-maven/src/plugins-build/struts/target

     [exec] clean:

     [exec] plugin:
     [exec] java:prepare-filesystem:
     [exec]     [mkdir] Created dir:
/home/jdev01/work/cache2/jakarta-turbine-maven/src/plugins-build/struts/target/classes

     [exec] java:compile:
     [exec]     [javac] Compiling 8 source files to
/home/jdev01/work/cache2/jakarta-turbine-maven/src/plugins-build/struts/target/classes
     [exec]     [javac] [ERROR] error: compiler message file broken:
key=compiler.err.sun.io.MalformedInputException arguments=null, null,
null, null, null, null, null
     [exec]     [javac] [ERROR] 1 error
     [exec] [ERROR] com.werken.werkz.UnattainableGoalException: Unable
to obtain goal [plugin] -- Compile failed; see the compiler error output
for details. File: null At tag <javac>: line: 54 column: 48
     [exec] [ERROR]     at com.werken.werkz.Goal.fire(Goal.java:639)
     [exec] [ERROR]     at com.werken.werkz.Goal.attain(Goal.java:568)
     [exec] [ERROR]     at
org.apache.maven.Maven.runGoals(Maven.java:467)
     [exec] [ERROR]     at
org.apache.maven.Maven.attainGoals(Maven.java:381)
     [exec] [ERROR]     at
org.apache.maven.jelly.tags.project.ReactorTag.doTag(ReactorTag.java:154)
     [exec] [ERROR]     at
org.apache.commons.jelly.impl.TagScript.run(TagScript.java:277)
     [exec] [ERROR]     at
org.apache.commons.jelly.impl.ScriptBlock.run(ScriptBlock.java:134)
     [exec] [ERROR]     at
org.apache.commons.jelly.TagSupport.invokeBody(TagSupport.java:193)
     [exec] [ERROR]     at
org.apache.commons.jelly.tags.werkz.GoalTag$1.performAction(GoalTag.java:119)
     [exec] [ERROR]     at com.werken.werkz.Goal.fire(Goal.java:632)
     [exec] [ERROR]     at com.werken.werkz.Goal.attain(Goal.java:568)
     [exec] [ERROR]     at
org.apache.maven.Maven.runGoals(Maven.java:467)
     [exec] [ERROR]     at
org.apache.maven.Maven.attainGoals(Maven.java:381)
     [exec] [ERROR]     at org.apache.maven.cli.App.doMain(App.java:551)
     [exec] [ERROR]     at org.apache.maven.cli.App.main(App.java:1096)
     [exec] [ERROR]     at java.lang.reflect.Method.invoke(Native
Method)
     [exec] [ERROR]     at
com.werken.forehead.Forehead.run(Forehead.java:543)
     [exec] [ERROR]     at
com.werken.forehead.Forehead.main(Forehead.java:573)
     [exec] [ERROR] org.apache.commons.jelly.JellyException: Compile
failed; see the compiler error output for details. File: null At tag
<javac>: line: 54 column: 48
     [exec] [ERROR]     at
org.apache.commons.jelly.impl.TagScript.handleException(TagScript.java:643)
     [exec] [ERROR]     at
org.apache.commons.jelly.impl.TagScript.run(TagScript.java:283)
     [exec] [ERROR]     at
org.apache.commons.jelly.impl.ScriptBlock.run(ScriptBlock.java:134)
     [exec] [ERROR]     at
org.apache.commons.jelly.TagSupport.invokeBody(TagSupport.java:193)
     [exec] [ERROR]     at
org.apache.commons.jelly.tags.core.WhenTag.doTag(WhenTag.java:97)
     [exec] [ERROR]     at
org.apache.commons.jelly.impl.TagScript.run(TagScript.java:277)
     [exec] [ERROR]     at
org.apache.commons.jelly.impl.ScriptBlock.run(ScriptBlock.java:134)
     [exec] [ERROR]     at
org.apache.commons.jelly.TagSupport.invokeBody(TagSupport.java:193)
     [exec] [ERROR]     at
org.apache.commons.jelly.tags.core.ChooseTag.doTag(ChooseTag.java:95)
     [exec] [ERROR]     at
org.apache.commons.jelly.impl.TagScript.run(TagScript.java:277)
     [exec] [ERROR]     at
org.apache.commons.jelly.impl.ScriptBlock.run(ScriptBlock.java:134)
     [exec] [ERROR]     at
org.apache.commons.jelly.TagSupport.invokeBody(TagSupport.java:193)
     [exec] [ERROR]     at
org.apache.commons.jelly.tags.werkz.GoalTag$1.performAction(GoalTag.java:119)
     [exec] [ERROR]     at com.werken.werkz.Goal.fire(Goal.java:632)
     [exec] [ERROR]     at com.werken.werkz.Goal.attain(Goal.java:568)
     [exec] [ERROR]     at
com.werken.werkz.Project.attainGoal(Project.java:111)
     [exec] [ERROR]     at
org.apache.commons.jelly.tags.werkz.AttainGoalTag.doTag(AttainGoalTag.java:117)
     [exec] [ERROR]     at
org.apache.maven.jelly.tags.LazyAttainGoalTag.doTag(LazyAttainGoalTag.java:107)
     [exec] [ERROR]     at
org.apache.commons.jelly.impl.TagScript.run(TagScript.java:277)
     [exec] [ERROR]     at
org.apache.commons.jelly.impl.ScriptBlock.run(ScriptBlock.java:134)
     [exec] [ERROR]     at
org.apache.commons.jelly.TagSupport.invokeBody(TagSupport.java:193)
     [exec] [ERROR]     at
org.apache.commons.jelly.tags.core.IfTag.doTag(IfTag.java:92)
     [exec] [ERROR]     at
org.apache.commons.jelly.impl.TagScript.run(TagScript.java:277)
     [exec] [ERROR]     at
org.apache.commons.jelly.impl.ScriptBlock.run(ScriptBlock.java:134)
     [exec] [ERROR]     at
org.apache.commons.jelly.TagSupport.invokeBody(TagSupport.java:193)
     [exec] [ERROR]     at
org.apache.commons.jelly.tags.werkz.GoalTag$1.performAction(GoalTag.java:119)
     [exec] [ERROR]     at com.werken.werkz.Goal.fire(Goal.java:632)
     [exec] [ERROR]     at com.werken.werkz.Goal.attain(Goal.java:568)
     [exec] [ERROR]     at
org.apache.maven.Maven.runGoals(Maven.java:467)
     [exec] [ERROR]     at
org.apache.maven.Maven.attainGoals(Maven.java:381)
     [exec] [ERROR]     at
org.apache.maven.jelly.tags.project.ReactorTag.doTag(ReactorTag.java:154)
     [exec] [ERROR]     at
org.apache.commons.jelly.impl.TagScript.run(TagScript.java:277)
     [exec] [ERROR]     at
org.apache.commons.jelly.impl.ScriptBlock.run(ScriptBlock.java:134)
     [exec] [ERROR]     at
org.apache.commons.jelly.TagSupport.invokeBody(TagSupport.java:193)
     [exec] [ERROR]     at
org.apache.commons.jelly.tags.werkz.GoalTag$1.performAction(GoalTag.java:119)
     [exec] [ERROR]     at com.werken.werkz.Goal.fire(Goal.java:632)
     [exec] [ERROR]     at com.werken.werkz.Goal.attain(Goal.java:568)
     [exec] [ERROR]     at
org.apache.maven.Maven.runGoals(Maven.java:467)
     [exec] [ERROR]     at
org.apache.maven.Maven.attainGoals(Maven.java:381)
     [exec] [ERROR]     at org.apache.maven.cli.App.doMain(App.java:551)
     [exec] [ERROR]     at org.apache.maven.cli.App.main(App.java:1096)
     [exec] [ERROR]     at java.lang.reflect.Method.invoke(Native
Method)
     [exec] [ERROR]     at
com.werken.forehead.Forehead.run(Forehead.java:543)
     [exec] [ERROR]     at
com.werken.forehead.Forehead.main(Forehead.java:573)
     [exec] Root cause
     [exec] [ERROR] Compile failed; see the compiler error output for
details.
     [exec] [ERROR]     at
org.apache.tools.ant.taskdefs.Javac.compile(Javac.java:842)
     [exec] [ERROR]     at
org.apache.tools.ant.taskdefs.Javac.execute(Javac.java:682)
     [exec] [ERROR]     at
org.apache.tools.ant.Task.perform(Task.java:317)
     [exec] [ERROR]     at
org.apache.commons.jelly.tags.ant.AntTag.doTag(AntTag.java:208)
     [exec] [ERROR]     at
org.apache.commons.jelly.impl.TagScript.run(TagScript.java:277)
     [exec] [ERROR]     at
org.apache.commons.jelly.impl.ScriptBlock.run(ScriptBlock.java:134)
     [exec] [ERROR]     at
org.apache.commons.jelly.TagSupport.invokeBody(TagSupport.java:193)
     [exec] [ERROR]     at
org.apache.commons.jelly.tags.core.WhenTag.doTag(WhenTag.java:97)
     [exec] [ERROR]     at
org.apache.commons.jelly.impl.TagScript.run(TagScript.java:277)
     [exec] [ERROR]     at
org.apache.commons.jelly.impl.ScriptBlock.run(ScriptBlock.java:134)
     [exec] [ERROR]     at
org.apache.commons.jelly.TagSupport.invokeBody(TagSupport.java:193)
     [exec] [ERROR]     at
org.apache.commons.jelly.tags.core.ChooseTag.doTag(ChooseTag.java:95)
     [exec] [ERROR]     at
org.apache.commons.jelly.impl.TagScript.run(TagScript.java:277)
     [exec] [ERROR]     at
org.apache.commons.jelly.impl.ScriptBlock.run(ScriptBlock.java:134)
     [exec] [ERROR]     at
org.apache.commons.jelly.TagSupport.invokeBody(TagSupport.java:193)
     [exec] [ERROR]     at
org.apache.commons.jelly.tags.werkz.GoalTag$1.performAction(GoalTag.java:119)
     [exec] [ERROR]     at com.werken.werkz.Goal.fire(Goal.java:632)
     [exec] [ERROR]     at com.werken.werkz.Goal.attain(Goal.java:568)
     [exec] [ERROR]     at
com.werken.werkz.Project.attainGoal(Project.java:111)
     [exec] [ERROR]     at
org.apache.commons.jelly.tags.werkz.AttainGoalTag.doTag(AttainGoalTag.java:117)
     [exec] [ERROR]     at
org.apache.maven.jelly.tags.LazyAttainGoalTag.doTag(LazyAttainGoalTag.java:107)
     [exec] [ERROR]     at
org.apache.commons.jelly.impl.TagScript.run(TagScript.java:277)
     [exec] [ERROR]     at
org.apache.commons.jelly.impl.ScriptBlock.run(ScriptBlock.java:134)
     [exec] [ERROR]     at
org.apache.commons.jelly.TagSupport.invokeBody(TagSupport.java:193)
     [exec] [ERROR]     at
org.apache.commons.jelly.tags.core.IfTag.doTag(IfTag.java:92)
     [exec] [ERROR]     at
org.apache.commons.jelly.impl.TagScript.run(TagScript.java:277)
     [exec] [ERROR]     at
org.apache.commons.jelly.impl.ScriptBlock.run(ScriptBlock.java:134)
     [exec] [ERROR]     at
org.apache.commons.jelly.TagSupport.invokeBody(TagSupport.java:193)
     [exec] [ERROR]     at
org.apache.commons.jelly.tags.werkz.GoalTag$1.performAction(GoalTag.java:119)
     [exec] [ERROR]     at com.werken.werkz.Goal.fire(Goal.java:632)
     [exec] [ERROR]     at com.werken.werkz.Goal.attain(Goal.java:568)
     [exec] [ERROR]     at
org.apache.maven.Maven.runGoals(Maven.java:467)
     [exec] [ERROR]     at
org.apache.maven.Maven.attainGoals(Maven.java:381)
     [exec] [ERROR]     at
org.apache.maven.jelly.tags.project.ReactorTag.doTag(ReactorTag.java:154)
     [exec] [ERROR]     at
org.apache.commons.jelly.impl.TagScript.run(TagScript.java:277)
     [exec] [ERROR]     at
org.apache.commons.jelly.impl.ScriptBlock.run(ScriptBlock.java:134)
     [exec] [ERROR]     at
org.apache.commons.jelly.TagSupport.invokeBody(TagSupport.java:193)
     [exec] [ERROR]     at
org.apache.commons.jelly.tags.werkz.GoalTag$1.performAction(GoalTag.java:119)
     [exec] [ERROR]     at com.werken.werkz.Goal.fire(Goal.java:632)
     [exec] [ERROR]     at com.werken.werkz.Goal.attain(Goal.java:568)
     [exec] [ERROR]     at
org.apache.maven.Maven.runGoals(Maven.java:467)
     [exec] [ERROR]     at
org.apache.maven.Maven.attainGoals(Maven.java:381)
     [exec] [ERROR]     at org.apache.maven.cli.App.doMain(App.java:551)
     [exec] [ERROR]     at org.apache.maven.cli.App.main(App.java:1096)
     [exec] [ERROR]     at java.lang.reflect.Method.invoke(Native
Method)
     [exec] [ERROR]     at
com.werken.forehead.Forehead.run(Forehead.java:543)
     [exec] [ERROR]     at
com.werken.forehead.Forehead.main(Forehead.java:573)

     [exec] [ERROR] BUILD FAILED

anyone seen this before?


Mime
View raw message