maven-scm-dev mailing list archives

Site index · List index
Message view « Date » · « Thread »
Top « Date » · « Thread »
From Torbjørn Smørgrav <tsmoerg...@stavanger.oilfield.slb.com>
Subject RE: [continuum] BUILD FAILURE: Maven SCM Bazaar Provider
Date Wed, 29 Mar 2006 09:09:40 GMT
I tried to build the provider with continuum and reproduced the failure
once.
After that initital failure - everything works fine.
I also reproduced it _once_ while manually running
the test suite on Linux and bzr 0.7 (out of 20 times with different
configurations of
OS, bzr versions and debug info).

I'm out of ideas here...

I saw that there was a Thread.sleep(1000) at the beginning of he
ChangeLogTckTest.
Why is that? Do we have any IO issues here?

Regards
Torbjørn


-----Original Message-----
From: Emmanuel Venisse [mailto:emmanuel@venisse.net]
Sent: 28. mars 2006 21:17
To: scm-dev@maven.apache.org
Subject: Re: [continuum] BUILD FAILURE: Maven SCM Bazaar Provider


The error is here :
http://ci.codehaus.org:8002/continuum/servlet/browse?file=80/target/surefire
-reports/org.apache.maven.scm.provider.bazaar.command.changelog.BazaarChange
LogCommandTckTest.txt

Emmanuel

Brett Porter a écrit :
> bzr seems to be correctly installed now. Anyone have any ideas on this
one?
>
> - Brett
>
> Continuum Build Server wrote:
>
>>Online report :
http://ci.codehaus.org/continuum-maven/servlet/continuum/target/ProjectBuild
.vm/view/ProjectBuild/id/80/buildId/490
>>Build statistics:
>>  State: Failed
>>  Previous State: Failed
>>  Started at: Tue, 28 Mar 2006 05:05:12 -0800
>>  Finished at: Tue, 28 Mar 2006 05:05:42 -0800
>>  Total time: 29s
>>  Build Trigger: Schedule
>>  Exit code: 1
>>  Building machine hostname: cheddar.simulalabs.com
>>  Operating system : Linux(unknown)
>>  Java version : 1.5.0_03(Sun Microsystems Inc.)
>>
>>Changes
>>         evenisse          Formatting
>>
/maven/scm/trunk/maven-scm-api/src/main/java/org/apache/maven/scm/command/ad
d/AddScmResult.java
>>
/maven/scm/trunk/maven-scm-plugin/src/main/java/org/apache/maven/scm/plugin/
AbstractScmMojo.java
>>
/maven/scm/trunk/maven-scm-providers/maven-scm-provider-bazaar/src/main/java
/org/apache/maven/scm/provider/bazaar/BazaarConfig.java
>>
/maven/scm/trunk/maven-scm-providers/maven-scm-provider-bazaar/src/main/java
/org/apache/maven/scm/provider/bazaar/BazaarUtils.java
>>
/maven/scm/trunk/maven-scm-providers/maven-scm-provider-bazaar/src/main/java
/org/apache/maven/scm/provider/bazaar/command/changelog/BazaarChangeLogComma
nd.java
>>
/maven/scm/trunk/maven-scm-providers/maven-scm-provider-bazaar/src/main/java
/org/apache/maven/scm/provider/bazaar/command/changelog/BazaarChangeLogConsu
mer.java
>>
/maven/scm/trunk/maven-scm-providers/maven-scm-provider-bazaar/src/main/java
/org/apache/maven/scm/provider/bazaar/command/diff/BazaarDiffConsumer.java
>>
/maven/scm/trunk/maven-scm-providers/maven-scm-provider-bazaar/src/test/java
/org/apache/maven/scm/provider/bazaar/BazaarTestUtils.java
>>
/maven/scm/trunk/maven-scm-providers/maven-scm-provider-bazaar/src/test/java
/org/apache/maven/scm/provider/bazaar/command/changelog/BazaarChangeLogConsu
merTest.java
>>
/maven/scm/trunk/maven-scm-providers/maven-scm-provider-clearcase/src/test/j
ava/org/apache/maven/scm/provider/clearcase/command/checkout/ClearCaseCheckO
utCommandTest.java
>>
/maven/scm/trunk/maven-scm-providers/maven-scm-provider-starteam/src/main/ja
va/org/apache/maven/scm/provider/starteam/command/changelog/StarteamChangeLo
gConsumer.java
>>
/maven/scm/trunk/maven-scm-providers/maven-scm-provider-starteam/src/test/ja
va/org/apache/maven/scm/provider/starteam/command/changelog/StarteamChangeLo
gConsumerTest.java
>>
/maven/scm/trunk/maven-scm-providers/maven-scm-providers-cvs/maven-scm-provi
der-cvs-commons/src/main/java/org/apache/maven/scm/provider/cvslib/AbstractC
vsScmProvider.java
>>
/maven/scm/trunk/maven-scm-providers/maven-scm-providers-cvs/maven-scm-provi
der-cvs-commons/src/main/java/org/apache/maven/scm/provider/cvslib/repositor
y/CvsScmProviderRepository.java
>>
/maven/scm/trunk/maven-scm-providers/maven-scm-providers-cvs/maven-scm-provi
der-cvs-commons/src/test/java/org/apache/maven/scm/provider/cvslib/repositor
y/CvsScmProviderRepositoryTest.java
>>
/maven/scm/trunk/maven-scm-providers/maven-scm-providers-svn/maven-scm-provi
der-svnexe/src/test/java/org/apache/maven/scm/provider/svn/svnexe/command/Sv
nCommandLineUtilsTest.java
>>
>>**************************************************************************
**
>>Output:
>>**************************************************************************
**
>>[INFO] Scanning for projects...
>>[INFO] -------------------------------------------------------------------
---------
>>[INFO] Building Maven SCM Bazaar Provider
>>[INFO]    task-segment: [clean, install]
>>[INFO] -------------------------------------------------------------------
---------
>>[INFO] [clean:clean]
>>[INFO] Deleting directory
/home/continuum/continuum-maven/working-directory/80/target
>>[INFO] Deleting directory
/home/continuum/continuum-maven/working-directory/80/target/classes
>>[INFO] Deleting directory
/home/continuum/continuum-maven/working-directory/80/target/test-classes
>>[INFO] [resources:resources]
>>[INFO] Using default encoding to copy filtered resources.
>>[INFO] [compiler:compile]
>>Compiling 20 source files to
/home/continuum/continuum-maven/working-directory/80/target/classes
>>[INFO] [resources:testResources]
>>[INFO] Using default encoding to copy filtered resources.
>>[INFO] [compiler:testCompile]
>>Compiling 8 source files to
/home/continuum/continuum-maven/working-directory/80/target/test-classes
>>[INFO] [surefire:test]
>>[INFO] Setting reports dir:
/home/continuum/continuum-maven/working-directory/80/target/surefire-reports
>>
>>-------------------------------------------------------
>> T E S T S
>>-------------------------------------------------------
>>[surefire] Running
org.apache.maven.scm.provider.bazaar.command.checkin.BazaarCheckInCommandTes
t
>>EXECUTING: bzr init
>>EXECUTING: bzr add
/home/continuum/continuum-maven/working-directory/80/target/test-branch/pom.
xml
/home/continuum/continuum-maven/working-directory/80/target/test-branch/read
me.txt
/home/continuum/continuum-maven/working-directory/80/target/test-branch/src/
main/java/Application.java
/home/continuum/continuum-maven/working-directory/80/target/test-branch/src/
test/java/Test.java
>>EXECUTING: bzr commit --message "Add files to test branch"
>>[INFO] Removing
/home/continuum/continuum-maven/working-directory/80/target/scm-test/working
-copy
>>[INFO] EXECUTING: bzr branch
/home/continuum/continuum-maven/working-directory/80/target/test-branch
/home/continuum/continuum-maven/working-directory/80/target/scm-test/working
-copy
>>[INFO] EXECUTING: bzr inventory
>>[INFO] EXECUTING: bzr add --no-recurse src/main/java/Foo.java
>>[INFO] [src/main/java/Foo.java:added]
>>[INFO] EXECUTING: bzr status
>>[INFO] [src/main/java/Foo.java:added]
>>[INFO] [readme.txt:modified]
>>[INFO] [src/main/java/Bar.java:unknown]
>>[INFO] EXECUTING: bzr commit --message "Commit message"
>>[INFO] EXECUTING: bzr push
/home/continuum/continuum-maven/working-directory/80/target/test-branch
>>[INFO] Removing
/home/continuum/continuum-maven/working-directory/80/target/scm-test/asserti
on-copy
>>[INFO] EXECUTING: bzr branch
/home/continuum/continuum-maven/working-directory/80/target/test-branch
/home/continuum/continuum-maven/working-directory/80/target/scm-test/asserti
on-copy
>>[INFO] EXECUTING: bzr inventory
>>EXECUTING: bzr init
>>EXECUTING: bzr add
/home/continuum/continuum-maven/working-directory/80/target/test-branch/pom.
xml
/home/continuum/continuum-maven/working-directory/80/target/test-branch/read
me.txt
/home/continuum/continuum-maven/working-directory/80/target/test-branch/src/
main/java/Application.java
/home/continuum/continuum-maven/working-directory/80/target/test-branch/src/
test/java/Test.java
>>EXECUTING: bzr commit --message "Add files to test branch"
>>[INFO] Removing
/home/continuum/continuum-maven/working-directory/80/target/scm-test/working
-copy
>>[INFO] EXECUTING: bzr branch
/home/continuum/continuum-maven/working-directory/80/target/test-branch
/home/continuum/continuum-maven/working-directory/80/target/scm-test/working
-copy
>>[INFO] EXECUTING: bzr inventory
>>[INFO] EXECUTING: bzr add --no-recurse src/main/java/Foo.java
>>[INFO] [src/main/java/Foo.java:added]
>>[INFO] EXECUTING: bzr commit --message "Commit message"
src/main/java/Foo.java
>>[INFO] EXECUTING: bzr push
/home/continuum/continuum-maven/working-directory/80/target/test-branch
>>[INFO] Removing
/home/continuum/continuum-maven/working-directory/80/target/scm-test/asserti
on-copy
>>[INFO] EXECUTING: bzr branch
/home/continuum/continuum-maven/working-directory/80/target/test-branch
/home/continuum/continuum-maven/working-directory/80/target/scm-test/asserti
on-copy
>>[INFO] EXECUTING: bzr inventory
>>[surefire] Tests run: 2, Failures: 0, Errors: 0, Time elapsed: 8.089 sec
>>[surefire] Running
org.apache.maven.scm.provider.bazaar.command.checkout.BazaarCheckOutCommandT
est
>>EXECUTING: bzr init
>>EXECUTING: bzr add
/home/continuum/continuum-maven/working-directory/80/target/test-branch/pom.
xml
/home/continuum/continuum-maven/working-directory/80/target/test-branch/read
me.txt
/home/continuum/continuum-maven/working-directory/80/target/test-branch/src/
main/java/Application.java
/home/continuum/continuum-maven/working-directory/80/target/test-branch/src/
test/java/Test.java
>>EXECUTING: bzr commit --message "Add files to test branch"
>>[INFO] Removing
/home/continuum/continuum-maven/working-directory/80/target/scm-test/working
-copy
>>[INFO] EXECUTING: bzr branch
/home/continuum/continuum-maven/working-directory/80/target/test-branch
/home/continuum/continuum-maven/working-directory/80/target/scm-test/working
-copy
>>[INFO] EXECUTING: bzr inventory
>>[INFO] Removing
/home/continuum/continuum-maven/working-directory/80/target/scm-test/working
-copy
>>[INFO] EXECUTING: bzr branch
/home/continuum/continuum-maven/working-directory/80/target/test-branch
/home/continuum/continuum-maven/working-directory/80/target/scm-test/working
-copy
>>[INFO] EXECUTING: bzr inventory
>>[surefire] Tests run: 1, Failures: 0, Errors: 0, Time elapsed: 1.289 sec
>>[surefire] Running
org.apache.maven.scm.provider.bazaar.command.status.BazaarStatusCommandTest
>>EXECUTING: bzr init
>>EXECUTING: bzr add
/home/continuum/continuum-maven/working-directory/80/target/test-branch/pom.
xml
/home/continuum/continuum-maven/working-directory/80/target/test-branch/read
me.txt
/home/continuum/continuum-maven/working-directory/80/target/test-branch/src/
main/java/Application.java
/home/continuum/continuum-maven/working-directory/80/target/test-branch/src/
test/java/Test.java
>>EXECUTING: bzr commit --message "Add files to test branch"
>>[INFO] Removing
/home/continuum/continuum-maven/working-directory/80/target/scm-test/working
-copy
>>[INFO] EXECUTING: bzr branch
/home/continuum/continuum-maven/working-directory/80/target/test-branch
/home/continuum/continuum-maven/working-directory/80/target/scm-test/working
-copy
>>[INFO] EXECUTING: bzr inventory
>>[INFO] Removing
/home/continuum/continuum-maven/working-directory/80/target/scm-test/updatin
g-copy
>>[INFO] EXECUTING: bzr branch
/home/continuum/continuum-maven/working-directory/80/target/test-branch
/home/continuum/continuum-maven/working-directory/80/target/scm-test/updatin
g-copy
>>[INFO] EXECUTING: bzr inventory
>>[INFO] EXECUTING: bzr add --no-recurse project.xml
>>[INFO] [project.xml:added]
>>[INFO] EXECUTING: bzr status
>>[INFO] [project.xml:added]
>>[INFO] [readme.txt:modified]
>>[INFO] EXECUTING: bzr commit --message "No msg"
>>[INFO] EXECUTING: bzr push
/home/continuum/continuum-maven/working-directory/80/target/test-branch
>>[INFO] EXECUTING: bzr add --no-recurse src/test/java/org
>>[INFO] [src/test/java/org:added]
>>[INFO] EXECUTING: bzr add --no-recurse src/main/java/org
>>[INFO] [src/main/java/org:added]
>>[INFO] EXECUTING: bzr add --no-recurse src/main/java/org/Foo.java
>>[INFO] [src/main/java/org/Foo.java:added]
>>[INFO] EXECUTING: bzr status
>>[INFO] New directory added:
/home/continuum/continuum-maven/working-directory/80/target/scm-test/updatin
g-copy/src/main/java/org
>>[INFO] [src/main/java/org/Foo.java:added]
>>[INFO] New directory added:
/home/continuum/continuum-maven/working-directory/80/target/scm-test/updatin
g-copy/src/test/java/org
>>[INFO] [pom.xml:modified]
>>[surefire] Tests run: 1, Failures: 0, Errors: 0, Time elapsed: 2.921 sec
>>[surefire] Running
org.apache.maven.scm.provider.bazaar.command.diff.BazaarDiffCommandTest
>>EXECUTING: bzr init
>>EXECUTING: bzr add
/home/continuum/continuum-maven/working-directory/80/target/test-branch/pom.
xml
/home/continuum/continuum-maven/working-directory/80/target/test-branch/read
me.txt
/home/continuum/continuum-maven/working-directory/80/target/test-branch/src/
main/java/Application.java
/home/continuum/continuum-maven/working-directory/80/target/test-branch/src/
test/java/Test.java
>>EXECUTING: bzr commit --message "Add files to test branch"
>>[INFO] Removing
/home/continuum/continuum-maven/working-directory/80/target/scm-test/working
-copy
>>[INFO] EXECUTING: bzr branch
/home/continuum/continuum-maven/working-directory/80/target/test-branch
/home/continuum/continuum-maven/working-directory/80/target/scm-test/working
-copy
>>[INFO] EXECUTING: bzr inventory
>>[INFO] EXECUTING: bzr add --no-recurse project.xml
>>[INFO] [project.xml:added]
>>[INFO] EXECUTING: bzr add --no-recurse src/test/java/org
>>[INFO] [src/test/java/org:added]
>>[INFO] EXECUTING: bzr add --no-recurse src/main/java/org
>>[INFO] [src/main/java/org:added]
>>[INFO] EXECUTING: bzr add --no-recurse src/main/java/org/Foo.java
>>[INFO] [src/main/java/org/Foo.java:added]
>>[INFO] EXECUTING: bzr diff
>>[surefire] Tests run: 1, Failures: 0, Errors: 0, Time elapsed: 1.761 sec
>>[surefire] Running
org.apache.maven.scm.provider.bazaar.command.update.BazaarUpdateCommandTest
>>EXECUTING: bzr init
>>EXECUTING: bzr add
/home/continuum/continuum-maven/working-directory/80/target/test-branch/pom.
xml
/home/continuum/continuum-maven/working-directory/80/target/test-branch/read
me.txt
/home/continuum/continuum-maven/working-directory/80/target/test-branch/src/
main/java/Application.java
/home/continuum/continuum-maven/working-directory/80/target/test-branch/src/
test/java/Test.java
>>EXECUTING: bzr commit --message "Add files to test branch"
>>[INFO] Removing
/home/continuum/continuum-maven/working-directory/80/target/scm-test/working
-copy
>>[INFO] EXECUTING: bzr branch
/home/continuum/continuum-maven/working-directory/80/target/test-branch
/home/continuum/continuum-maven/working-directory/80/target/scm-test/working
-copy
>>[INFO] EXECUTING: bzr inventory
>>[INFO] Removing
/home/continuum/continuum-maven/working-directory/80/target/scm-test/updatin
g-copy
>>[INFO] EXECUTING: bzr branch
/home/continuum/continuum-maven/working-directory/80/target/test-branch
/home/continuum/continuum-maven/working-directory/80/target/scm-test/updatin
g-copy
>>[INFO] EXECUTING: bzr inventory
>>[INFO] EXECUTING: bzr add --no-recurse project.xml
>>[INFO] [project.xml:added]
>>[INFO] EXECUTING: bzr add --no-recurse src/test/java/org
>>[INFO] [src/test/java/org:added]
>>[INFO] EXECUTING: bzr add --no-recurse src/main/java/org
>>[INFO] [src/main/java/org:added]
>>[INFO] EXECUTING: bzr add --no-recurse src/main/java/org/Foo.java
>>[INFO] [src/main/java/org/Foo.java:added]
>>[INFO] EXECUTING: bzr status
>>[INFO] [project.xml:added]
>>[INFO] New directory added:
/home/continuum/continuum-maven/working-directory/80/target/scm-test/working
-copy/src/main/java/org
>>[INFO] [src/main/java/org/Foo.java:added]
>>[INFO] New directory added:
/home/continuum/continuum-maven/working-directory/80/target/scm-test/working
-copy/src/test/java/org
>>[INFO] [readme.txt:modified]
>>[INFO] EXECUTING: bzr commit --message "No msg"
>>[INFO] EXECUTING: bzr push
/home/continuum/continuum-maven/working-directory/80/target/test-branch
>>[INFO] EXECUTING: bzr pull
>>[INFO] EXECUTING: bzr revno
>>[INFO] EXECUTING: bzr diff --revision 1
>>[INFO] EXECUTING: bzr log --verbose
>>	<changelog-entry>
>>		<date pattern="yyyy-MM-dd">2006-03-28</date>
>>		<time pattern="HH:mm:ss">05:05:38</time>
>>		<author><![CDATA[continuum
<continuum@cheddar.simulalabs.com>]]></author>
>>		<file>
>>			<name>project.xml</name>
>>			<revision>2</revision>
>>		</file>
>>		<file>
>>			<name>src/main/java/org/</name>
>>			<revision>2</revision>
>>		</file>
>>		<file>
>>			<name>src/main/java/org/Foo.java</name>
>>			<revision>2</revision>
>>		</file>
>>		<file>
>>			<name>src/test/java/org/</name>
>>			<revision>2</revision>
>>		</file>
>>		<file>
>>			<name>readme.txt</name>
>>			<revision>2</revision>
>>		</file>
>>		<msg><![CDATA[No msg]]></msg>
>>	</changelog-entry>
>>
>>[surefire] Tests run: 1, Failures: 0, Errors: 0, Time elapsed: 4.862 sec
>>[surefire] Running
org.apache.maven.scm.provider.bazaar.command.changelog.BazaarChangeLogComman
dTckTest
>>EXECUTING: bzr init
>>EXECUTING: bzr add
/home/continuum/continuum-maven/working-directory/80/target/test-branch/pom.
xml
/home/continuum/continuum-maven/working-directory/80/target/test-branch/read
me.txt
/home/continuum/continuum-maven/working-directory/80/target/test-branch/src/
main/java/Application.java
/home/continuum/continuum-maven/working-directory/80/target/test-branch/src/
test/java/Test.java
>>EXECUTING: bzr commit --message "Add files to test branch"
>>[INFO] Removing
/home/continuum/continuum-maven/working-directory/80/target/scm-test/working
-copy
>>[INFO] EXECUTING: bzr branch
/home/continuum/continuum-maven/working-directory/80/target/test-branch
/home/continuum/continuum-maven/working-directory/80/target/scm-test/working
-copy
>>[INFO] EXECUTING: bzr inventory
>>[INFO] EXECUTING: bzr log --verbose
>>[INFO] EXECUTING: bzr status
>>[INFO] [readme.txt:modified]
>>[INFO] EXECUTING: bzr commit --message "Second changelog"
>>[INFO] EXECUTING: bzr push
/home/continuum/continuum-maven/working-directory/80/target/test-branch
>>[INFO] EXECUTING: bzr log --verbose
>>[INFO] EXECUTING: bzr log --verbose
>>[surefire] Tests run: 1, Failures: 1, Errors: 0, Time elapsed: 3.115 sec
<<<<<<<< FAILURE !!
>>[surefire] Running
org.apache.maven.scm.provider.bazaar.command.changelog.BazaarChangeLogConsum
erTest
>>[surefire] Tests run: 1, Failures: 0, Errors: 0, Time elapsed: 0.031 sec
>>[INFO] -------------------------------------------------------------------
---------
>>[ERROR] BUILD ERROR
>>[INFO] -------------------------------------------------------------------
---------
>>[INFO] There are test failures.
>>[INFO] -------------------------------------------------------------------
---------
>>[INFO] For more information, run Maven with the -e switch
>>[INFO] -------------------------------------------------------------------
---------
>>[INFO] Total time: 28 seconds
>>[INFO] Finished at: Tue Mar 28 05:05:42 PST 2006
>>[INFO] Final Memory: 7M/159M
>>[INFO] -------------------------------------------------------------------
---------
>>
>>**************************************************************************
**
>>
>>
>
>
>
>



Mime
View raw message