maven-notifications mailing list archives

Site index · List index
Message view « Date » · « Thread »
Top « Date » · « Thread »
From Apache Jenkins Server <jenk...@builds.apache.org>
Subject Build unstable in Jenkins: Maven TLP » maven-changes-plugin » ht #5
Date Tue, 07 Apr 2020 15:54:40 GMT
See https://builds.apache.org/job/maven-box/job/maven-changes-plugin/job/ht/5/

Changes:

* exclude broken jenkins-win-he-de-1 node

8 tests failed.
FAILED:  org.apache.maven.plugins.jira.JiraUnicodeTestCase.linux-jdk7-m3.2.x_build / Build
linux-jdk7-m3.2.x_build / testUnicodeReport

Error Message:
Couldn't resolve the skin.

Stack Trace:
org.apache.maven.plugin.MojoExecutionException: Couldn't resolve the skin.
	at org.apache.maven.plugins.jira.JiraUnicodeTestCase.testUnicodeReport(JiraUnicodeTestCase.java:76)
Caused by: org.apache.maven.shared.transfer.artifact.resolve.ArtifactResolverException: Failed
to read artifact descriptor for org.apache.maven.skins:maven-default-skin:jar:1.0
	at org.apache.maven.plugins.jira.JiraUnicodeTestCase.testUnicodeReport(JiraUnicodeTestCase.java:76)
Caused by: org.sonatype.aether.resolution.ArtifactDescriptorException: Failed to read artifact
descriptor for org.apache.maven.skins:maven-default-skin:jar:1.0
	at org.apache.maven.plugins.jira.JiraUnicodeTestCase.testUnicodeReport(JiraUnicodeTestCase.java:76)
Caused by: org.sonatype.aether.resolution.ArtifactResolutionException: Could not transfer
artifact org.apache.maven.skins:maven-default-skin:pom:1.0 from/to central (https://repo.maven.apache.org/maven2):
Received fatal alert: protocol_version
	at org.apache.maven.plugins.jira.JiraUnicodeTestCase.testUnicodeReport(JiraUnicodeTestCase.java:76)
Caused by: org.sonatype.aether.transfer.ArtifactTransferException: Could not transfer artifact
org.apache.maven.skins:maven-default-skin:pom:1.0 from/to central (https://repo.maven.apache.org/maven2):
Received fatal alert: protocol_version
Caused by: org.apache.maven.wagon.TransferFailedException: Received fatal alert: protocol_version
Caused by: javax.net.ssl.SSLException: Received fatal alert: protocol_version


FAILED:  org.apache.maven.plugins.jira.JiraUnicodeTestCase.linux-jdk7-m3.5.x_build / Build
linux-jdk7-m3.5.x_build / testUnicodeReport

Error Message:
Couldn't resolve the skin.

Stack Trace:
org.apache.maven.plugin.MojoExecutionException: Couldn't resolve the skin.
	at org.apache.maven.plugins.jira.JiraUnicodeTestCase.testUnicodeReport(JiraUnicodeTestCase.java:76)
Caused by: org.apache.maven.shared.transfer.artifact.resolve.ArtifactResolverException: Failed
to read artifact descriptor for org.apache.maven.skins:maven-default-skin:jar:1.0
	at org.apache.maven.plugins.jira.JiraUnicodeTestCase.testUnicodeReport(JiraUnicodeTestCase.java:76)
Caused by: org.sonatype.aether.resolution.ArtifactDescriptorException: Failed to read artifact
descriptor for org.apache.maven.skins:maven-default-skin:jar:1.0
	at org.apache.maven.plugins.jira.JiraUnicodeTestCase.testUnicodeReport(JiraUnicodeTestCase.java:76)
Caused by: org.sonatype.aether.resolution.ArtifactResolutionException: Could not transfer
artifact org.apache.maven.skins:maven-default-skin:pom:1.0 from/to central (https://repo.maven.apache.org/maven2):
Received fatal alert: protocol_version
	at org.apache.maven.plugins.jira.JiraUnicodeTestCase.testUnicodeReport(JiraUnicodeTestCase.java:76)
Caused by: org.sonatype.aether.transfer.ArtifactTransferException: Could not transfer artifact
org.apache.maven.skins:maven-default-skin:pom:1.0 from/to central (https://repo.maven.apache.org/maven2):
Received fatal alert: protocol_version
Caused by: org.apache.maven.wagon.TransferFailedException: Received fatal alert: protocol_version
Caused by: javax.net.ssl.SSLException: Received fatal alert: protocol_version


FAILED:  org.apache.maven.plugins.jira.JiraUnicodeTestCase.linux-jdk7-m3.6.x_build / Build
linux-jdk7-m3.6.x_build / testUnicodeReport

Error Message:
Couldn't resolve the skin.

Stack Trace:
org.apache.maven.plugin.MojoExecutionException: Couldn't resolve the skin.
	at org.apache.maven.plugins.jira.JiraUnicodeTestCase.testUnicodeReport(JiraUnicodeTestCase.java:76)
Caused by: org.apache.maven.shared.transfer.artifact.resolve.ArtifactResolverException: Failed
to read artifact descriptor for org.apache.maven.skins:maven-default-skin:jar:1.0
	at org.apache.maven.plugins.jira.JiraUnicodeTestCase.testUnicodeReport(JiraUnicodeTestCase.java:76)
Caused by: org.sonatype.aether.resolution.ArtifactDescriptorException: Failed to read artifact
descriptor for org.apache.maven.skins:maven-default-skin:jar:1.0
	at org.apache.maven.plugins.jira.JiraUnicodeTestCase.testUnicodeReport(JiraUnicodeTestCase.java:76)
Caused by: org.sonatype.aether.resolution.ArtifactResolutionException: Could not transfer
artifact org.apache.maven.skins:maven-default-skin:pom:1.0 from/to central (https://repo.maven.apache.org/maven2):
Received fatal alert: protocol_version
	at org.apache.maven.plugins.jira.JiraUnicodeTestCase.testUnicodeReport(JiraUnicodeTestCase.java:76)
Caused by: org.sonatype.aether.transfer.ArtifactTransferException: Could not transfer artifact
org.apache.maven.skins:maven-default-skin:pom:1.0 from/to central (https://repo.maven.apache.org/maven2):
Received fatal alert: protocol_version
Caused by: org.apache.maven.wagon.TransferFailedException: Received fatal alert: protocol_version
Caused by: javax.net.ssl.SSLException: Received fatal alert: protocol_version


FAILED:  org.apache.maven.plugins.jira.JiraUnicodeTestCase.linux-jdk7-m3.3.x_build / Build
linux-jdk7-m3.3.x_build / testUnicodeReport

Error Message:
Couldn't resolve the skin.

Stack Trace:
org.apache.maven.plugin.MojoExecutionException: Couldn't resolve the skin.
	at org.apache.maven.plugins.jira.JiraUnicodeTestCase.testUnicodeReport(JiraUnicodeTestCase.java:76)
Caused by: org.apache.maven.shared.transfer.artifact.resolve.ArtifactResolverException: Failed
to read artifact descriptor for org.apache.maven.skins:maven-default-skin:jar:1.0
	at org.apache.maven.plugins.jira.JiraUnicodeTestCase.testUnicodeReport(JiraUnicodeTestCase.java:76)
Caused by: org.sonatype.aether.resolution.ArtifactDescriptorException: Failed to read artifact
descriptor for org.apache.maven.skins:maven-default-skin:jar:1.0
	at org.apache.maven.plugins.jira.JiraUnicodeTestCase.testUnicodeReport(JiraUnicodeTestCase.java:76)
Caused by: org.sonatype.aether.resolution.ArtifactResolutionException: Could not transfer
artifact org.apache.maven.skins:maven-default-skin:pom:1.0 from/to central (https://repo.maven.apache.org/maven2):
Received fatal alert: protocol_version
	at org.apache.maven.plugins.jira.JiraUnicodeTestCase.testUnicodeReport(JiraUnicodeTestCase.java:76)
Caused by: org.sonatype.aether.transfer.ArtifactTransferException: Could not transfer artifact
org.apache.maven.skins:maven-default-skin:pom:1.0 from/to central (https://repo.maven.apache.org/maven2):
Received fatal alert: protocol_version
Caused by: org.apache.maven.wagon.TransferFailedException: Received fatal alert: protocol_version
Caused by: javax.net.ssl.SSLException: Received fatal alert: protocol_version


FAILED:  org.apache.maven.plugins.jira.JiraUnicodeTestCase.windows-jdk7-m3.2.x_build / Build
windows-jdk7-m3.2.x_build / testUnicodeReport

Error Message:
Couldn't resolve the skin.

Stack Trace:
org.apache.maven.plugin.MojoExecutionException: Couldn't resolve the skin.
	at org.apache.maven.plugins.jira.JiraUnicodeTestCase.testUnicodeReport(JiraUnicodeTestCase.java:76)
Caused by: org.apache.maven.shared.transfer.artifact.resolve.ArtifactResolverException: Failed
to read artifact descriptor for org.apache.maven.skins:maven-default-skin:jar:1.0
	at org.apache.maven.plugins.jira.JiraUnicodeTestCase.testUnicodeReport(JiraUnicodeTestCase.java:76)
Caused by: org.sonatype.aether.resolution.ArtifactDescriptorException: Failed to read artifact
descriptor for org.apache.maven.skins:maven-default-skin:jar:1.0
	at org.apache.maven.plugins.jira.JiraUnicodeTestCase.testUnicodeReport(JiraUnicodeTestCase.java:76)
Caused by: org.sonatype.aether.resolution.ArtifactResolutionException: Could not transfer
artifact org.apache.maven.skins:maven-default-skin:pom:1.0 from/to central (https://repo.maven.apache.org/maven2):
Received fatal alert: protocol_version
	at org.apache.maven.plugins.jira.JiraUnicodeTestCase.testUnicodeReport(JiraUnicodeTestCase.java:76)
Caused by: org.sonatype.aether.transfer.ArtifactTransferException: Could not transfer artifact
org.apache.maven.skins:maven-default-skin:pom:1.0 from/to central (https://repo.maven.apache.org/maven2):
Received fatal alert: protocol_version
Caused by: org.apache.maven.wagon.TransferFailedException: Received fatal alert: protocol_version
Caused by: javax.net.ssl.SSLException: Received fatal alert: protocol_version


FAILED:  org.apache.maven.plugins.jira.JiraUnicodeTestCase.windows-jdk7-m3.3.x_build / Build
windows-jdk7-m3.3.x_build / testUnicodeReport

Error Message:
Couldn't resolve the skin.

Stack Trace:
org.apache.maven.plugin.MojoExecutionException: Couldn't resolve the skin.
	at org.apache.maven.plugins.jira.JiraUnicodeTestCase.testUnicodeReport(JiraUnicodeTestCase.java:76)
Caused by: org.apache.maven.shared.transfer.artifact.resolve.ArtifactResolverException: Failed
to read artifact descriptor for org.apache.maven.skins:maven-default-skin:jar:1.0
	at org.apache.maven.plugins.jira.JiraUnicodeTestCase.testUnicodeReport(JiraUnicodeTestCase.java:76)
Caused by: org.sonatype.aether.resolution.ArtifactDescriptorException: Failed to read artifact
descriptor for org.apache.maven.skins:maven-default-skin:jar:1.0
	at org.apache.maven.plugins.jira.JiraUnicodeTestCase.testUnicodeReport(JiraUnicodeTestCase.java:76)
Caused by: org.sonatype.aether.resolution.ArtifactResolutionException: Could not transfer
artifact org.apache.maven.skins:maven-default-skin:pom:1.0 from/to central (https://repo.maven.apache.org/maven2):
Received fatal alert: protocol_version
	at org.apache.maven.plugins.jira.JiraUnicodeTestCase.testUnicodeReport(JiraUnicodeTestCase.java:76)
Caused by: org.sonatype.aether.transfer.ArtifactTransferException: Could not transfer artifact
org.apache.maven.skins:maven-default-skin:pom:1.0 from/to central (https://repo.maven.apache.org/maven2):
Received fatal alert: protocol_version
Caused by: org.apache.maven.wagon.TransferFailedException: Received fatal alert: protocol_version
Caused by: javax.net.ssl.SSLException: Received fatal alert: protocol_version


FAILED:  org.apache.maven.plugins.jira.JiraUnicodeTestCase.windows-jdk7-m3.5.x_build / Build
windows-jdk7-m3.5.x_build / testUnicodeReport

Error Message:
Couldn't resolve the skin.

Stack Trace:
org.apache.maven.plugin.MojoExecutionException: Couldn't resolve the skin.
	at org.apache.maven.plugins.jira.JiraUnicodeTestCase.testUnicodeReport(JiraUnicodeTestCase.java:76)
Caused by: org.apache.maven.shared.transfer.artifact.resolve.ArtifactResolverException: Failed
to read artifact descriptor for org.apache.maven.skins:maven-default-skin:jar:1.0
	at org.apache.maven.plugins.jira.JiraUnicodeTestCase.testUnicodeReport(JiraUnicodeTestCase.java:76)
Caused by: org.sonatype.aether.resolution.ArtifactDescriptorException: Failed to read artifact
descriptor for org.apache.maven.skins:maven-default-skin:jar:1.0
	at org.apache.maven.plugins.jira.JiraUnicodeTestCase.testUnicodeReport(JiraUnicodeTestCase.java:76)
Caused by: org.sonatype.aether.resolution.ArtifactResolutionException: Could not transfer
artifact org.apache.maven.skins:maven-default-skin:pom:1.0 from/to central (https://repo.maven.apache.org/maven2):
Received fatal alert: protocol_version
	at org.apache.maven.plugins.jira.JiraUnicodeTestCase.testUnicodeReport(JiraUnicodeTestCase.java:76)
Caused by: org.sonatype.aether.transfer.ArtifactTransferException: Could not transfer artifact
org.apache.maven.skins:maven-default-skin:pom:1.0 from/to central (https://repo.maven.apache.org/maven2):
Received fatal alert: protocol_version
Caused by: org.apache.maven.wagon.TransferFailedException: Received fatal alert: protocol_version
Caused by: javax.net.ssl.SSLException: Received fatal alert: protocol_version


FAILED:  org.apache.maven.plugins.jira.JiraUnicodeTestCase.windows-jdk7-m3.6.x_build / Build
windows-jdk7-m3.6.x_build / testUnicodeReport

Error Message:
Couldn't resolve the skin.

Stack Trace:
org.apache.maven.plugin.MojoExecutionException: Couldn't resolve the skin.
	at org.apache.maven.plugins.jira.JiraUnicodeTestCase.testUnicodeReport(JiraUnicodeTestCase.java:76)
Caused by: org.apache.maven.shared.transfer.artifact.resolve.ArtifactResolverException: Failed
to read artifact descriptor for org.apache.maven.skins:maven-default-skin:jar:1.0
	at org.apache.maven.plugins.jira.JiraUnicodeTestCase.testUnicodeReport(JiraUnicodeTestCase.java:76)
Caused by: org.sonatype.aether.resolution.ArtifactDescriptorException: Failed to read artifact
descriptor for org.apache.maven.skins:maven-default-skin:jar:1.0
	at org.apache.maven.plugins.jira.JiraUnicodeTestCase.testUnicodeReport(JiraUnicodeTestCase.java:76)
Caused by: org.sonatype.aether.resolution.ArtifactResolutionException: Could not transfer
artifact org.apache.maven.skins:maven-default-skin:pom:1.0 from/to central (https://repo.maven.apache.org/maven2):
Received fatal alert: protocol_version
	at org.apache.maven.plugins.jira.JiraUnicodeTestCase.testUnicodeReport(JiraUnicodeTestCase.java:76)
Caused by: org.sonatype.aether.transfer.ArtifactTransferException: Could not transfer artifact
org.apache.maven.skins:maven-default-skin:pom:1.0 from/to central (https://repo.maven.apache.org/maven2):
Received fatal alert: protocol_version
Caused by: org.apache.maven.wagon.TransferFailedException: Received fatal alert: protocol_version
Caused by: javax.net.ssl.SSLException: Received fatal alert: protocol_version




Build log:
[...truncated 63495 lines...]
	at junit.framework.TestSuite.runTest(TestSuite.java:252)
	at junit.framework.TestSuite.run(TestSuite.java:247)
	at org.junit.internal.runners.JUnit38ClassRunner.run(JUnit38ClassRunner.java:86)
	at org.apache.maven.surefire.junit4.JUnit4Provider.execute(JUnit4Provider.java:365)
	at org.apache.maven.surefire.junit4.JUnit4Provider.executeWithRerun(JUnit4Provider.java:273)
	at org.apache.maven.surefire.junit4.JUnit4Provider.executeTestSet(JUnit4Provider.java:238)
	at org.apache.maven.surefire.junit4.JUnit4Provider.invoke(JUnit4Provider.java:159)
	at org.apache.maven.surefire.booter.ForkedBooter.invokeProviderInSameClassLoader(ForkedBooter.java:383)
	at org.apache.maven.surefire.booter.ForkedBooter.runSuitesInProcess(ForkedBooter.java:344)
	at org.apache.maven.surefire.booter.ForkedBooter.execute(ForkedBooter.java:125)
	at org.apache.maven.surefire.booter.ForkedBooter.main(ForkedBooter.java:417)
[INFO] Tests run: 2, Failures: 0, Errors: 0, Skipped: 0, Time elapsed: 0.023 s - in org.apache.maven.plugins.changes.ChangesXMLTest
[INFO] Running org.apache.maven.plugins.changes.FeedGeneratorTest
[INFO] Tests run: 2, Failures: 0, Errors: 0, Skipped: 0, Time elapsed: 0.131 s - in org.apache.maven.plugins.changes.FeedGeneratorTest
[INFO] Running org.apache.maven.plugins.changes.IssueAdapterTest
[INFO] Tests run: 3, Failures: 0, Errors: 0, Skipped: 0, Time elapsed: 0.001 s - in org.apache.maven.plugins.changes.IssueAdapterTest
[INFO] Running org.apache.maven.plugins.changes.ReleaseTest
[INFO] Tests run: 3, Failures: 0, Errors: 0, Skipped: 0, Time elapsed: 0.001 s - in org.apache.maven.plugins.changes.ReleaseTest
[INFO] Running org.apache.maven.plugins.changes.ReleaseUtilsTestCase
[INFO] Tests run: 1, Failures: 0, Errors: 0, Skipped: 0, Time elapsed: 0 s - in org.apache.maven.plugins.changes.ReleaseUtilsTestCase
[INFO] Running org.apache.maven.plugins.github.GitHubDownloaderTestCase
[INFO] Tests run: 3, Failures: 0, Errors: 0, Skipped: 0, Time elapsed: 0.261 s - in org.apache.maven.plugins.github.GitHubDownloaderTestCase
[INFO] Running org.apache.maven.plugins.issues.IssueManagementSystemTest
[INFO] Tests run: 2, Failures: 0, Errors: 0, Skipped: 0, Time elapsed: 0.001 s - in org.apache.maven.plugins.issues.IssueManagementSystemTest
[INFO] Running org.apache.maven.plugins.issues.IssueTestCase
[INFO] Tests run: 5, Failures: 0, Errors: 0, Skipped: 0, Time elapsed: 0.002 s - in org.apache.maven.plugins.issues.IssueTestCase
[INFO] Running org.apache.maven.plugins.issues.IssueUtilsTestCase
[INFO] Tests run: 1, Failures: 0, Errors: 0, Skipped: 0, Time elapsed: 0.001 s - in org.apache.maven.plugins.issues.IssueUtilsTestCase
[INFO] Running org.apache.maven.plugins.jira.JiraHelperTestCase
[INFO] Tests run: 3, Failures: 0, Errors: 0, Skipped: 0, Time elapsed: 0 s - in org.apache.maven.plugins.jira.JiraHelperTestCase
[INFO] Running org.apache.maven.plugins.jira.JiraMojoTest
[INFO] Tests run: 1, Failures: 0, Errors: 0, Skipped: 0, Time elapsed: 0.092 s - in org.apache.maven.plugins.jira.JiraMojoTest
[INFO] Running org.apache.maven.plugins.jira.JiraUnicodeTestCase
[INFO] The JIRA version is '3.13.2'
[INFO] Tests run: 1, Failures: 0, Errors: 0, Skipped: 0, Time elapsed: 1.556 s - in org.apache.maven.plugins.jira.JiraUnicodeTestCase
[INFO] Running org.apache.maven.plugins.jira.JqlQueryBuilderTestCase
[debug] Encoding JQL query project = DOXIA ORDER BY key ASC, assignee DESC, reporter ASC
[debug] Encoded JQL query project+%3D+DOXIA+ORDER+BY+key+ASC%2C+assignee+DESC%2C+reporter+ASC
[debug] Encoding JQL query project = DOXIA ORDER BY key ASC
[debug] Encoded JQL query project+%3D+DOXIA+ORDER+BY+key+ASC
[debug] Encoding JQL query project = DOXIA ORDER BY key ASC
[debug] Encoded JQL query project+%3D+DOXIA+ORDER+BY+key+ASC
[debug] Encoding JQL query project = DOXIA ORDER BY key ASC
[debug] Encoded JQL query project+%3D+DOXIA+ORDER+BY+key+ASC
[debug] Encoding JQL query 
[debug] Encoded JQL query 
[debug] Encoding JQL query project = DOXIA
[debug] Encoded JQL query project+%3D+DOXIA
[debug] Encoding JQL query project = DOXIA ORDER BY key ASC, assignee DESC, reporter ASC
[debug] Encoded JQL query project+%3D+DOXIA+ORDER+BY+key+ASC%2C+assignee+DESC%2C+reporter+ASC
[debug] Encoding JQL query status in ("In Progress")
[debug] Encoded JQL query status+in+%28%22In+Progress%22%29
[debug] Encoding JQL query fixVersion = "1.0"
[debug] Encoded JQL query fixVersion+%3D+%221.0%22
[debug] Encoding JQL query project = DOXIA ORDER BY key DESC
[debug] Encoded JQL query project+%3D+DOXIA+ORDER+BY+key+DESC
[debug] Encoding JQL query project = DOXIA ORDER BY key DESC
[debug] Encoded JQL query project+%3D+DOXIA+ORDER+BY+key+DESC
[debug] Encoding JQL query priority in (Blocker)
[debug] Encoded JQL query priority+in+%28Blocker%29
[debug] Encoding JQL query priority in (Blocker)
[debug] Encoded JQL query priority+in+%28Blocker%29
[debug] Encoding JQL query priority in (Blocker, Critical, Major)
[debug] Encoded JQL query priority+in+%28Blocker%2C+Critical%2C+Major%29
[debug] Encoding JQL query priority in (Blocker, Critical, Major)
[debug] Encoded JQL query priority+in+%28Blocker%2C+Critical%2C+Major%29
[debug] Encoding JQL query priority in (Blocker) AND status in (Resolved)
[debug] Encoded JQL query priority+in+%28Blocker%29+AND+status+in+%28Resolved%29
[debug] Encoding JQL query project = DOXIA AND fixVersion = "1.0"
[debug] Encoded JQL query project+%3D+DOXIA+AND+fixVersion+%3D+%221.0%22
[INFO] Tests run: 12, Failures: 0, Errors: 0, Skipped: 0, Time elapsed: 0.022 s - in org.apache.maven.plugins.jira.JqlQueryBuilderTestCase
[INFO] Running org.apache.maven.plugins.jira.UrlBuilderTestCase
[INFO] Tests run: 4, Failures: 0, Errors: 0, Skipped: 0, Time elapsed: 0.001 s - in org.apache.maven.plugins.jira.UrlBuilderTestCase
[INFO] run post-build script verify.groovy
[INFO]           report-aggregated-changes-generation\pom.xml ..... SUCCESS (11.6 s)
[INFO] Building: report-changes-generation\pom.xml
[INFO] 
[INFO] Results:
[INFO] 
[WARNING] Tests run: 56, Failures: 0, Errors: 0, Skipped: 1
[INFO] 
[INFO] 
[INFO] --- maven-jar-plugin:3.1.0:jar (default-jar) @ maven-changes-plugin ---
[INFO] Building jar: f:\jenkins\jenkins-slave\workspace\aven-box_maven-changes-plugin_ht@2\windows-jdk15-m3.6.x_build\target\maven-changes-plugin-3.0.0-SNAPSHOT.jar
[INFO] 
[INFO] --- maven-plugin-plugin:3.5.2:addPluginArtifactMetadata (default-addPluginArtifactMetadata)
@ maven-changes-plugin ---
[INFO] 
[INFO] --- maven-site-plugin:3.7.1:attach-descriptor (attach-descriptor) @ maven-changes-plugin
---
[INFO] Skipping because packaging 'maven-plugin' is not pom.
[INFO] 
[INFO] --- maven-invoker-plugin:3.1.0:install (integration-test) @ maven-changes-plugin ---
[INFO] Installing f:\jenkins\jenkins-slave\workspace\aven-box_maven-changes-plugin_ht@2\windows-jdk15-m3.6.x_build\pom.xml
to f:\jenkins\jenkins-slave\workspace\aven-box_maven-changes-plugin_ht@2\windows-jdk15-m3.6.x_build\target\local-repo\org\apache\maven\plugins\maven-changes-plugin\3.0.0-SNAPSHOT\maven-changes-plugin-3.0.0-SNAPSHOT.pom
[INFO] Installing f:\jenkins\jenkins-slave\workspace\aven-box_maven-changes-plugin_ht@2\windows-jdk15-m3.6.x_build\target\maven-changes-plugin-3.0.0-SNAPSHOT.jar
to f:\jenkins\jenkins-slave\workspace\aven-box_maven-changes-plugin_ht@2\windows-jdk15-m3.6.x_build\target\local-repo\org\apache\maven\plugins\maven-changes-plugin\3.0.0-SNAPSHOT\maven-changes-plugin-3.0.0-SNAPSHOT.jar
[INFO] 
[INFO] --- maven-invoker-plugin:3.1.0:integration-test (integration-test) @ maven-changes-plugin
---
[INFO] Building: announce-generate\pom.xml
[INFO] run post-build script verify.bsh
[INFO]           report-changes-generation\pom.xml ................ SUCCESS (6.7 s)
[INFO] Building: report-changes-interpolation\pom.xml
[INFO] run post-build script verify.bsh
[INFO]           report-changes-interpolation\pom.xml ............. SUCCESS (6.1 s)
[INFO] Building: report-changes-nofile\pom.xml
[INFO]           report-changes-nofile\pom.xml .................... SUCCESS (5.3 s)
[INFO] Building: report-changes-skip-snapshots\pom.xml
[INFO] run post-build script verify.groovy
WARNING: An illegal reflective access operation has occurred
WARNING: Illegal reflective access by org.codehaus.groovy.reflection.CachedClass (file:/f:/jenkins/jenkins-slave/workspace/.maven_repositories/1/org/codehaus/groovy/groovy-all/2.4.8/groovy-all-2.4.8.jar)
to method java.lang.Object.finalize()
WARNING: Please consider reporting this to the maintainers of org.codehaus.groovy.reflection.CachedClass
WARNING: Use --illegal-access=warn to enable warnings of further illegal reflective access
operations
WARNING: All illegal access operations will be denied in a future release
[INFO]           announce-generate\pom.xml ........................ SUCCESS (14.6 s)
[INFO] Building: announce-generate-inconsistent-issue-management\pom.xml
[INFO] run post-build script verify.groovy
[INFO]           report-changes-skip-snapshots\pom.xml ............ SUCCESS (5.5 s)
[INFO] Building: report-changes-system\pom.xml
[INFO]           announce-generate-inconsistent-issue-management\pom.xml SUCCESS (4.3 s)
[INFO] Building: announce-generate-no-issue-management\pom.xml
[INFO]           announce-generate-no-issue-management\pom.xml .... SUCCESS (4.1 s)
[INFO] Building: announce-generate-no-url\pom.xml
[INFO] run post-build script verify.bsh
[INFO]           report-changes-system\pom.xml .................... SUCCESS (6.4 s)
[INFO] Building: report-changes-system-noissuemanagement\pom.xml
[INFO]           announce-generate-no-url\pom.xml ................. SUCCESS (4.0 s)
[INFO] Building: announcement-generate-custom-template\pom.xml
[INFO] run post-build script verify.bsh
[INFO]           report-changes-system-noissuemanagement\pom.xml .. SUCCESS (6.0 s)
[INFO] Building: report-jira-invalid-issuemanagement\pom.xml
[INFO] run post-build script verify.bsh
[INFO]           announcement-generate-custom-template\pom.xml .... SUCCESS (3.6 s)
[INFO] Building: report-aggregated-changes-generation\pom.xml
[INFO] run post-build script verify.groovy
[INFO]           report-jira-invalid-issuemanagement\pom.xml ...... SUCCESS (4.8 s)
[INFO] 
[INFO] --- maven-checkstyle-plugin:3.0.0:check (checkstyle-check) @ maven-changes-plugin ---
[INFO] 
[INFO] --- maven-invoker-plugin:3.1.0:verify (integration-test) @ maven-changes-plugin ---
[INFO] -------------------------------------------------
[INFO] Build Summary:
[INFO]   Passed: 13, Failed: 0, Errors: 0, Skipped: 0
[INFO] -------------------------------------------------
[INFO] ------------------------------------------------------------------------
[INFO] BUILD SUCCESS
[INFO] ------------------------------------------------------------------------
[INFO] Total time:  01:55 min
[INFO] Finished at: 2020-04-07T08:53:46-07:00
[INFO] ------------------------------------------------------------------------
[INFO] [jenkins-event-spy] Generated F:\jenkins\jenkins-slave\workspace\aven-box_maven-changes-plugin_ht@3@2@tmp\withMaven2ac95e32\maven-spy-20200407-085150-11517474442806438974425.log
[Pipeline] }
[Pipeline] // dir
[Pipeline] }
[withMaven] artifactsPublisher - Archive artifact windows-jdk14-m3.6.x_build\pom.xml under
org\apache\maven\plugins\maven-changes-plugin\3.0.0-SNAPSHOT\maven-changes-plugin-3.0.0-SNAPSHOT.pom
[withMaven] artifactsPublisher - Archive artifact windows-jdk14-m3.6.x_build\target\maven-changes-plugin-3.0.0-SNAPSHOT.jar
under org\apache\maven\plugins\maven-changes-plugin\3.0.0-SNAPSHOT\maven-changes-plugin-3.0.0-SNAPSHOT.jar
[withMaven] junitPublisher - Archive test results for Maven artifact org.apache.maven.plugins:maven-changes-plugin:maven-plugin:3.0.0-SNAPSHOT
generated by maven-surefire-plugin:test (default-test): windows-jdk14-m3.6.x_build\target\surefire-reports\*.xml
Recording test results
[withMaven] openTasksPublisher - Scan Tasks for Maven artifact org.apache.maven.plugins:maven-changes-plugin:maven-plugin:3.0.0-SNAPSHOT
in source directory windows-jdk14-m3.6.x_build\src\main\java
[TASKS] Scanning folder 'f:\jenkins\jenkins-slave\workspace\aven-box_maven-changes-plugin_ht@3@2'
for files matching the pattern 'windows-jdk14-m3.6.x_build\src\main\java\**\*' - excludes:
null
[TASKS] Found 48 files to scan for tasks
[TASKS] Found 4 open tasks.
Skipping warnings blame since pipelines do not have an SCM link.%n
[TASKS] Computing warning deltas based on reference build #4
[withMaven] invokerPublisher - Archive invoker results for Maven artifact MavenArtifact{org.apache.maven.plugins:maven-changes-plugin:maven-plugin:3.0.0-SNAPSHOT(version:
3.0.0-SNAPSHOT, snapshot:false) } generated by PluginInvocation{org.apache.maven.plugins:maven-invoker-plugin:3.1.0@integration-test
 integration-test}: windows-jdk14-m3.6.x_build\target\invoker-reports\*.xml
[withMaven] Publishers: Generated Artifacts Publisher: 168 ms, Junit Publisher: 1128 ms, Open
Task Scanner Publisher: 142 ms, Invoker Publisher: 2670 ms, Pipeline Graph Publisher: 1 ms
[Pipeline] // withMaven
[Pipeline] cleanWs
[WS-CLEANUP] Deleting project workspace...
[WS-CLEANUP] Deferred wipeout is used...
[WS-CLEANUP] done
[Pipeline] }
[Pipeline] // stage
[Pipeline] }
[Pipeline] // ws
[Pipeline] }
[Pipeline] // node
[Pipeline] }
[INFO] run post-build script verify.groovy
[INFO]           report-aggregated-changes-generation\pom.xml ..... SUCCESS (12.2 s)
[INFO] Building: report-changes-generation\pom.xml
[INFO] run post-build script verify.bsh
[INFO]           report-changes-generation\pom.xml ................ SUCCESS (6.4 s)
[INFO] Building: report-changes-interpolation\pom.xml
[INFO] run post-build script verify.bsh
[INFO]           report-changes-interpolation\pom.xml ............. SUCCESS (7.8 s)
[INFO] Building: report-changes-nofile\pom.xml
[INFO]           report-changes-nofile\pom.xml .................... SUCCESS (6.0 s)
[INFO] Building: report-changes-skip-snapshots\pom.xml
[INFO] run post-build script verify.groovy
[INFO]           report-changes-skip-snapshots\pom.xml ............ SUCCESS (4.5 s)
[INFO] Building: report-changes-system\pom.xml
[INFO] run post-build script verify.bsh
[INFO]           report-changes-system\pom.xml .................... SUCCESS (6.0 s)
[INFO] Building: report-changes-system-noissuemanagement\pom.xml
[INFO] run post-build script verify.bsh
[INFO]           report-changes-system-noissuemanagement\pom.xml .. SUCCESS (5.6 s)
[INFO] Building: report-jira-invalid-issuemanagement\pom.xml
[INFO] run post-build script verify.groovy
[INFO]           report-jira-invalid-issuemanagement\pom.xml ...... SUCCESS (4.8 s)
[INFO] 
[INFO] --- maven-checkstyle-plugin:3.0.0:check (checkstyle-check) @ maven-changes-plugin ---
[INFO] 
[INFO] --- maven-invoker-plugin:3.1.0:verify (integration-test) @ maven-changes-plugin ---
[INFO] -------------------------------------------------
[INFO] Build Summary:
[INFO]   Passed: 13, Failed: 0, Errors: 0, Skipped: 0
[INFO] -------------------------------------------------
[INFO] ------------------------------------------------------------------------
[INFO] BUILD SUCCESS
[INFO] ------------------------------------------------------------------------
[INFO] Total time:  01:56 min
[INFO] Finished at: 2020-04-07T08:54:36-07:00
[INFO] ------------------------------------------------------------------------
[INFO] [jenkins-event-spy] Generated F:\jenkins\jenkins-slave\workspace\aven-box_maven-changes-plugin_ht@2@tmp\withMavenf3b527b5\maven-spy-20200407-085239-1702216414025152304986.log
[Pipeline] }
[Pipeline] // dir
[Pipeline] }
[withMaven] artifactsPublisher - Archive artifact windows-jdk15-m3.6.x_build\pom.xml under
org\apache\maven\plugins\maven-changes-plugin\3.0.0-SNAPSHOT\maven-changes-plugin-3.0.0-SNAPSHOT.pom
[withMaven] artifactsPublisher - Archive artifact windows-jdk15-m3.6.x_build\target\maven-changes-plugin-3.0.0-SNAPSHOT.jar
under org\apache\maven\plugins\maven-changes-plugin\3.0.0-SNAPSHOT\maven-changes-plugin-3.0.0-SNAPSHOT.jar
[withMaven] junitPublisher - Archive test results for Maven artifact org.apache.maven.plugins:maven-changes-plugin:maven-plugin:3.0.0-SNAPSHOT
generated by maven-surefire-plugin:test (default-test): windows-jdk15-m3.6.x_build\target\surefire-reports\*.xml
Recording test results
[withMaven] openTasksPublisher - Scan Tasks for Maven artifact org.apache.maven.plugins:maven-changes-plugin:maven-plugin:3.0.0-SNAPSHOT
in source directory windows-jdk15-m3.6.x_build\src\main\java
[TASKS] Scanning folder 'f:\jenkins\jenkins-slave\workspace\aven-box_maven-changes-plugin_ht@2'
for files matching the pattern 'windows-jdk15-m3.6.x_build\src\main\java\**\*' - excludes:
null
[TASKS] Found 48 files to scan for tasks
[TASKS] Found 4 open tasks.
Skipping warnings blame since pipelines do not have an SCM link.%n
[TASKS] Computing warning deltas based on reference build #4
[withMaven] invokerPublisher - Archive invoker results for Maven artifact MavenArtifact{org.apache.maven.plugins:maven-changes-plugin:maven-plugin:3.0.0-SNAPSHOT(version:
3.0.0-SNAPSHOT, snapshot:false) } generated by PluginInvocation{org.apache.maven.plugins:maven-invoker-plugin:3.1.0@integration-test
 integration-test}: windows-jdk15-m3.6.x_build\target\invoker-reports\*.xml
[withMaven] Publishers: Generated Artifacts Publisher: 123 ms, Junit Publisher: 622 ms, Open
Task Scanner Publisher: 140 ms, Invoker Publisher: 2335 ms, Pipeline Graph Publisher: 1 ms
[Pipeline] // withMaven
[Pipeline] cleanWs
[WS-CLEANUP] Deleting project workspace...
[WS-CLEANUP] Deferred wipeout is used...
[WS-CLEANUP] done
[Pipeline] }
[Pipeline] // stage
[Pipeline] }
[Pipeline] // ws
[Pipeline] }
[Pipeline] // node
[Pipeline] }
[Pipeline] // parallel
[Pipeline] stage
[Pipeline] { (Notifications)
[Pipeline] echo
Build result: UNSTABLE
[Pipeline] jiraIssueSelector
[Pipeline] echo
The authors of changes [rfscholte].
[Pipeline] echo
Sending email ...
[Pipeline] emailext
Mime
  • Unnamed multipart/mixed (inline, None, 0 bytes)
View raw message