maven-notifications mailing list archives

Site index · List index
Message view « Date » · « Thread »
Top « Date » · « Thread »
From Apache Jenkins Server <jenk...@builds.apache.org>
Subject Build failed in Jenkins: Maven TLP » maven-linkcheck-plugin » doxia #4
Date Tue, 07 Apr 2020 16:03:43 GMT
See https://builds.apache.org/job/maven-box/job/maven-linkcheck-plugin/job/doxia/4/

Changes:

* add

No tests ran.

Build log:
[...truncated 3446 lines...]
[INFO] [jenkins-event-spy] Generate F:\jenkins\jenkins-slave\workspace\box_maven-linkcheck-plugin_doxia@2@tmp\withMavenafd3e393\maven-spy-20200407-090341-56818235254055483463270.log.tmp
...
[INFO] [jenkins-event-spy] Generate F:\jenkins\jenkins-slave\workspace\box_maven-linkcheck-plugin_doxia@2@tmp\withMaven19eb81a8\maven-spy-20200407-090341-3843294824406350218919.log.tmp
...
[INFO] Error stacktraces are turned on.
[INFO] Error stacktraces are turned on.
[INFO] Scanning for projects...
[INFO] Scanning for projects...
[ERROR] [ERROR] Some problems were encountered while processing the POMs:
[ERROR] Malformed POM f:\jenkins\jenkins-slave\workspace\box_maven-linkcheck-plugin_doxia@2\windows-jdk14-m3.6.x_build\pom.xml:
Unrecognised tag: 'project.build.outputTimestamp' (position: START_TAG seen ...</relativePath>\r\n
   <project.build.outputTimestamp>... @30:36)  @ f:\jenkins\jenkins-slave\workspace\box_maven-linkcheck-plugin_doxia@2\windows-jdk14-m3.6.x_build\pom.xml,
line 30, column 36
 @ 
[INFO] [jenkins-event-spy] Generated F:\jenkins\jenkins-slave\workspace\box_maven-linkcheck-plugin_doxia@2@tmp\withMaven19eb81a8\maven-spy-20200407-090341-3843294824406350218919.log
[ERROR] The build could not read 1 project -> [Help 1]
org.apache.maven.project.ProjectBuildingException: Some problems were encountered while processing
the POMs:
[ERROR] Malformed POM f:\jenkins\jenkins-slave\workspace\box_maven-linkcheck-plugin_doxia@2\windows-jdk14-m3.6.x_build\pom.xml:
Unrecognised tag: 'project.build.outputTimestamp' (position: START_TAG seen ...</relativePath>\r\n
   <project.build.outputTimestamp>... @30:36)  @ f:\jenkins\jenkins-slave\workspace\box_maven-linkcheck-plugin_doxia@2\windows-jdk14-m3.6.x_build\pom.xml,
line 30, column 36

    at org.apache.maven.project.DefaultProjectBuilder.build (DefaultProjectBuilder.java:397)
    at org.apache.maven.graph.DefaultGraphBuilder.collectProjects (DefaultGraphBuilder.java:414)
    at org.apache.maven.graph.DefaultGraphBuilder.getProjectsForMavenReactor (DefaultGraphBuilder.java:405)
    at org.apache.maven.graph.DefaultGraphBuilder.build (DefaultGraphBuilder.java:82)
    at org.apache.maven.DefaultMaven.buildGraph (DefaultMaven.java:507)
    at org.apache.maven.DefaultMaven.doExecute (DefaultMaven.java:219)
    at org.apache.maven.DefaultMaven.doExecute (DefaultMaven.java:192)
    at org.apache.maven.DefaultMaven.execute (DefaultMaven.java:105)
    at org.apache.maven.cli.MavenCli.execute (MavenCli.java:956)
    at org.apache.maven.cli.MavenCli.doMain (MavenCli.java:288)
    at org.apache.maven.cli.MavenCli.main (MavenCli.java:192)
    at jdk.internal.reflect.NativeMethodAccessorImpl.invoke0 (Native Method)
    at jdk.internal.reflect.NativeMethodAccessorImpl.invoke (NativeMethodAccessorImpl.java:62)
    at jdk.internal.reflect.DelegatingMethodAccessorImpl.invoke (DelegatingMethodAccessorImpl.java:43)
    at java.lang.reflect.Method.invoke (Method.java:567)
    at org.codehaus.plexus.classworlds.launcher.Launcher.launchEnhanced (Launcher.java:282)
    at org.codehaus.plexus.classworlds.launcher.Launcher.launch (Launcher.java:225)
    at org.codehaus.plexus.classworlds.launcher.Launcher.mainWithExitCode (Launcher.java:406)
    at org.codehaus.plexus.classworlds.launcher.Launcher.main (Launcher.java:347)
[ERROR]   
[ERROR]   The project org.apache.maven.plugins:maven-linkcheck-plugin:3.0.0-SNAPSHOT (f:\jenkins\jenkins-slave\workspace\box_maven-linkcheck-plugin_doxia@2\windows-jdk14-m3.6.x_build\pom.xml)
has 1 error
[ERROR]     Malformed POM f:\jenkins\jenkins-slave\workspace\box_maven-linkcheck-plugin_doxia@2\windows-jdk14-m3.6.x_build\pom.xml:
Unrecognised tag: 'project.build.outputTimestamp' (position: START_TAG seen ...</relativePath>\r\n
   <project.build.outputTimestamp>... @30:36)  @ f:\jenkins\jenkins-slave\workspace\box_maven-linkcheck-plugin_doxia@2\windows-jdk14-m3.6.x_build\pom.xml,
line 30, column 36 -> [Help 2]
org.apache.maven.model.io.ModelParseException: Unrecognised tag: 'project.build.outputTimestamp'
(position: START_TAG seen ...</relativePath>\r\n    <project.build.outputTimestamp>...
@30:36) 
    at org.apache.maven.model.io.DefaultModelReader.read (DefaultModelReader.java:117)
    at org.apache.maven.model.io.DefaultModelReader.read (DefaultModelReader.java:85)
    at org.apache.maven.model.building.DefaultModelProcessor.read (DefaultModelProcessor.java:89)
    at org.apache.maven.model.building.DefaultModelBuilder.readModel (DefaultModelBuilder.java:552)
    at org.apache.maven.model.building.DefaultModelBuilder.build (DefaultModelBuilder.java:281)
    at org.apache.maven.project.DefaultProjectBuilder.build (DefaultProjectBuilder.java:448)
    at org.apache.maven.project.DefaultProjectBuilder.build (DefaultProjectBuilder.java:414)
    at org.apache.maven.project.DefaultProjectBuilder.build (DefaultProjectBuilder.java:377)
    at org.apache.maven.graph.DefaultGraphBuilder.collectProjects (DefaultGraphBuilder.java:414)
    at org.apache.maven.graph.DefaultGraphBuilder.getProjectsForMavenReactor (DefaultGraphBuilder.java:405)
    at org.apache.maven.graph.DefaultGraphBuilder.build (DefaultGraphBuilder.java:82)
    at org.apache.maven.DefaultMaven.buildGraph (DefaultMaven.java:507)
    at org.apache.maven.DefaultMaven.doExecute (DefaultMaven.java:219)
    at org.apache.maven.DefaultMaven.doExecute (DefaultMaven.java:192)
    at org.apache.maven.DefaultMaven.execute (DefaultMaven.java:105)
    at org.apache.maven.cli.MavenCli.execute (MavenCli.java:956)
    at org.apache.maven.cli.MavenCli.doMain (MavenCli.java:288)
    at org.apache.maven.cli.MavenCli.main (MavenCli.java:192)
    at jdk.internal.reflect.NativeMethodAccessorImpl.invoke0 (Native Method)
    at jdk.internal.reflect.NativeMethodAccessorImpl.invoke (NativeMethodAccessorImpl.java:62)
    at jdk.internal.reflect.DelegatingMethodAccessorImpl.invoke (DelegatingMethodAccessorImpl.java:43)
    at java.lang.reflect.Method.invoke (Method.java:567)
    at org.codehaus.plexus.classworlds.launcher.Launcher.launchEnhanced (Launcher.java:282)
    at org.codehaus.plexus.classworlds.launcher.Launcher.launch (Launcher.java:225)
    at org.codehaus.plexus.classworlds.launcher.Launcher.mainWithExitCode (Launcher.java:406)
    at org.codehaus.plexus.classworlds.launcher.Launcher.main (Launcher.java:347)
Caused by: org.codehaus.plexus.util.xml.pull.XmlPullParserException: Unrecognised tag: 'project.build.outputTimestamp'
(position: START_TAG seen ...</relativePath>\r\n    <project.build.outputTimestamp>...
@30:36) 
    at org.apache.maven.model.io.xpp3.MavenXpp3ReaderEx.checkUnknownElement (MavenXpp3ReaderEx.java:180)
    at org.apache.maven.model.io.xpp3.MavenXpp3ReaderEx.parseParent (MavenXpp3ReaderEx.java:2945)
    at org.apache.maven.model.io.xpp3.MavenXpp3ReaderEx.parseModel (MavenXpp3ReaderEx.java:2329)
    at org.apache.maven.model.io.xpp3.MavenXpp3ReaderEx.read (MavenXpp3ReaderEx.java:4425)
    at org.apache.maven.model.io.xpp3.MavenXpp3ReaderEx.read (MavenXpp3ReaderEx.java:598)
    at org.apache.maven.model.io.DefaultModelReader.read (DefaultModelReader.java:108)
    at org.apache.maven.model.io.DefaultModelReader.read (DefaultModelReader.java:85)
    at org.apache.maven.model.building.DefaultModelProcessor.read (DefaultModelProcessor.java:89)
    at org.apache.maven.model.building.DefaultModelBuilder.readModel (DefaultModelBuilder.java:552)
    at org.apache.maven.model.building.DefaultModelBuilder.build (DefaultModelBuilder.java:281)
    at org.apache.maven.project.DefaultProjectBuilder.build (DefaultProjectBuilder.java:448)
    at org.apache.maven.project.DefaultProjectBuilder.build (DefaultProjectBuilder.java:414)
    at org.apache.maven.project.DefaultProjectBuilder.build (DefaultProjectBuilder.java:377)
    at org.apache.maven.graph.DefaultGraphBuilder.collectProjects (DefaultGraphBuilder.java:414)
    at org.apache.maven.graph.DefaultGraphBuilder.getProjectsForMavenReactor (DefaultGraphBuilder.java:405)
    at org.apache.maven.graph.DefaultGraphBuilder.build (DefaultGraphBuilder.java:82)
    at org.apache.maven.DefaultMaven.buildGraph (DefaultMaven.java:507)
    at org.apache.maven.DefaultMaven.doExecute (DefaultMaven.java:219)
    at org.apache.maven.DefaultMaven.doExecute (DefaultMaven.java:192)
    at org.apache.maven.DefaultMaven.execute (DefaultMaven.java:105)
    at org.apache.maven.cli.MavenCli.execute (MavenCli.java:956)
    at org.apache.maven.cli.MavenCli.doMain (MavenCli.java:288)
    at org.apache.maven.cli.MavenCli.main (MavenCli.java:192)
    at jdk.internal.reflect.NativeMethodAccessorImpl.invoke0 (Native Method)
    at jdk.internal.reflect.NativeMethodAccessorImpl.invoke (NativeMethodAccessorImpl.java:62)
    at jdk.internal.reflect.DelegatingMethodAccessorImpl.invoke (DelegatingMethodAccessorImpl.java:43)
    at java.lang.reflect.Method.invoke (Method.java:567)
    at org.codehaus.plexus.classworlds.launcher.Launcher.launchEnhanced (Launcher.java:282)
    at org.codehaus.plexus.classworlds.launcher.Launcher.launch (Launcher.java:225)
    at org.codehaus.plexus.classworlds.launcher.Launcher.mainWithExitCode (Launcher.java:406)
    at org.codehaus.plexus.classworlds.launcher.Launcher.main (Launcher.java:347)
[ERROR] 
[ERROR] Re-run Maven using the -X switch to enable full debug logging.
[ERROR] 
[ERROR] For more information about the errors and possible solutions, please read the following
articles:
[ERROR] [Help 1] http://cwiki.apache.org/confluence/display/MAVEN/ProjectBuildingException
[ERROR] [Help 2] http://cwiki.apache.org/confluence/display/MAVEN/ModelParseException
[ERROR] [ERROR] Some problems were encountered while processing the POMs:
[ERROR] Malformed POM f:\jenkins\jenkins-slave\workspace\box_maven-linkcheck-plugin_doxia@2\windows-jdk15-m3.6.x_build\pom.xml:
Unrecognised tag: 'project.build.outputTimestamp' (position: START_TAG seen ...</relativePath>\r\n
   <project.build.outputTimestamp>... @30:36)  @ f:\jenkins\jenkins-slave\workspace\box_maven-linkcheck-plugin_doxia@2\windows-jdk15-m3.6.x_build\pom.xml,
line 30, column 36
 @ 
[INFO] [jenkins-event-spy] Generated F:\jenkins\jenkins-slave\workspace\box_maven-linkcheck-plugin_doxia@2@tmp\withMavenafd3e393\maven-spy-20200407-090341-56818235254055483463270.log
[ERROR] The build could not read 1 project -> [Help 1]
org.apache.maven.project.ProjectBuildingException: Some problems were encountered while processing
the POMs:
[ERROR] Malformed POM f:\jenkins\jenkins-slave\workspace\box_maven-linkcheck-plugin_doxia@2\windows-jdk15-m3.6.x_build\pom.xml:
Unrecognised tag: 'project.build.outputTimestamp' (position: START_TAG seen ...</relativePath>\r\n
   <project.build.outputTimestamp>... @30:36)  @ f:\jenkins\jenkins-slave\workspace\box_maven-linkcheck-plugin_doxia@2\windows-jdk15-m3.6.x_build\pom.xml,
line 30, column 36

    at org.apache.maven.project.DefaultProjectBuilder.build (DefaultProjectBuilder.java:397)
    at org.apache.maven.graph.DefaultGraphBuilder.collectProjects (DefaultGraphBuilder.java:414)
    at org.apache.maven.graph.DefaultGraphBuilder.getProjectsForMavenReactor (DefaultGraphBuilder.java:405)
    at org.apache.maven.graph.DefaultGraphBuilder.build (DefaultGraphBuilder.java:82)
    at org.apache.maven.DefaultMaven.buildGraph (DefaultMaven.java:507)
    at org.apache.maven.DefaultMaven.doExecute (DefaultMaven.java:219)
    at org.apache.maven.DefaultMaven.doExecute (DefaultMaven.java:192)
    at org.apache.maven.DefaultMaven.execute (DefaultMaven.java:105)
    at org.apache.maven.cli.MavenCli.execute (MavenCli.java:956)
    at org.apache.maven.cli.MavenCli.doMain (MavenCli.java:288)
    at org.apache.maven.cli.MavenCli.main (MavenCli.java:192)
    at jdk.internal.reflect.NativeMethodAccessorImpl.invoke0 (Native Method)
    at jdk.internal.reflect.NativeMethodAccessorImpl.invoke (NativeMethodAccessorImpl.java:62)
    at jdk.internal.reflect.DelegatingMethodAccessorImpl.invoke (DelegatingMethodAccessorImpl.java:43)
    at java.lang.reflect.Method.invoke (Method.java:564)
    at org.codehaus.plexus.classworlds.launcher.Launcher.launchEnhanced (Launcher.java:282)
    at org.codehaus.plexus.classworlds.launcher.Launcher.launch (Launcher.java:225)
    at org.codehaus.plexus.classworlds.launcher.Launcher.mainWithExitCode (Launcher.java:406)
    at org.codehaus.plexus.classworlds.launcher.Launcher.main (Launcher.java:347)
[ERROR]   
[ERROR]   The project org.apache.maven.plugins:maven-linkcheck-plugin:3.0.0-SNAPSHOT (f:\jenkins\jenkins-slave\workspace\box_maven-linkcheck-plugin_doxia@2\windows-jdk15-m3.6.x_build\pom.xml)
has 1 error
[ERROR]     Malformed POM f:\jenkins\jenkins-slave\workspace\box_maven-linkcheck-plugin_doxia@2\windows-jdk15-m3.6.x_build\pom.xml:
Unrecognised tag: 'project.build.outputTimestamp' (position: START_TAG seen ...</relativePath>\r\n
   <project.build.outputTimestamp>... @30:36)  @ f:\jenkins\jenkins-slave\workspace\box_maven-linkcheck-plugin_doxia@2\windows-jdk15-m3.6.x_build\pom.xml,
line 30, column 36 -> [Help 2]
org.apache.maven.model.io.ModelParseException: Unrecognised tag: 'project.build.outputTimestamp'
(position: START_TAG seen ...</relativePath>\r\n    <project.build.outputTimestamp>...
@30:36) 
    at org.apache.maven.model.io.DefaultModelReader.read (DefaultModelReader.java:117)
    at org.apache.maven.model.io.DefaultModelReader.read (DefaultModelReader.java:85)
    at org.apache.maven.model.building.DefaultModelProcessor.read (DefaultModelProcessor.java:89)
    at org.apache.maven.model.building.DefaultModelBuilder.readModel (DefaultModelBuilder.java:552)
    at org.apache.maven.model.building.DefaultModelBuilder.build (DefaultModelBuilder.java:281)
    at org.apache.maven.project.DefaultProjectBuilder.build (DefaultProjectBuilder.java:448)
    at org.apache.maven.project.DefaultProjectBuilder.build (DefaultProjectBuilder.java:414)
    at org.apache.maven.project.DefaultProjectBuilder.build (DefaultProjectBuilder.java:377)
    at org.apache.maven.graph.DefaultGraphBuilder.collectProjects (DefaultGraphBuilder.java:414)
    at org.apache.maven.graph.DefaultGraphBuilder.getProjectsForMavenReactor (DefaultGraphBuilder.java:405)
    at org.apache.maven.graph.DefaultGraphBuilder.build (DefaultGraphBuilder.java:82)
    at org.apache.maven.DefaultMaven.buildGraph (DefaultMaven.java:507)
    at org.apache.maven.DefaultMaven.doExecute (DefaultMaven.java:219)
    at org.apache.maven.DefaultMaven.doExecute (DefaultMaven.java:192)
    at org.apache.maven.DefaultMaven.execute (DefaultMaven.java:105)
    at org.apache.maven.cli.MavenCli.execute (MavenCli.java:956)
    at org.apache.maven.cli.MavenCli.doMain (MavenCli.java:288)
    at org.apache.maven.cli.MavenCli.main (MavenCli.java:192)
    at jdk.internal.reflect.NativeMethodAccessorImpl.invoke0 (Native Method)
    at jdk.internal.reflect.NativeMethodAccessorImpl.invoke (NativeMethodAccessorImpl.java:62)
    at jdk.internal.reflect.DelegatingMethodAccessorImpl.invoke (DelegatingMethodAccessorImpl.java:43)
    at java.lang.reflect.Method.invoke (Method.java:564)
    at org.codehaus.plexus.classworlds.launcher.Launcher.launchEnhanced (Launcher.java:282)
    at org.codehaus.plexus.classworlds.launcher.Launcher.launch (Launcher.java:225)
    at org.codehaus.plexus.classworlds.launcher.Launcher.mainWithExitCode (Launcher.java:406)
    at org.codehaus.plexus.classworlds.launcher.Launcher.main (Launcher.java:347)
Caused by: org.codehaus.plexus.util.xml.pull.XmlPullParserException: Unrecognised tag: 'project.build.outputTimestamp'
(position: START_TAG seen ...</relativePath>\r\n    <project.build.outputTimestamp>...
@30:36) 
    at org.apache.maven.model.io.xpp3.MavenXpp3ReaderEx.checkUnknownElement (MavenXpp3ReaderEx.java:180)
    at org.apache.maven.model.io.xpp3.MavenXpp3ReaderEx.parseParent (MavenXpp3ReaderEx.java:2945)
    at org.apache.maven.model.io.xpp3.MavenXpp3ReaderEx.parseModel (MavenXpp3ReaderEx.java:2329)
    at org.apache.maven.model.io.xpp3.MavenXpp3ReaderEx.read (MavenXpp3ReaderEx.java:4425)
    at org.apache.maven.model.io.xpp3.MavenXpp3ReaderEx.read (MavenXpp3ReaderEx.java:598)
    at org.apache.maven.model.io.DefaultModelReader.read (DefaultModelReader.java:108)
    at org.apache.maven.model.io.DefaultModelReader.read (DefaultModelReader.java:85)
    at org.apache.maven.model.building.DefaultModelProcessor.read (DefaultModelProcessor.java:89)
    at org.apache.maven.model.building.DefaultModelBuilder.readModel (DefaultModelBuilder.java:552)
    at org.apache.maven.model.building.DefaultModelBuilder.build (DefaultModelBuilder.java:281)
    at org.apache.maven.project.DefaultProjectBuilder.build (DefaultProjectBuilder.java:448)
    at org.apache.maven.project.DefaultProjectBuilder.build (DefaultProjectBuilder.java:414)
    at org.apache.maven.project.DefaultProjectBuilder.build (DefaultProjectBuilder.java:377)
    at org.apache.maven.graph.DefaultGraphBuilder.collectProjects (DefaultGraphBuilder.java:414)
    at org.apache.maven.graph.DefaultGraphBuilder.getProjectsForMavenReactor (DefaultGraphBuilder.java:405)
    at org.apache.maven.graph.DefaultGraphBuilder.build (DefaultGraphBuilder.java:82)
    at org.apache.maven.DefaultMaven.buildGraph (DefaultMaven.java:507)
    at org.apache.maven.DefaultMaven.doExecute (DefaultMaven.java:219)
    at org.apache.maven.DefaultMaven.doExecute (DefaultMaven.java:192)
    at org.apache.maven.DefaultMaven.execute (DefaultMaven.java:105)
    at org.apache.maven.cli.MavenCli.execute (MavenCli.java:956)
    at org.apache.maven.cli.MavenCli.doMain (MavenCli.java:288)
    at org.apache.maven.cli.MavenCli.main (MavenCli.java:192)
    at jdk.internal.reflect.NativeMethodAccessorImpl.invoke0 (Native Method)
    at jdk.internal.reflect.NativeMethodAccessorImpl.invoke (NativeMethodAccessorImpl.java:62)
    at jdk.internal.reflect.DelegatingMethodAccessorImpl.invoke (DelegatingMethodAccessorImpl.java:43)
    at java.lang.reflect.Method.invoke (Method.java:564)
    at org.codehaus.plexus.classworlds.launcher.Launcher.launchEnhanced (Launcher.java:282)
    at org.codehaus.plexus.classworlds.launcher.Launcher.launch (Launcher.java:225)
    at org.codehaus.plexus.classworlds.launcher.Launcher.mainWithExitCode (Launcher.java:406)
    at org.codehaus.plexus.classworlds.launcher.Launcher.main (Launcher.java:347)
[ERROR] 
[ERROR] Re-run Maven using the -X switch to enable full debug logging.
[ERROR] 
[ERROR] For more information about the errors and possible solutions, please read the following
articles:
[ERROR] [Help 1] http://cwiki.apache.org/confluence/display/MAVEN/ProjectBuildingException
[ERROR] [Help 2] http://cwiki.apache.org/confluence/display/MAVEN/ModelParseException
[Pipeline] }
[Pipeline] // dir
[Pipeline] }
[Pipeline] }
[Pipeline] // dir
[Pipeline] }
[withMaven] Publishers: Generated Artifacts Publisher: 17 ms
[Pipeline] // withMaven
[Pipeline] cleanWs
[WS-CLEANUP] Deleting project workspace...
[WS-CLEANUP] Deferred wipeout is used...
[withMaven] Publishers: Generated Artifacts Publisher: 15 ms
[WS-CLEANUP] done
[Pipeline] cleanWs
[Pipeline] // withMaven
[WS-CLEANUP] Deleting project workspace...
[WS-CLEANUP] Deferred wipeout is used...
[WS-CLEANUP] done
[Pipeline] cleanWs
[WS-CLEANUP] Deleting project workspace...
[WS-CLEANUP] Deferred wipeout is used...
[Pipeline] }
[WS-CLEANUP] done
[Pipeline] // stage
[Pipeline] }
[Pipeline] cleanWs
[WS-CLEANUP] Deleting project workspace...
[WS-CLEANUP] Deferred wipeout is used...
[Pipeline] // ws
[Pipeline] }
[WS-CLEANUP] done
[Pipeline] // node
[Pipeline] }
Failed in branch windows-jdk15-m3.6.x_build
[Pipeline] }
[Pipeline] // stage
[Pipeline] }
[Pipeline] // ws
[Pipeline] }
[Pipeline] // node
[Pipeline] }
Failed in branch windows-jdk14-m3.6.x_build
[Pipeline] // parallel
[Pipeline] stage
[Pipeline] { (Notifications)
[Pipeline] echo
Build result: FAILURE
[Pipeline] jiraIssueSelector
[Pipeline] echo
The authors of changes [elharo].
[Pipeline] echo
Sending email ...
[Pipeline] emailext
Mime
  • Unnamed multipart/mixed (inline, None, 0 bytes)
View raw message