maven-notifications mailing list archives

Site index · List index
Message view « Date » · « Thread »
Top « Date » · « Thread »
From Apache Jenkins Server <jenk...@builds.apache.org>
Subject Build failed in Jenkins: Maven TLP » maven-enforcer » MENFORCER-298 #36
Date Tue, 07 Apr 2020 15:31:25 GMT
See https://builds.apache.org/job/maven-box/job/maven-enforcer/job/MENFORCER-298/36/

Changes:

* exclude broken jenkins-win-he-de-1 node

All tests passed

Build log:
[...truncated 869235 lines...]
[INFO] --- maven-remote-resources-plugin:1.5:process (process-resource-bundles) @ enforcer
---
[INFO] 
[INFO] --- maven-site-plugin:3.7.1:attach-descriptor (attach-descriptor) @ enforcer ---
[INFO] Attaching 'src\site\site.xml' site descriptor with classifier 'site'.
[INFO] 
[INFO] --- maven-checkstyle-plugin:3.0.0:check (checkstyle-check) @ enforcer ---
[INFO] 
[INFO] ---------------< org.apache.maven.enforcer:enforcer-api >---------------
[INFO] Building Apache Maven Enforcer API 3.0.0-SNAPSHOT                  [2/4]
[INFO] --------------------------------[ jar ]---------------------------------
[INFO] 
[INFO] --- maven-clean-plugin:3.1.0:clean (default-clean) @ enforcer-api ---
[INFO] 
[INFO] --- maven-enforcer-plugin:1.4.1:enforce (enforce-maven-version) @ enforcer-api ---
[INFO] 
[INFO] --- maven-enforcer-plugin:1.4.1:enforce (enforce-bytecode-version) @ enforcer-api ---
[INFO] 
[INFO] --- maven-enforcer-plugin:1.4.1:enforce (ban-known-bad-maven-versions) @ enforcer-api
---
[INFO] 
[INFO] --- apache-rat-plugin:0.12:check (rat-check) @ enforcer-api ---
[INFO] Enabled default license matchers.
[INFO] Will parse SCM ignores for exclusions...
[INFO] Finished adding exclusions from SCM ignore files.
[INFO] 61 implicit excludes (use -debug for more details).
[INFO] Exclude: .repository/**
[INFO] Exclude: .maven/spy.log
[INFO] Exclude: dependency-reduced-pom.xml
[INFO] Exclude: .java-version
[INFO] 14 resources included (use -debug for more details)
[INFO]           require-same-versions_success\pom.xml ............ SUCCESS (3.6 s)
[INFO] Building: require-snapshot-version_failure\pom.xml
[INFO] Rat check: Summary over all files. Unapproved: 0, unknown: 0, generated: 0, approved:
14 licenses.
[INFO] 
[INFO] --- maven-remote-resources-plugin:1.5:process (process-resource-bundles) @ enforcer-api
---
[INFO] 
[INFO] --- maven-resources-plugin:3.1.0:resources (default-resources) @ enforcer-api ---
[INFO] Using 'UTF-8' encoding to copy filtered resources.
[INFO] skip non existing resourceDirectory F:\jenkins\jenkins-slave\workspace\box_maven-enforcer_MENFORCER-298@2\windows-jdk15-m3.6.x_build\enforcer-api\src\main\resources
[INFO] Copying 3 resources
[INFO] 
[INFO] --- maven-compiler-plugin:3.7.0:compile (default-compile) @ enforcer-api ---
[INFO] Changes detected - recompiling the module!
[INFO] Compiling 5 source files to F:\jenkins\jenkins-slave\workspace\box_maven-enforcer_MENFORCER-298@2\windows-jdk15-m3.6.x_build\enforcer-api\target\classes
[INFO] -------------------------------------------------------------
[ERROR] COMPILATION ERROR : 
[INFO] -------------------------------------------------------------
[ERROR] Source option 6 is no longer supported. Use 7 or later.
[ERROR] Target option 6 is no longer supported. Use 7 or later.
[INFO] 2 errors 
[INFO] -------------------------------------------------------------
[INFO] ------------------------------------------------------------------------
[INFO] Reactor Summary for Apache Maven Enforcer 3.0.0-SNAPSHOT:
[INFO] 
[INFO] Apache Maven Enforcer .............................. SUCCESS [  4.274 s]
[INFO] Apache Maven Enforcer API .......................... FAILURE [  1.313 s]
[INFO] Apache Maven Enforcer Built-In Rules ............... SKIPPED
[INFO] Apache Maven Enforcer Plugin ....................... SKIPPED
[INFO] ------------------------------------------------------------------------
[INFO] BUILD FAILURE
[INFO] ------------------------------------------------------------------------
[INFO] Total time:  5.830 s
[INFO] Finished at: 2020-04-07T08:30:24-07:00
[INFO] ------------------------------------------------------------------------
[INFO] [jenkins-event-spy] Generated F:\jenkins\jenkins-slave\workspace\box_maven-enforcer_MENFORCER-298@2@tmp\withMaven0d7120b5\maven-spy-20200407-083018-17112630332444035741397.log
[ERROR] Failed to execute goal org.apache.maven.plugins:maven-compiler-plugin:3.7.0:compile
(default-compile) on project enforcer-api: Compilation failure: Compilation failure: 
[ERROR] Source option 6 is no longer supported. Use 7 or later.
[ERROR] Target option 6 is no longer supported. Use 7 or later.
[ERROR] -> [Help 1]
org.apache.maven.lifecycle.LifecycleExecutionException: Failed to execute goal org.apache.maven.plugins:maven-compiler-plugin:3.7.0:compile
(default-compile) on project enforcer-api: Compilation failure
    at org.apache.maven.lifecycle.internal.MojoExecutor.execute (MojoExecutor.java:215)
    at org.apache.maven.lifecycle.internal.MojoExecutor.execute (MojoExecutor.java:156)
    at org.apache.maven.lifecycle.internal.MojoExecutor.execute (MojoExecutor.java:148)
    at org.apache.maven.lifecycle.internal.LifecycleModuleBuilder.buildProject (LifecycleModuleBuilder.java:117)
    at org.apache.maven.lifecycle.internal.LifecycleModuleBuilder.buildProject (LifecycleModuleBuilder.java:81)
    at org.apache.maven.lifecycle.internal.builder.singlethreaded.SingleThreadedBuilder.build
(SingleThreadedBuilder.java:56)
    at org.apache.maven.lifecycle.internal.LifecycleStarter.execute (LifecycleStarter.java:128)
    at org.apache.maven.DefaultMaven.doExecute (DefaultMaven.java:305)
    at org.apache.maven.DefaultMaven.doExecute (DefaultMaven.java:192)
    at org.apache.maven.DefaultMaven.execute (DefaultMaven.java:105)
    at org.apache.maven.cli.MavenCli.execute (MavenCli.java:956)
    at org.apache.maven.cli.MavenCli.doMain (MavenCli.java:288)
    at org.apache.maven.cli.MavenCli.main (MavenCli.java:192)
    at jdk.internal.reflect.NativeMethodAccessorImpl.invoke0 (Native Method)
    at jdk.internal.reflect.NativeMethodAccessorImpl.invoke (NativeMethodAccessorImpl.java:62)
    at jdk.internal.reflect.DelegatingMethodAccessorImpl.invoke (DelegatingMethodAccessorImpl.java:43)
    at java.lang.reflect.Method.invoke (Method.java:564)
    at org.codehaus.plexus.classworlds.launcher.Launcher.launchEnhanced (Launcher.java:282)
    at org.codehaus.plexus.classworlds.launcher.Launcher.launch (Launcher.java:225)
    at org.codehaus.plexus.classworlds.launcher.Launcher.mainWithExitCode (Launcher.java:406)
    at org.codehaus.plexus.classworlds.launcher.Launcher.main (Launcher.java:347)
Caused by: org.apache.maven.plugin.compiler.CompilationFailureException: Compilation failure
    at org.apache.maven.plugin.compiler.AbstractCompilerMojo.execute (AbstractCompilerMojo.java:1161)
    at org.apache.maven.plugin.compiler.CompilerMojo.execute (CompilerMojo.java:168)
    at org.apache.maven.plugin.DefaultBuildPluginManager.executeMojo (DefaultBuildPluginManager.java:137)
    at org.apache.maven.lifecycle.internal.MojoExecutor.execute (MojoExecutor.java:210)
    at org.apache.maven.lifecycle.internal.MojoExecutor.execute (MojoExecutor.java:156)
    at org.apache.maven.lifecycle.internal.MojoExecutor.execute (MojoExecutor.java:148)
    at org.apache.maven.lifecycle.internal.LifecycleModuleBuilder.buildProject (LifecycleModuleBuilder.java:117)
    at org.apache.maven.lifecycle.internal.LifecycleModuleBuilder.buildProject (LifecycleModuleBuilder.java:81)
    at org.apache.maven.lifecycle.internal.builder.singlethreaded.SingleThreadedBuilder.build
(SingleThreadedBuilder.java:56)
    at org.apache.maven.lifecycle.internal.LifecycleStarter.execute (LifecycleStarter.java:128)
    at org.apache.maven.DefaultMaven.doExecute (DefaultMaven.java:305)
    at org.apache.maven.DefaultMaven.doExecute (DefaultMaven.java:192)
    at org.apache.maven.DefaultMaven.execute (DefaultMaven.java:105)
    at org.apache.maven.cli.MavenCli.execute (MavenCli.java:956)
    at org.apache.maven.cli.MavenCli.doMain (MavenCli.java:288)
    at org.apache.maven.cli.MavenCli.main (MavenCli.java:192)
    at jdk.internal.reflect.NativeMethodAccessorImpl.invoke0 (Native Method)
    at jdk.internal.reflect.NativeMethodAccessorImpl.invoke (NativeMethodAccessorImpl.java:62)
    at jdk.internal.reflect.DelegatingMethodAccessorImpl.invoke (DelegatingMethodAccessorImpl.java:43)
    at java.lang.reflect.Method.invoke (Method.java:564)
    at org.codehaus.plexus.classworlds.launcher.Launcher.launchEnhanced (Launcher.java:282)
    at org.codehaus.plexus.classworlds.launcher.Launcher.launch (Launcher.java:225)
    at org.codehaus.plexus.classworlds.launcher.Launcher.mainWithExitCode (Launcher.java:406)
    at org.codehaus.plexus.classworlds.launcher.Launcher.main (Launcher.java:347)
[ERROR] 
[ERROR] Re-run Maven using the -X switch to enable full debug logging.
[ERROR] 
[ERROR] For more information about the errors and possible solutions, please read the following
articles:
[ERROR] [Help 1] http://cwiki.apache.org/confluence/display/MAVEN/MojoFailureException
[ERROR] 
[ERROR] After correcting the problems, you can resume the build with the command
[ERROR]   mvn <args> -rf :enforcer-api
[Pipeline] }
[Pipeline] // dir
[Pipeline] }
[withMaven] artifactsPublisher - Archive artifact windows-jdk15-m3.6.x_build\pom.xml under
org\apache\maven\enforcer\enforcer\3.0.0-SNAPSHOT\enforcer-3.0.0-SNAPSHOT.pom
[withMaven] artifactsPublisher - Archive artifact windows-jdk15-m3.6.x_build\target\enforcer-3.0.0-SNAPSHOT-site.xml
under org\apache\maven\enforcer\enforcer\3.0.0-SNAPSHOT\enforcer-3.0.0-SNAPSHOT-site.xml
[withMaven] openTasksPublisher - Scan Tasks for Maven artifact org.apache.maven.enforcer:enforcer-api:jar:3.0.0-SNAPSHOT
in source directory windows-jdk15-m3.6.x_build\enforcer-api\src\main\java
[TASKS] Scanning folder 'f:\jenkins\jenkins-slave\workspace\box_maven-enforcer_MENFORCER-298@2'
for files matching the pattern 'windows-jdk15-m3.6.x_build\enforcer-api\src\main\java\**\*'
- excludes: null
[TASKS] Found 5 files to scan for tasks
[TASKS] Found 0 open tasks.
Skipping warnings blame since pipelines do not have an SCM link.%n
[TASKS] Computing warning deltas based on reference build #7
[withMaven] Publishers: Generated Artifacts Publisher: 56 ms, Open Task Scanner Publisher:
65 ms
[Pipeline] // withMaven
[Pipeline] cleanWs
[WS-CLEANUP] Deleting project workspace...
[WS-CLEANUP] Deferred wipeout is used...
[WS-CLEANUP] done
[Pipeline] cleanWs
[WS-CLEANUP] Deleting project workspace...
[WS-CLEANUP] Deferred wipeout is used...
[WS-CLEANUP] done
[Pipeline] }
[Pipeline] // stage
[Pipeline] }
[Pipeline] // ws
[Pipeline] }
[Pipeline] // node
[Pipeline] }
Failed in branch windows-jdk15-m3.6.x_build
[INFO]           require-snapshot-version_failure\pom.xml ......... SUCCESS (3.9 s)
[INFO] Building: require-snapshot-version_success\pom.xml
[INFO]           require-snapshot-version_success\pom.xml ......... SUCCESS (3.8 s)
[INFO] Building: require-upper-bound-dependencies-managed_failure\pom.xml
[INFO] run post-build script verify.groovy
[INFO]           require-upper-bound-dependencies-managed_failure\pom.xml SUCCESS (3.9 s)
[INFO] Building: require-upper-bound-dependencies-managed_success\pom.xml
[INFO]           require-upper-bound-dependencies-managed_success\pom.xml SUCCESS (3.5 s)
[INFO] Building: require-upper-bound-dependencies-unique_failure\pom.xml
[INFO] run post-build script verify.groovy
[INFO]           require-upper-bound-dependencies-unique_failure\pom.xml SUCCESS (5.0 s)
[INFO] Building: require-upper-bound-dependencies-unique_success\pom.xml
[INFO]           require-upper-bound-dependencies-unique_success\pom.xml SUCCESS (4.2 s)
[INFO] Building: require-upper-bound-deps_failure\pom.xml
[INFO] run post-build script verify.groovy
[INFO]           require-upper-bound-deps_failure\pom.xml ......... SUCCESS (4.2 s)
[INFO] Building: require-upper-bound-deps_ignored\pom.xml
[INFO] run post-build script verify.groovy
[INFO]           require-upper-bound-deps_ignored\pom.xml ......... SUCCESS (3.7 s)
[INFO] Building: require-upper-bound-deps_success\pom.xml
[INFO]           require-upper-bound-deps_success\pom.xml ......... SUCCESS (4.1 s)
[INFO] Building: resolve_collect_dependencies\pom.xml
[INFO] run post-build script verify.groovy
[INFO]           resolve_collect_dependencies\pom.xml ............. SUCCESS (7.8 s)
[INFO] -------------------------------------------------
[INFO] Build Summary:
[INFO]   Passed: 68, Failed: 0, Errors: 0, Skipped: 0
[INFO] -------------------------------------------------
[INFO] 
[INFO] --- mrm-maven-plugin:1.0.0:stop (default) @ maven-enforcer-plugin ---
[INFO] Stopping Mock Repository Manager on http://localhost:56345
[INFO] Mock Repository Manager http://localhost:56345 is stopped.
[INFO] 
[INFO] --- maven-checkstyle-plugin:3.0.0:check (checkstyle-check) @ maven-enforcer-plugin
---
[INFO] ------------------------------------------------------------------------
[INFO] Reactor Summary for Apache Maven Enforcer 3.0.0-SNAPSHOT:
[INFO] 
[INFO] Apache Maven Enforcer .............................. SUCCESS [  4.075 s]
[INFO] Apache Maven Enforcer API .......................... SUCCESS [  2.595 s]
[INFO] Apache Maven Enforcer Built-In Rules ............... SUCCESS [ 12.495 s]
[INFO] Apache Maven Enforcer Plugin ....................... SUCCESS [04:44 min]
[INFO] ------------------------------------------------------------------------
[INFO] BUILD SUCCESS
[INFO] ------------------------------------------------------------------------
[INFO] Total time:  05:03 min
[INFO] Finished at: 2020-04-07T08:31:08-07:00
[INFO] ------------------------------------------------------------------------
[INFO] [jenkins-event-spy] Generated F:\jenkins\jenkins-slave\workspace\box_maven-enforcer_MENFORCER-298@3@2@tmp\withMavenb6f2b1ed\maven-spy-20200407-082604-186581103092027682933.log
[Pipeline] }
[Pipeline] // dir
[Pipeline] }
[withMaven] artifactsPublisher - Archive artifact windows-jdk11-m3.6.x_build\pom.xml under
org\apache\maven\enforcer\enforcer\3.0.0-SNAPSHOT\enforcer-3.0.0-SNAPSHOT.pom
[withMaven] artifactsPublisher - Archive artifact windows-jdk11-m3.6.x_build\target\enforcer-3.0.0-SNAPSHOT-site.xml
under org\apache\maven\enforcer\enforcer\3.0.0-SNAPSHOT\enforcer-3.0.0-SNAPSHOT-site.xml
[withMaven] artifactsPublisher - Archive artifact windows-jdk11-m3.6.x_build\enforcer-api\pom.xml
under org\apache\maven\enforcer\enforcer-api\3.0.0-SNAPSHOT\enforcer-api-3.0.0-SNAPSHOT.pom
[withMaven] artifactsPublisher - Archive artifact windows-jdk11-m3.6.x_build\enforcer-api\target\enforcer-api-3.0.0-SNAPSHOT.jar
under org\apache\maven\enforcer\enforcer-api\3.0.0-SNAPSHOT\enforcer-api-3.0.0-SNAPSHOT.jar
[withMaven] artifactsPublisher - Archive artifact windows-jdk11-m3.6.x_build\enforcer-rules\pom.xml
under org\apache\maven\enforcer\enforcer-rules\3.0.0-SNAPSHOT\enforcer-rules-3.0.0-SNAPSHOT.pom
[withMaven] artifactsPublisher - Archive artifact windows-jdk11-m3.6.x_build\enforcer-rules\target\enforcer-rules-3.0.0-SNAPSHOT.jar
under org\apache\maven\enforcer\enforcer-rules\3.0.0-SNAPSHOT\enforcer-rules-3.0.0-SNAPSHOT.jar
[withMaven] artifactsPublisher - Archive artifact windows-jdk11-m3.6.x_build\enforcer-rules\target\enforcer-rules-3.0.0-SNAPSHOT-tests.jar
under org\apache\maven\enforcer\enforcer-rules\3.0.0-SNAPSHOT\enforcer-rules-3.0.0-SNAPSHOT-tests.jar
[withMaven] artifactsPublisher - Archive artifact windows-jdk11-m3.6.x_build\maven-enforcer-plugin\pom.xml
under org\apache\maven\plugins\maven-enforcer-plugin\3.0.0-SNAPSHOT\maven-enforcer-plugin-3.0.0-SNAPSHOT.pom
[withMaven] artifactsPublisher - Archive artifact windows-jdk11-m3.6.x_build\maven-enforcer-plugin\target\maven-enforcer-plugin-3.0.0-SNAPSHOT.jar
under org\apache\maven\plugins\maven-enforcer-plugin\3.0.0-SNAPSHOT\maven-enforcer-plugin-3.0.0-SNAPSHOT.jar
[withMaven] junitPublisher - Archive test results for Maven artifact org.apache.maven.enforcer:enforcer-api:jar:3.0.0-SNAPSHOT
generated by maven-surefire-plugin:test (default-test): windows-jdk11-m3.6.x_build\enforcer-api\target\surefire-reports\*.xml
[withMaven] junitPublisher - Archive test results for Maven artifact org.apache.maven.enforcer:enforcer-rules:jar:3.0.0-SNAPSHOT
generated by maven-surefire-plugin:test (default-test): windows-jdk11-m3.6.x_build\enforcer-rules\target\surefire-reports\*.xml
[withMaven] junitPublisher - Archive test results for Maven artifact org.apache.maven.plugins:maven-enforcer-plugin:maven-plugin:3.0.0-SNAPSHOT
generated by maven-surefire-plugin:test (default-test): windows-jdk11-m3.6.x_build\maven-enforcer-plugin\target\surefire-reports\*.xml
Recording test results
[withMaven] openTasksPublisher - Scan Tasks for Maven artifact org.apache.maven.enforcer:enforcer-api:jar:3.0.0-SNAPSHOT
in source directory windows-jdk11-m3.6.x_build\enforcer-api\src\main\java
[withMaven] openTasksPublisher - Scan Tasks for Maven artifact org.apache.maven.enforcer:enforcer-rules:jar:3.0.0-SNAPSHOT
in source directory windows-jdk11-m3.6.x_build\enforcer-rules\src\main\java
[withMaven] openTasksPublisher - Scan Tasks for Maven artifact org.apache.maven.plugins:maven-enforcer-plugin:maven-plugin:3.0.0-SNAPSHOT
in source directory windows-jdk11-m3.6.x_build\maven-enforcer-plugin\src\main\java
[TASKS] Scanning folder 'f:\jenkins\jenkins-slave\workspace\box_maven-enforcer_MENFORCER-298@3@2'
for files matching the pattern 'windows-jdk11-m3.6.x_build\enforcer-api\src\main\java\**\*,windows-jdk11-m3.6.x_build\enforcer-rules\src\main\java\**\*,windows-jdk11-m3.6.x_build\maven-enforcer-plugin\src\main\java\**\*'
- excludes: null
[TASKS] Found 51 files to scan for tasks
[TASKS] Found 6 open tasks.
Skipping warnings blame since pipelines do not have an SCM link.%n
[TASKS] Computing warning deltas based on reference build #7
[withMaven] invokerPublisher - Archive invoker results for Maven artifact MavenArtifact{org.apache.maven.plugins:maven-enforcer-plugin:maven-plugin:3.0.0-SNAPSHOT(version:
3.0.0-SNAPSHOT, snapshot:false) } generated by PluginInvocation{org.apache.maven.plugins:maven-invoker-plugin:3.1.0@run
 integration-test}: windows-jdk11-m3.6.x_build\maven-enforcer-plugin\target\invoker-reports\*.xml
[withMaven] Publishers: Generated Artifacts Publisher: 286 ms, Junit Publisher: 1060 ms, Open
Task Scanner Publisher: 186 ms, Dependencies Fingerprint Publisher: 46 ms, Invoker Publisher:
14224 ms, Pipeline Graph Publisher: 3 ms
[Pipeline] // withMaven
[Pipeline] cleanWs
[WS-CLEANUP] Deleting project workspace...
[WS-CLEANUP] Deferred wipeout is used...
[WS-CLEANUP] done
[Pipeline] }
[Pipeline] // stage
[Pipeline] }
[Pipeline] // ws
[Pipeline] }
[Pipeline] // node
[Pipeline] }
[Pipeline] // parallel
[Pipeline] stage
[Pipeline] { (Notifications)
[Pipeline] echo
Build result: FAILURE
[Pipeline] jiraIssueSelector
[Pipeline] echo
The authors of changes [rfscholte].
[Pipeline] echo
Sending email ...
[Pipeline] emailext
Mime
  • Unnamed multipart/mixed (inline, None, 0 bytes)
View raw message