maven-notifications mailing list archives

Site index · List index
Message view « Date » · « Thread »
Top « Date » · « Thread »
From Apache Jenkins Server <jenk...@builds.apache.org>
Subject Build failed in Jenkins: Maven TLP » maven-surefire » maven2surefire-jvm-communication #45
Date Fri, 14 Feb 2020 00:15:17 GMT
See https://builds.apache.org/job/maven-box/job/maven-surefire/job/maven2surefire-jvm-communication/45/

Changes:

* add Maven 3.1.1
* covered Classpath

1 tests failed.
FAILED:  org.apache.maven.surefire.booter.ClasspathTest.testLoadInNewClassLoader

Error Message:
no !/ in spec

Stack Trace:
java.net.MalformedURLException: no !/ in spec
	at java.base/java.net.URL.<init>(URL.java:695)
	at java.base/java.net.URL.<init>(URL.java:557)
	at java.base/java.net.URL.<init>(URL.java:504)
	at org.apache.maven.surefire.booter.ClasspathTest.testLoadInNewClassLoader(ClasspathTest.java:203)
Caused by: java.lang.NullPointerException: no !/ in spec
	at java.base/sun.net.www.protocol.jar.Handler.parseAbsoluteSpec(Handler.java:168)
	at java.base/sun.net.www.protocol.jar.Handler.parseURL(Handler.java:150)
	at java.base/java.net.URL.<init>(URL.java:690)
	... 28 more




Build log:
[...truncated 8239 lines...]
[2020-02-14T00:15:15.633Z]     at org.apache.maven.lifecycle.internal.LifecycleModuleBuilder.buildProject
(LifecycleModuleBuilder.java:117)
[2020-02-14T00:15:15.633Z]     at org.apache.maven.lifecycle.internal.LifecycleModuleBuilder.buildProject
(LifecycleModuleBuilder.java:81)
[2020-02-14T00:15:15.633Z]     at org.apache.maven.lifecycle.internal.builder.singlethreaded.SingleThreadedBuilder.build
(SingleThreadedBuilder.java:56)
[2020-02-14T00:15:15.633Z]     at org.apache.maven.lifecycle.internal.LifecycleStarter.execute
(LifecycleStarter.java:128)
[2020-02-14T00:15:15.633Z]     at org.apache.maven.DefaultMaven.doExecute (DefaultMaven.java:305)
[2020-02-14T00:15:15.633Z]     at org.apache.maven.DefaultMaven.doExecute (DefaultMaven.java:192)
[2020-02-14T00:15:15.633Z]     at org.apache.maven.DefaultMaven.execute (DefaultMaven.java:105)
[2020-02-14T00:15:15.633Z]     at org.apache.maven.cli.MavenCli.execute (MavenCli.java:956)
[2020-02-14T00:15:15.633Z]     at org.apache.maven.cli.MavenCli.doMain (MavenCli.java:288)
[2020-02-14T00:15:15.633Z]     at org.apache.maven.cli.MavenCli.main (MavenCli.java:192)
[2020-02-14T00:15:15.633Z]     at sun.reflect.NativeMethodAccessorImpl.invoke0 (Native Method)
[2020-02-14T00:15:15.633Z]     at sun.reflect.NativeMethodAccessorImpl.invoke (NativeMethodAccessorImpl.java:62)
[2020-02-14T00:15:15.633Z]     at sun.reflect.DelegatingMethodAccessorImpl.invoke (DelegatingMethodAccessorImpl.java:43)
[2020-02-14T00:15:15.633Z]     at java.lang.reflect.Method.invoke (Method.java:498)
[2020-02-14T00:15:15.633Z]     at org.codehaus.plexus.classworlds.launcher.Launcher.launchEnhanced
(Launcher.java:282)
[2020-02-14T00:15:15.633Z]     at org.codehaus.plexus.classworlds.launcher.Launcher.launch
(Launcher.java:225)
[2020-02-14T00:15:15.633Z]     at org.codehaus.plexus.classworlds.launcher.Launcher.mainWithExitCode
(Launcher.java:406)
[2020-02-14T00:15:15.633Z]     at org.codehaus.plexus.classworlds.launcher.Launcher.main (Launcher.java:347)
[2020-02-14T00:15:15.633Z] Caused by: org.apache.maven.plugin.MojoFailureException: There
are test failures.
[2020-02-14T00:15:15.633Z] 
[2020-02-14T00:15:15.633Z] Please refer to C:\Users\jenkins\AppData\Local\Temp\2\jenkins-maven-box-maven-surefire-maven2surefire-jvm-communication-45@2\surefire-booter\target\surefire-reports
for the individual test results.
[2020-02-14T00:15:15.633Z] Please refer to dump files (if any exist) [date].dump, [date]-jvmRun[N].dump
and [date].dumpstream.
[2020-02-14T00:15:15.633Z]     at org.apache.maven.plugin.surefire.SurefireHelper.throwException
(SurefireHelper.java:271)
[2020-02-14T00:15:15.633Z]     at org.apache.maven.plugin.surefire.SurefireHelper.reportExecution
(SurefireHelper.java:159)
[2020-02-14T00:15:15.633Z]     at org.apache.maven.plugin.surefire.SurefirePlugin.handleSummary
(SurefirePlugin.java:435)
[2020-02-14T00:15:15.633Z]     at org.apache.maven.plugin.surefire.AbstractSurefireMojo.executeAfterPreconditionsChecked
(AbstractSurefireMojo.java:1079)
[2020-02-14T00:15:15.633Z]     at org.apache.maven.plugin.surefire.AbstractSurefireMojo.execute
(AbstractSurefireMojo.java:889)
[2020-02-14T00:15:15.633Z]     at org.apache.maven.plugin.DefaultBuildPluginManager.executeMojo
(DefaultBuildPluginManager.java:137)
[2020-02-14T00:15:15.633Z]     at org.apache.maven.lifecycle.internal.MojoExecutor.execute
(MojoExecutor.java:210)
[2020-02-14T00:15:15.633Z]     at org.apache.maven.lifecycle.internal.MojoExecutor.execute
(MojoExecutor.java:156)
[2020-02-14T00:15:15.633Z]     at org.apache.maven.lifecycle.internal.MojoExecutor.execute
(MojoExecutor.java:148)
[2020-02-14T00:15:15.633Z]     at org.apache.maven.lifecycle.internal.LifecycleModuleBuilder.buildProject
(LifecycleModuleBuilder.java:117)
[2020-02-14T00:15:15.633Z]     at org.apache.maven.lifecycle.internal.LifecycleModuleBuilder.buildProject
(LifecycleModuleBuilder.java:81)
[2020-02-14T00:15:15.634Z]     at org.apache.maven.lifecycle.internal.builder.singlethreaded.SingleThreadedBuilder.build
(SingleThreadedBuilder.java:56)
[2020-02-14T00:15:15.634Z]     at org.apache.maven.lifecycle.internal.LifecycleStarter.execute
(LifecycleStarter.java:128)
[2020-02-14T00:15:15.634Z]     at org.apache.maven.DefaultMaven.doExecute (DefaultMaven.java:305)
[2020-02-14T00:15:15.634Z]     at org.apache.maven.DefaultMaven.doExecute (DefaultMaven.java:192)
[2020-02-14T00:15:15.634Z]     at org.apache.maven.DefaultMaven.execute (DefaultMaven.java:105)
[2020-02-14T00:15:15.634Z]     at org.apache.maven.cli.MavenCli.execute (MavenCli.java:956)
[2020-02-14T00:15:15.634Z]     at org.apache.maven.cli.MavenCli.doMain (MavenCli.java:288)
[2020-02-14T00:15:15.634Z]     at org.apache.maven.cli.MavenCli.main (MavenCli.java:192)
[2020-02-14T00:15:15.634Z]     at sun.reflect.NativeMethodAccessorImpl.invoke0 (Native Method)
[2020-02-14T00:15:15.634Z]     at sun.reflect.NativeMethodAccessorImpl.invoke (NativeMethodAccessorImpl.java:62)
[2020-02-14T00:15:15.634Z]     at sun.reflect.DelegatingMethodAccessorImpl.invoke (DelegatingMethodAccessorImpl.java:43)
[2020-02-14T00:15:15.634Z]     at java.lang.reflect.Method.invoke (Method.java:498)
[2020-02-14T00:15:15.634Z]     at org.codehaus.plexus.classworlds.launcher.Launcher.launchEnhanced
(Launcher.java:282)
[2020-02-14T00:15:15.634Z]     at org.codehaus.plexus.classworlds.launcher.Launcher.launch
(Launcher.java:225)
[2020-02-14T00:15:15.634Z]     at org.codehaus.plexus.classworlds.launcher.Launcher.mainWithExitCode
(Launcher.java:406)
[2020-02-14T00:15:15.634Z]     at org.codehaus.plexus.classworlds.launcher.Launcher.main (Launcher.java:347)
[2020-02-14T00:15:15.634Z] [ERROR] 
[2020-02-14T00:15:15.634Z] [ERROR] Re-run Maven using the -X switch to enable full debug logging.
[2020-02-14T00:15:15.634Z] [ERROR] 
[2020-02-14T00:15:15.634Z] [ERROR] For more information about the errors and possible solutions,
please read the following articles:
[2020-02-14T00:15:15.634Z] [ERROR] [Help 1] http://cwiki.apache.org/confluence/display/MAVEN/MojoFailureException
[2020-02-14T00:15:15.634Z] [ERROR] 
[2020-02-14T00:15:15.634Z] [ERROR] After correcting the problems, you can resume the build
with the command
[2020-02-14T00:15:15.634Z] [ERROR]   mvn <args> -rf :surefire-booter
[Pipeline] }
[Pipeline] // withEnv
[Pipeline] }
[Pipeline] // stage
[Pipeline] fileExists
[Pipeline] fileExists
[Pipeline] archiveArtifacts
[2020-02-14T00:15:15.801Z] Archiving artifacts
[Pipeline] cleanWs
[2020-02-14T00:15:15.848Z] [WS-CLEANUP] Deleting project workspace...
[2020-02-14T00:15:15.848Z] [WS-CLEANUP] Deferred wipeout is used...
[2020-02-14T00:15:15.892Z] [WS-CLEANUP] done
[Pipeline] }
[Pipeline] // ws
[Pipeline] }
[Pipeline] // timestamps
[Pipeline] }
[2020-02-14T00:15:16.038Z] java.lang.RuntimeException: dummy exception
[2020-02-14T00:15:16.038Z] 	at org.apache.maven.surefire.booter.ForkedBooter.run(ForkedBooter.java:523)
[2020-02-14T00:15:16.038Z] 	at org.apache.maven.surefire.booter.ForkedBooterMockTest.testMainWithError(ForkedBooterMockTest.java:155)
[2020-02-14T00:15:16.038Z] 	at org.junit.internal.runners.TestMethod.invoke(TestMethod.java:68)
[2020-02-14T00:15:16.038Z] 	at org.junit.internal.runners.MethodRoadie$2.run(MethodRoadie.java:89)
[2020-02-14T00:15:16.038Z] 	at org.junit.internal.runners.MethodRoadie.runBeforesThenTestThenAfters(MethodRoadie.java:97)
[2020-02-14T00:15:16.038Z] 	at org.junit.internal.runners.MethodRoadie.runTest(MethodRoadie.java:87)
[2020-02-14T00:15:16.038Z] 	at org.junit.internal.runners.MethodRoadie.run(MethodRoadie.java:50)
[2020-02-14T00:15:16.038Z] 	at org.junit.internal.runners.ClassRoadie.runUnprotected(ClassRoadie.java:34)
[2020-02-14T00:15:16.038Z] 	at org.junit.internal.runners.ClassRoadie.runProtected(ClassRoadie.java:44)
[2020-02-14T00:15:16.038Z] 	at junit.framework.JUnit4TestAdapter.run(JUnit4TestAdapter.java:50)
[2020-02-14T00:15:16.038Z] 	at junit.framework.TestSuite.runTest(TestSuite.java:241)
[2020-02-14T00:15:16.038Z] 	at junit.framework.TestSuite.run(TestSuite.java:236)
[2020-02-14T00:15:16.038Z] 	at org.apache.maven.shadefire.surefire.junit.JUnitTestSet.execute(JUnitTestSet.java:99)
[2020-02-14T00:15:16.039Z] 	at org.apache.maven.shadefire.surefire.junit.JUnit3Provider.executeTestSet(JUnit3Provider.java:141)
[2020-02-14T00:15:16.039Z] 	at org.apache.maven.shadefire.surefire.junit.JUnit3Provider.invoke(JUnit3Provider.java:114)
[2020-02-14T00:15:16.039Z] 	at org.apache.maven.shadefire.surefire.booter.ForkedBooter.runSuitesInProcess(ForkedBooter.java:377)
[2020-02-14T00:15:16.039Z] 	at org.apache.maven.shadefire.surefire.booter.ForkedBooter.execute(ForkedBooter.java:138)
[2020-02-14T00:15:16.039Z] 	at org.apache.maven.shadefire.surefire.booter.ForkedBooter.run(ForkedBooter.java:465)
[2020-02-14T00:15:16.039Z] 	at org.apache.maven.shadefire.surefire.booter.ForkedBooter.main(ForkedBooter.java:451)
[2020-02-14T00:15:16.039Z] [ERROR] Tests run: 139, Failures: 0, Errors: 1, Skipped: 0, Time
elapsed: 7.355 s <<< FAILURE! - in org.apache.maven.surefire.booter.JUnit4SuiteTest
[2020-02-14T00:15:16.039Z] [ERROR] org.apache.maven.surefire.booter.ClasspathTest.testLoadInNewClassLoader
 Time elapsed: 0.004 s  <<< ERROR!
[2020-02-14T00:15:16.039Z] java.net.MalformedURLException: no !/ in spec
[2020-02-14T00:15:16.039Z] 	at java.net.URL.<init>(URL.java:627)
[2020-02-14T00:15:16.039Z] 	at java.net.URL.<init>(URL.java:490)
[2020-02-14T00:15:16.039Z] 	at java.net.URL.<init>(URL.java:439)
[2020-02-14T00:15:16.039Z] 	at org.apache.maven.surefire.booter.ClasspathTest.testLoadInNewClassLoader(ClasspathTest.java:203)
[2020-02-14T00:15:16.039Z] Caused by: java.lang.NullPointerException: no !/ in spec
[2020-02-14T00:15:16.039Z] 	at sun.net.www.protocol.jar.Handler.parseAbsoluteSpec(Handler.java:171)
[2020-02-14T00:15:16.039Z] 	at sun.net.www.protocol.jar.Handler.parseURL(Handler.java:151)
[2020-02-14T00:15:16.039Z] 	at java.net.URL.<init>(URL.java:622)
[2020-02-14T00:15:16.039Z] 	... 28 more
[2020-02-14T00:15:16.039Z] 
[2020-02-14T00:15:16.039Z] [INFO] 
[2020-02-14T00:15:16.039Z] [INFO] Results:
[2020-02-14T00:15:16.039Z] [INFO] 
[2020-02-14T00:15:16.039Z] [ERROR] Errors: 
[2020-02-14T00:15:16.039Z] [ERROR]   org.apache.maven.surefire.booter.ClasspathTest#testLoadInNewClassLoader
MalformedURLException
[2020-02-14T00:15:16.039Z] [INFO] 
[2020-02-14T00:15:16.039Z] [ERROR] Tests run: 139, Failures: 0, Errors: 1, Skipped: 0
[2020-02-14T00:15:16.039Z] [INFO] 
[2020-02-14T00:15:16.039Z] [INFO] ------------------------------------------------------------------------
[2020-02-14T00:15:16.039Z] [INFO] Reactor Summary for Apache Maven Surefire 3.0.0-SNAPSHOT:
[2020-02-14T00:15:16.039Z] [INFO] 
[2020-02-14T00:15:16.039Z] [INFO] Apache Maven Surefire .............................. SUCCESS
[01:09 min]
[2020-02-14T00:15:16.039Z] [INFO] SureFire Logger API ................................ SUCCESS
[ 23.208 s]
[2020-02-14T00:15:16.039Z] [INFO] SureFire API ....................................... SUCCESS
[ 21.425 s]
[2020-02-14T00:15:16.039Z] [INFO] Surefire Extensions API ............................ SUCCESS
[  7.490 s]
[2020-02-14T00:15:16.039Z] [INFO] Surefire Extensions SPI ............................ SUCCESS
[  2.996 s]
[2020-02-14T00:15:16.039Z] [INFO] SureFire Booter .................................... FAILURE
[ 22.275 s]
[2020-02-14T00:15:16.039Z] [INFO] Maven Surefire Test-Grouping Support ............... SKIPPED
[2020-02-14T00:15:16.039Z] [INFO] SureFire Providers ................................. SKIPPED
[2020-02-14T00:15:16.039Z] [INFO] Shared JUnit3 Provider Code ........................ SKIPPED
[2020-02-14T00:15:16.039Z] [INFO] Shared Java 5 Provider Base ........................ SKIPPED
[2020-02-14T00:15:16.039Z] [INFO] Shared JUnit4 Provider Code ........................ SKIPPED
[2020-02-14T00:15:16.039Z] [INFO] Shared JUnit48 Provider Code ....................... SKIPPED
[2020-02-14T00:15:16.039Z] [INFO] SureFire JUnit Runner .............................. SKIPPED
[2020-02-14T00:15:16.039Z] [INFO] SureFire JUnit4 Runner ............................. SKIPPED
[2020-02-14T00:15:16.039Z] [INFO] Maven Surefire Common .............................. SKIPPED
[2020-02-14T00:15:16.039Z] [INFO] SureFire JUnitCore Runner .......................... SKIPPED
[2020-02-14T00:15:16.039Z] [INFO] SureFire JUnit Platform Runner ..................... SKIPPED
[2020-02-14T00:15:16.039Z] [INFO] SureFire TestNG Utils .............................. SKIPPED
[2020-02-14T00:15:16.039Z] [INFO] SureFire TestNG Runner ............................. SKIPPED
[2020-02-14T00:15:16.039Z] [INFO] ShadeFire JUnit3 Provider .......................... SKIPPED
[2020-02-14T00:15:16.039Z] [INFO] Surefire Report Parser ............................. SKIPPED
[2020-02-14T00:15:16.039Z] [INFO] Maven Surefire Plugin .............................. SKIPPED
[2020-02-14T00:15:16.039Z] [INFO] Maven Failsafe Plugin .............................. SKIPPED
[2020-02-14T00:15:16.039Z] [INFO] Maven Surefire Report Plugin ....................... SKIPPED
[2020-02-14T00:15:16.039Z] [INFO] Maven Surefire Integration Tests ................... SKIPPED
[2020-02-14T00:15:16.039Z] [INFO] Surefire Shared Utils .............................. SKIPPED
[2020-02-14T00:15:16.039Z] [INFO] ------------------------------------------------------------------------
[2020-02-14T00:15:16.039Z] [INFO] BUILD FAILURE
[2020-02-14T00:15:16.039Z] [INFO] ------------------------------------------------------------------------
[2020-02-14T00:15:16.039Z] [INFO] Total time:  02:28 min
[2020-02-14T00:15:16.039Z] [INFO] Finished at: 2020-02-13T16:15:15-08:00
[2020-02-14T00:15:16.039Z] [INFO] ------------------------------------------------------------------------
[2020-02-14T00:15:16.039Z] [ERROR] Failed to execute goal org.apache.maven.plugins:maven-surefire-plugin:3.0.0-M4:test
(default-test) on project surefire-booter: There are test failures.
[2020-02-14T00:15:16.039Z] [ERROR] 
[2020-02-14T00:15:16.039Z] [ERROR] Please refer to C:\Users\jenkins\AppData\Local\Temp\2\jenkins-maven-box-maven-surefire-maven2surefire-jvm-communication-45\surefire-booter\target\surefire-reports
for the individual test results.
[2020-02-14T00:15:16.039Z] [ERROR] Please refer to dump files (if any exist) [date].dump,
[date]-jvmRun[N].dump and [date].dumpstream.
[2020-02-14T00:15:16.040Z] [ERROR] -> [Help 1]
[2020-02-14T00:15:16.040Z] org.apache.maven.lifecycle.LifecycleExecutionException: Failed
to execute goal org.apache.maven.plugins:maven-surefire-plugin:3.0.0-M4:test (default-test)
on project surefire-booter: There are test failures.
[2020-02-14T00:15:16.040Z] 
[2020-02-14T00:15:16.040Z] Please refer to C:\Users\jenkins\AppData\Local\Temp\2\jenkins-maven-box-maven-surefire-maven2surefire-jvm-communication-45\surefire-booter\target\surefire-reports
for the individual test results.
[2020-02-14T00:15:16.040Z] Please refer to dump files (if any exist) [date].dump, [date]-jvmRun[N].dump
and [date].dumpstream.
[2020-02-14T00:15:16.040Z]     at org.apache.maven.lifecycle.internal.MojoExecutor.execute
(MojoExecutor.java:215)
[2020-02-14T00:15:16.040Z]     at org.apache.maven.lifecycle.internal.MojoExecutor.execute
(MojoExecutor.java:156)
[2020-02-14T00:15:16.040Z]     at org.apache.maven.lifecycle.internal.MojoExecutor.execute
(MojoExecutor.java:148)
[2020-02-14T00:15:16.040Z]     at org.apache.maven.lifecycle.internal.LifecycleModuleBuilder.buildProject
(LifecycleModuleBuilder.java:117)
[2020-02-14T00:15:16.040Z]     at org.apache.maven.lifecycle.internal.LifecycleModuleBuilder.buildProject
(LifecycleModuleBuilder.java:81)
[2020-02-14T00:15:16.040Z]     at org.apache.maven.lifecycle.internal.builder.singlethreaded.SingleThreadedBuilder.build
(SingleThreadedBuilder.java:56)
[2020-02-14T00:15:16.040Z]     at org.apache.maven.lifecycle.internal.LifecycleStarter.execute
(LifecycleStarter.java:128)
[2020-02-14T00:15:16.040Z]     at org.apache.maven.DefaultMaven.doExecute (DefaultMaven.java:305)
[2020-02-14T00:15:16.040Z]     at org.apache.maven.DefaultMaven.doExecute (DefaultMaven.java:192)
[2020-02-14T00:15:16.040Z]     at org.apache.maven.DefaultMaven.execute (DefaultMaven.java:105)
[2020-02-14T00:15:16.040Z]     at org.apache.maven.cli.MavenCli.execute (MavenCli.java:956)
[2020-02-14T00:15:16.040Z]     at org.apache.maven.cli.MavenCli.doMain (MavenCli.java:288)
[2020-02-14T00:15:16.040Z]     at org.apache.maven.cli.MavenCli.main (MavenCli.java:192)
[2020-02-14T00:15:16.040Z]     at sun.reflect.NativeMethodAccessorImpl.invoke0 (Native Method)
[2020-02-14T00:15:16.040Z]     at sun.reflect.NativeMethodAccessorImpl.invoke (NativeMethodAccessorImpl.java:62)
[2020-02-14T00:15:16.040Z]     at sun.reflect.DelegatingMethodAccessorImpl.invoke (DelegatingMethodAccessorImpl.java:43)
[2020-02-14T00:15:16.040Z]     at java.lang.reflect.Method.invoke (Method.java:498)
[2020-02-14T00:15:16.040Z]     at org.codehaus.plexus.classworlds.launcher.Launcher.launchEnhanced
(Launcher.java:282)
[2020-02-14T00:15:16.040Z]     at org.codehaus.plexus.classworlds.launcher.Launcher.launch
(Launcher.java:225)
[2020-02-14T00:15:16.040Z]     at org.codehaus.plexus.classworlds.launcher.Launcher.mainWithExitCode
(Launcher.java:406)
[2020-02-14T00:15:16.040Z]     at org.codehaus.plexus.classworlds.launcher.Launcher.main (Launcher.java:347)
[2020-02-14T00:15:16.040Z] Caused by: org.apache.maven.plugin.MojoFailureException: There
are test failures.
[2020-02-14T00:15:16.040Z] 
[2020-02-14T00:15:16.040Z] Please refer to C:\Users\jenkins\AppData\Local\Temp\2\jenkins-maven-box-maven-surefire-maven2surefire-jvm-communication-45\surefire-booter\target\surefire-reports
for the individual test results.
[2020-02-14T00:15:16.040Z] Please refer to dump files (if any exist) [date].dump, [date]-jvmRun[N].dump
and [date].dumpstream.
[2020-02-14T00:15:16.040Z]     at org.apache.maven.plugin.surefire.SurefireHelper.throwException
(SurefireHelper.java:271)
[2020-02-14T00:15:16.040Z]     at org.apache.maven.plugin.surefire.SurefireHelper.reportExecution
(SurefireHelper.java:159)
[2020-02-14T00:15:16.040Z]     at org.apache.maven.plugin.surefire.SurefirePlugin.handleSummary
(SurefirePlugin.java:435)
[2020-02-14T00:15:16.040Z]     at org.apache.maven.plugin.surefire.AbstractSurefireMojo.executeAfterPreconditionsChecked
(AbstractSurefireMojo.java:1079)
[2020-02-14T00:15:16.040Z]     at org.apache.maven.plugin.surefire.AbstractSurefireMojo.execute
(AbstractSurefireMojo.java:889)
[2020-02-14T00:15:16.040Z]     at org.apache.maven.plugin.DefaultBuildPluginManager.executeMojo
(DefaultBuildPluginManager.java:137)
[2020-02-14T00:15:16.041Z]     at org.apache.maven.lifecycle.internal.MojoExecutor.execute
(MojoExecutor.java:210)
[2020-02-14T00:15:16.041Z]     at org.apache.maven.lifecycle.internal.MojoExecutor.execute
(MojoExecutor.java:156)
[2020-02-14T00:15:16.041Z]     at org.apache.maven.lifecycle.internal.MojoExecutor.execute
(MojoExecutor.java:148)
[2020-02-14T00:15:16.041Z]     at org.apache.maven.lifecycle.internal.LifecycleModuleBuilder.buildProject
(LifecycleModuleBuilder.java:117)
[2020-02-14T00:15:16.041Z]     at org.apache.maven.lifecycle.internal.LifecycleModuleBuilder.buildProject
(LifecycleModuleBuilder.java:81)
[2020-02-14T00:15:16.041Z]     at org.apache.maven.lifecycle.internal.builder.singlethreaded.SingleThreadedBuilder.build
(SingleThreadedBuilder.java:56)
[2020-02-14T00:15:16.041Z]     at org.apache.maven.lifecycle.internal.LifecycleStarter.execute
(LifecycleStarter.java:128)
[2020-02-14T00:15:16.041Z]     at org.apache.maven.DefaultMaven.doExecute (DefaultMaven.java:305)
[2020-02-14T00:15:16.041Z]     at org.apache.maven.DefaultMaven.doExecute (DefaultMaven.java:192)
[2020-02-14T00:15:16.041Z]     at org.apache.maven.DefaultMaven.execute (DefaultMaven.java:105)
[2020-02-14T00:15:16.041Z]     at org.apache.maven.cli.MavenCli.execute (MavenCli.java:956)
[2020-02-14T00:15:16.041Z]     at org.apache.maven.cli.MavenCli.doMain (MavenCli.java:288)
[2020-02-14T00:15:16.041Z]     at org.apache.maven.cli.MavenCli.main (MavenCli.java:192)
[2020-02-14T00:15:16.041Z]     at sun.reflect.NativeMethodAccessorImpl.invoke0 (Native Method)
[2020-02-14T00:15:16.041Z]     at sun.reflect.NativeMethodAccessorImpl.invoke (NativeMethodAccessorImpl.java:62)
[2020-02-14T00:15:16.041Z]     at sun.reflect.DelegatingMethodAccessorImpl.invoke (DelegatingMethodAccessorImpl.java:43)
[2020-02-14T00:15:16.041Z]     at java.lang.reflect.Method.invoke (Method.java:498)
[2020-02-14T00:15:16.041Z]     at org.codehaus.plexus.classworlds.launcher.Launcher.launchEnhanced
(Launcher.java:282)
[2020-02-14T00:15:16.041Z]     at org.codehaus.plexus.classworlds.launcher.Launcher.launch
(Launcher.java:225)
[2020-02-14T00:15:16.041Z]     at org.codehaus.plexus.classworlds.launcher.Launcher.mainWithExitCode
(Launcher.java:406)
[2020-02-14T00:15:16.041Z]     at org.codehaus.plexus.classworlds.launcher.Launcher.main (Launcher.java:347)
[2020-02-14T00:15:16.041Z] [ERROR] 
[2020-02-14T00:15:16.041Z] [ERROR] Re-run Maven using the -X switch to enable full debug logging.
[2020-02-14T00:15:16.041Z] [ERROR] 
[2020-02-14T00:15:16.041Z] [ERROR] For more information about the errors and possible solutions,
please read the following articles:
[2020-02-14T00:15:16.041Z] [ERROR] [Help 1] http://cwiki.apache.org/confluence/display/MAVEN/MojoFailureException
[2020-02-14T00:15:16.041Z] [ERROR] 
[2020-02-14T00:15:16.041Z] [ERROR] After correcting the problems, you can resume the build
with the command
[2020-02-14T00:15:16.041Z] [ERROR]   mvn <args> -rf :surefire-booter
[Pipeline] // node
[Pipeline] }
[Pipeline] }
[Pipeline] // withEnv
[Pipeline] }
[Pipeline] // stage
[Pipeline] fileExists
[Pipeline] fileExists
[Pipeline] archiveArtifacts
[2020-02-14T00:15:16.338Z] Archiving artifacts
[Pipeline] cleanWs
[2020-02-14T00:15:16.419Z] [WS-CLEANUP] Deleting project workspace...
[2020-02-14T00:15:16.419Z] [WS-CLEANUP] Deferred wipeout is used...
[2020-02-14T00:15:16.477Z] [WS-CLEANUP] done
[Pipeline] }
[Pipeline] // ws
[Pipeline] }
[Pipeline] // timestamps
[Pipeline] }
[Pipeline] // node
[Pipeline] }
[Pipeline] // parallel
[Pipeline] echo
Build result: FAILURE
[Pipeline] jiraIssueSelector
[Pipeline] echo
The authors of changes [tibordigana].
[Pipeline] echo
Sending email ...
[Pipeline] emailext
Mime
  • Unnamed multipart/mixed (inline, None, 0 bytes)
View raw message