maven-notifications mailing list archives

Site index · List index
Message view « Date » · « Thread »
Top « Date » · « Thread »
From Apache Jenkins Server <jenk...@builds.apache.org>
Subject Build failed in Jenkins: Maven TLP » maven-source-plugin » MSOURCES-120 #3
Date Mon, 26 Aug 2019 10:40:59 GMT
See https://builds.apache.org/job/maven-box/job/maven-source-plugin/job/MSOURCES-120/3/

Changes:

* MSOURCES-120 sort archive entries
* MSOURCES-120 sort archive entries
* MSOURCES-120 sort archive entries

No tests ran.

Build log:
[...truncated 5658 lines...]
[INFO] Downloaded from central: https://repo.maven.apache.org/maven2/org/apache/maven/maven-archiver/3.4.0/maven-archiver-3.4.0.jar
(24 kB at 165 kB/s)
[INFO] Downloading from central: https://repo.maven.apache.org/maven2/org/apache/maven/wagon/wagon-provider-api/1.0-beta-6/wagon-provider-api-1.0-beta-6.jar
[INFO] Downloaded from central: https://repo.maven.apache.org/maven2/org/apache/maven/plugin-testing/maven-plugin-testing-harness/2.1/maven-plugin-testing-harness-2.1.jar
(39 kB at 243 kB/s)
[INFO] Downloading from central: https://repo.maven.apache.org/maven2/junit/junit/4.12/junit-4.12.jar
[INFO] Downloaded from central: https://repo.maven.apache.org/maven2/commons-io/commons-io/2.5/commons-io-2.5.jar
(209 kB at 1.3 MB/s)
[INFO] Downloading from central: https://repo.maven.apache.org/maven2/org/hamcrest/hamcrest-core/1.3/hamcrest-core-1.3.jar
[INFO] Downloaded from central: https://repo.maven.apache.org/maven2/org/apache/maven/wagon/wagon-provider-api/1.0-beta-6/wagon-provider-api-1.0-beta-6.jar
(53 kB at 318 kB/s)
[INFO] Downloaded from central: https://repo.maven.apache.org/maven2/org/apache/maven/shared/maven-shared-utils/3.2.1/maven-shared-utils-3.2.1.jar
(167 kB at 997 kB/s)
[INFO] Downloaded from central: https://repo.maven.apache.org/maven2/org/hamcrest/hamcrest-core/1.3/hamcrest-core-1.3.jar
(45 kB at 250 kB/s)
[INFO] Downloaded from central: https://repo.maven.apache.org/maven2/org/apache/maven/maven-compat/3.0/maven-compat-3.0.jar
(285 kB at 1.5 MB/s)
[INFO] Downloaded from central: https://repo.maven.apache.org/maven2/junit/junit/4.12/junit-4.12.jar
(315 kB at 1.7 MB/s)
[INFO] Downloading from Nexus: http://repository.apache.org/snapshots/org/codehaus/plexus/plexus-archiver/4.2.0-SNAPSHOT/plexus-archiver-4.2.0-SNAPSHOT.jar
[INFO] Downloading from Nexus: http://repository.apache.org/snapshots/org/apache/commons/commons-compress/1.19-SNAPSHOT/commons-compress-1.19-SNAPSHOT.jar
[INFO] Downloading from Nexus: http://repository.apache.org/snapshots/org/codehaus/plexus/plexus-utils/3.3.0-SNAPSHOT/plexus-utils-3.3.0-SNAPSHOT.jar
[INFO] ------------------------------------------------------------------------
[INFO] BUILD FAILURE
[INFO] ------------------------------------------------------------------------
[INFO] Total time:  6.295 s
[INFO] Finished at: 2019-08-26T10:40:38Z
[INFO] ------------------------------------------------------------------------
[INFO] [jenkins-event-spy] Generated /home/jenkins/jenkins-slave/workspace/maven-source-plugin_MSOURCES-120@3@tmp/withMavenc4286b66/maven-spy-20190826-104032-73987075748389862046.log
[ERROR] Failed to execute goal on project maven-source-plugin: Could not resolve dependencies
for project org.apache.maven.plugins:maven-source-plugin:maven-plugin:3.1.1-SNAPSHOT: The
following artifacts could not be resolved: org.codehaus.plexus:plexus-archiver:jar:4.2.0-SNAPSHOT,
org.codehaus.plexus:plexus-utils:jar:3.3.0-SNAPSHOT, org.apache.commons:commons-compress:jar:1.19-SNAPSHOT:
Could not find artifact org.codehaus.plexus:plexus-archiver:jar:4.2.0-SNAPSHOT in Nexus (http://repository.apache.org/snapshots)
-> [Help 1]
org.apache.maven.lifecycle.LifecycleExecutionException: Failed to execute goal on project
maven-source-plugin: Could not resolve dependencies for project org.apache.maven.plugins:maven-source-plugin:maven-plugin:3.1.1-SNAPSHOT:
The following artifacts could not be resolved: org.codehaus.plexus:plexus-archiver:jar:4.2.0-SNAPSHOT,
org.codehaus.plexus:plexus-utils:jar:3.3.0-SNAPSHOT, org.apache.commons:commons-compress:jar:1.19-SNAPSHOT:
Could not find artifact org.codehaus.plexus:plexus-archiver:jar:4.2.0-SNAPSHOT in Nexus (http://repository.apache.org/snapshots)
    at org.apache.maven.lifecycle.internal.LifecycleDependencyResolver.getDependencies (LifecycleDependencyResolver.java:269)
    at org.apache.maven.lifecycle.internal.LifecycleDependencyResolver.resolveProjectDependencies
(LifecycleDependencyResolver.java:147)
    at org.apache.maven.lifecycle.internal.MojoExecutor.ensureDependenciesAreResolved (MojoExecutor.java:248)
    at org.apache.maven.lifecycle.internal.MojoExecutor.execute (MojoExecutor.java:202)
    at org.apache.maven.lifecycle.internal.MojoExecutor.execute (MojoExecutor.java:156)
    at org.apache.maven.lifecycle.internal.MojoExecutor.execute (MojoExecutor.java:148)
    at org.apache.maven.lifecycle.internal.LifecycleModuleBuilder.buildProject (LifecycleModuleBuilder.java:117)
    at org.apache.maven.lifecycle.internal.LifecycleModuleBuilder.buildProject (LifecycleModuleBuilder.java:81)
    at org.apache.maven.lifecycle.internal.builder.singlethreaded.SingleThreadedBuilder.build
(SingleThreadedBuilder.java:56)
    at org.apache.maven.lifecycle.internal.LifecycleStarter.execute (LifecycleStarter.java:128)
    at org.apache.maven.DefaultMaven.doExecute (DefaultMaven.java:305)
    at org.apache.maven.DefaultMaven.doExecute (DefaultMaven.java:192)
    at org.apache.maven.DefaultMaven.execute (DefaultMaven.java:105)
    at org.apache.maven.cli.MavenCli.execute (MavenCli.java:956)
    at org.apache.maven.cli.MavenCli.doMain (MavenCli.java:288)
    at org.apache.maven.cli.MavenCli.main (MavenCli.java:192)
    at sun.reflect.NativeMethodAccessorImpl.invoke0 (Native Method)
    at sun.reflect.NativeMethodAccessorImpl.invoke (NativeMethodAccessorImpl.java:57)
    at sun.reflect.DelegatingMethodAccessorImpl.invoke (DelegatingMethodAccessorImpl.java:43)
    at java.lang.reflect.Method.invoke (Method.java:606)
    at org.codehaus.plexus.classworlds.launcher.Launcher.launchEnhanced (Launcher.java:289)
    at org.codehaus.plexus.classworlds.launcher.Launcher.launch (Launcher.java:229)
    at org.codehaus.plexus.classworlds.launcher.Launcher.mainWithExitCode (Launcher.java:415)
    at org.codehaus.plexus.classworlds.launcher.Launcher.main (Launcher.java:356)
Caused by: org.apache.maven.project.DependencyResolutionException: Could not resolve dependencies
for project org.apache.maven.plugins:maven-source-plugin:maven-plugin:3.1.1-SNAPSHOT: The
following artifacts could not be resolved: org.codehaus.plexus:plexus-archiver:jar:4.2.0-SNAPSHOT,
org.codehaus.plexus:plexus-utils:jar:3.3.0-SNAPSHOT, org.apache.commons:commons-compress:jar:1.19-SNAPSHOT:
Could not find artifact org.codehaus.plexus:plexus-archiver:jar:4.2.0-SNAPSHOT in Nexus (http://repository.apache.org/snapshots)
    at org.apache.maven.project.DefaultProjectDependenciesResolver.resolve (DefaultProjectDependenciesResolver.java:208)
    at org.apache.maven.lifecycle.internal.LifecycleDependencyResolver.getDependencies (LifecycleDependencyResolver.java:243)
    at org.apache.maven.lifecycle.internal.LifecycleDependencyResolver.resolveProjectDependencies
(LifecycleDependencyResolver.java:147)
    at org.apache.maven.lifecycle.internal.MojoExecutor.ensureDependenciesAreResolved (MojoExecutor.java:248)
    at org.apache.maven.lifecycle.internal.MojoExecutor.execute (MojoExecutor.java:202)
    at org.apache.maven.lifecycle.internal.MojoExecutor.execute (MojoExecutor.java:156)
    at org.apache.maven.lifecycle.internal.MojoExecutor.execute (MojoExecutor.java:148)
    at org.apache.maven.lifecycle.internal.LifecycleModuleBuilder.buildProject (LifecycleModuleBuilder.java:117)
    at org.apache.maven.lifecycle.internal.LifecycleModuleBuilder.buildProject (LifecycleModuleBuilder.java:81)
    at org.apache.maven.lifecycle.internal.builder.singlethreaded.SingleThreadedBuilder.build
(SingleThreadedBuilder.java:56)
    at org.apache.maven.lifecycle.internal.LifecycleStarter.execute (LifecycleStarter.java:128)
    at org.apache.maven.DefaultMaven.doExecute (DefaultMaven.java:305)
    at org.apache.maven.DefaultMaven.doExecute (DefaultMaven.java:192)
    at org.apache.maven.DefaultMaven.execute (DefaultMaven.java:105)
    at org.apache.maven.cli.MavenCli.execute (MavenCli.java:956)
    at org.apache.maven.cli.MavenCli.doMain (MavenCli.java:288)
    at org.apache.maven.cli.MavenCli.main (MavenCli.java:192)
    at sun.reflect.NativeMethodAccessorImpl.invoke0 (Native Method)
    at sun.reflect.NativeMethodAccessorImpl.invoke (NativeMethodAccessorImpl.java:57)
    at sun.reflect.DelegatingMethodAccessorImpl.invoke (DelegatingMethodAccessorImpl.java:43)
    at java.lang.reflect.Method.invoke (Method.java:606)
    at org.codehaus.plexus.classworlds.launcher.Launcher.launchEnhanced (Launcher.java:289)
    at org.codehaus.plexus.classworlds.launcher.Launcher.launch (Launcher.java:229)
    at org.codehaus.plexus.classworlds.launcher.Launcher.mainWithExitCode (Launcher.java:415)
    at org.codehaus.plexus.classworlds.launcher.Launcher.main (Launcher.java:356)
Caused by: org.eclipse.aether.resolution.DependencyResolutionException: The following artifacts
could not be resolved: org.codehaus.plexus:plexus-archiver:jar:4.2.0-SNAPSHOT, org.codehaus.plexus:plexus-utils:jar:3.3.0-SNAPSHOT,
org.apache.commons:commons-compress:jar:1.19-SNAPSHOT: Could not find artifact org.codehaus.plexus:plexus-archiver:jar:4.2.0-SNAPSHOT
in Nexus (http://repository.apache.org/snapshots)
    at org.eclipse.aether.internal.impl.DefaultRepositorySystem.resolveDependencies (DefaultRepositorySystem.java:342)
    at org.apache.maven.project.DefaultProjectDependenciesResolver.resolve (DefaultProjectDependenciesResolver.java:202)
    at org.apache.maven.lifecycle.internal.LifecycleDependencyResolver.getDependencies (LifecycleDependencyResolver.java:243)
    at org.apache.maven.lifecycle.internal.LifecycleDependencyResolver.resolveProjectDependencies
(LifecycleDependencyResolver.java:147)
    at org.apache.maven.lifecycle.internal.MojoExecutor.ensureDependenciesAreResolved (MojoExecutor.java:248)
    at org.apache.maven.lifecycle.internal.MojoExecutor.execute (MojoExecutor.java:202)
    at org.apache.maven.lifecycle.internal.MojoExecutor.execute (MojoExecutor.java:156)
    at org.apache.maven.lifecycle.internal.MojoExecutor.execute (MojoExecutor.java:148)
    at org.apache.maven.lifecycle.internal.LifecycleModuleBuilder.buildProject (LifecycleModuleBuilder.java:117)
    at org.apache.maven.lifecycle.internal.LifecycleModuleBuilder.buildProject (LifecycleModuleBuilder.java:81)
    at org.apache.maven.lifecycle.internal.builder.singlethreaded.SingleThreadedBuilder.build
(SingleThreadedBuilder.java:56)
    at org.apache.maven.lifecycle.internal.LifecycleStarter.execute (LifecycleStarter.java:128)
    at org.apache.maven.DefaultMaven.doExecute (DefaultMaven.java:305)
    at org.apache.maven.DefaultMaven.doExecute (DefaultMaven.java:192)
    at org.apache.maven.DefaultMaven.execute (DefaultMaven.java:105)
    at org.apache.maven.cli.MavenCli.execute (MavenCli.java:956)
    at org.apache.maven.cli.MavenCli.doMain (MavenCli.java:288)
    at org.apache.maven.cli.MavenCli.main (MavenCli.java:192)
    at sun.reflect.NativeMethodAccessorImpl.invoke0 (Native Method)
    at sun.reflect.NativeMethodAccessorImpl.invoke (NativeMethodAccessorImpl.java:57)
    at sun.reflect.DelegatingMethodAccessorImpl.invoke (DelegatingMethodAccessorImpl.java:43)
    at java.lang.reflect.Method.invoke (Method.java:606)
    at org.codehaus.plexus.classworlds.launcher.Launcher.launchEnhanced (Launcher.java:289)
    at org.codehaus.plexus.classworlds.launcher.Launcher.launch (Launcher.java:229)
    at org.codehaus.plexus.classworlds.launcher.Launcher.mainWithExitCode (Launcher.java:415)
    at org.codehaus.plexus.classworlds.launcher.Launcher.main (Launcher.java:356)
Caused by: org.eclipse.aether.resolution.ArtifactResolutionException: The following artifacts
could not be resolved: org.codehaus.plexus:plexus-archiver:jar:4.2.0-SNAPSHOT, org.codehaus.plexus:plexus-utils:jar:3.3.0-SNAPSHOT,
org.apache.commons:commons-compress:jar:1.19-SNAPSHOT: Could not find artifact org.codehaus.plexus:plexus-archiver:jar:4.2.0-SNAPSHOT
in Nexus (http://repository.apache.org/snapshots)
    at org.eclipse.aether.internal.impl.DefaultArtifactResolver.resolve (DefaultArtifactResolver.java:413)
    at org.eclipse.aether.internal.impl.DefaultArtifactResolver.resolveArtifacts (DefaultArtifactResolver.java:215)
    at org.eclipse.aether.internal.impl.DefaultRepositorySystem.resolveDependencies (DefaultRepositorySystem.java:325)
    at org.apache.maven.project.DefaultProjectDependenciesResolver.resolve (DefaultProjectDependenciesResolver.java:202)
    at org.apache.maven.lifecycle.internal.LifecycleDependencyResolver.getDependencies (LifecycleDependencyResolver.java:243)
    at org.apache.maven.lifecycle.internal.LifecycleDependencyResolver.resolveProjectDependencies
(LifecycleDependencyResolver.java:147)
    at org.apache.maven.lifecycle.internal.MojoExecutor.ensureDependenciesAreResolved (MojoExecutor.java:248)
    at org.apache.maven.lifecycle.internal.MojoExecutor.execute (MojoExecutor.java:202)
    at org.apache.maven.lifecycle.internal.MojoExecutor.execute (MojoExecutor.java:156)
    at org.apache.maven.lifecycle.internal.MojoExecutor.execute (MojoExecutor.java:148)
    at org.apache.maven.lifecycle.internal.LifecycleModuleBuilder.buildProject (LifecycleModuleBuilder.java:117)
    at org.apache.maven.lifecycle.internal.LifecycleModuleBuilder.buildProject (LifecycleModuleBuilder.java:81)
    at org.apache.maven.lifecycle.internal.builder.singlethreaded.SingleThreadedBuilder.build
(SingleThreadedBuilder.java:56)
    at org.apache.maven.lifecycle.internal.LifecycleStarter.execute (LifecycleStarter.java:128)
    at org.apache.maven.DefaultMaven.doExecute (DefaultMaven.java:305)
    at org.apache.maven.DefaultMaven.doExecute (DefaultMaven.java:192)
    at org.apache.maven.DefaultMaven.execute (DefaultMaven.java:105)
    at org.apache.maven.cli.MavenCli.execute (MavenCli.java:956)
    at org.apache.maven.cli.MavenCli.doMain (MavenCli.java:288)
    at org.apache.maven.cli.MavenCli.main (MavenCli.java:192)
    at sun.reflect.NativeMethodAccessorImpl.invoke0 (Native Method)
    at sun.reflect.NativeMethodAccessorImpl.invoke (NativeMethodAccessorImpl.java:57)
    at sun.reflect.DelegatingMethodAccessorImpl.invoke (DelegatingMethodAccessorImpl.java:43)
    at java.lang.reflect.Method.invoke (Method.java:606)
    at org.codehaus.plexus.classworlds.launcher.Launcher.launchEnhanced (Launcher.java:289)
    at org.codehaus.plexus.classworlds.launcher.Launcher.launch (Launcher.java:229)
    at org.codehaus.plexus.classworlds.launcher.Launcher.mainWithExitCode (Launcher.java:415)
    at org.codehaus.plexus.classworlds.launcher.Launcher.main (Launcher.java:356)
Caused by: org.eclipse.aether.transfer.ArtifactNotFoundException: Could not find artifact
org.codehaus.plexus:plexus-archiver:jar:4.2.0-SNAPSHOT in Nexus (http://repository.apache.org/snapshots)
    at org.eclipse.aether.connector.basic.ArtifactTransportListener.transferFailed (ArtifactTransportListener.java:48)
    at org.eclipse.aether.connector.basic.BasicRepositoryConnector$TaskRunner.run (BasicRepositoryConnector.java:368)
    at org.eclipse.aether.util.concurrency.RunnableErrorForwarder$1.run (RunnableErrorForwarder.java:75)
    at java.util.concurrent.ThreadPoolExecutor.runWorker (ThreadPoolExecutor.java:1145)
    at java.util.concurrent.ThreadPoolExecutor$Worker.run (ThreadPoolExecutor.java:615)
    at java.lang.Thread.run (Thread.java:745)
[ERROR] 
[ERROR] Re-run Maven using the -X switch to enable full debug logging.
[ERROR] 
[ERROR] For more information about the errors and possible solutions, please read the following
articles:
[ERROR] [Help 1] http://cwiki.apache.org/confluence/display/MAVEN/DependencyResolutionException
[Pipeline] }
[Pipeline] // dir
[Pipeline] }
[Pipeline] }
[Pipeline] // dir
[Pipeline] }
[withMaven] Evaluate Maven Spy logs: /home/jenkins/jenkins-slave/workspace/maven-source-plugin_MSOURCES-120@3@tmp/withMavenc4286b66/maven-spy-20190826-104032-73987075748389862046.log
[withMaven] Evaluate Maven Spy logs: /home/jenkins/jenkins-slave/workspace/maven-source-plugin_MSOURCES-120@2@2@tmp/withMavenc0e317c9/maven-spy-20190826-104032-4156093494058908266971.log
[withMaven] Maven Publisher Strategy: Explicit
[withMaven] Maven Publisher Strategy: Explicit
[withMaven] Maven Publishers: [org.jenkinsci.plugins.pipeline.maven.publishers.GeneratedArtifactsPublisher[disabled=false],
JunitTestsPublisher[disabled=false,healthScaleFactor=,keepLongStdio=false,ignoreAttachments=false],
org.jenkinsci.plugins.pipeline.maven.publishers.FindbugsAnalysisPublisher[disabled='false',
healthy='', unHealthy='', thresholdLimit='low'], org.jenkinsci.plugins.pipeline.maven.publishers.TasksScannerPublisher[disabled='false',
healthy='', unHealthy='', thresholdLimit='low'], org.jenkinsci.plugins.pipeline.maven.publishers.DependenciesFingerprintPublisher[disabled=false,
scopes=[compile, provided, runtime], versions={snapshot:true, release:false}], org.jenkinsci.plugins.pipeline.maven.publishers.InvokerRunsPublisher[disabled=false],
org.jenkinsci.plugins.pipeline.maven.publishers.PipelineGraphPublisher[disabled=false, scopes=[compile,
provided, runtime], versions={snapshot:true, release:false}, skipDownstreamTriggers=false,
lifecycleThreshold=deploy, ignoreUpstreamTriggers=false], org.jenkinsci.plugins.pipeline.maven.publishers.MavenLinkerPublisher2[disabled=false]]
[withMaven] Maven Publishers: [org.jenkinsci.plugins.pipeline.maven.publishers.GeneratedArtifactsPublisher[disabled=false],
JunitTestsPublisher[disabled=false,healthScaleFactor=,keepLongStdio=false,ignoreAttachments=false],
org.jenkinsci.plugins.pipeline.maven.publishers.FindbugsAnalysisPublisher[disabled='false',
healthy='', unHealthy='', thresholdLimit='low'], org.jenkinsci.plugins.pipeline.maven.publishers.TasksScannerPublisher[disabled='false',
healthy='', unHealthy='', thresholdLimit='low'], org.jenkinsci.plugins.pipeline.maven.publishers.DependenciesFingerprintPublisher[disabled=false,
scopes=[compile, provided, runtime], versions={snapshot:true, release:false}], org.jenkinsci.plugins.pipeline.maven.publishers.InvokerRunsPublisher[disabled=false],
org.jenkinsci.plugins.pipeline.maven.publishers.PipelineGraphPublisher[disabled=false, scopes=[compile,
provided, runtime], versions={snapshot:true, release:false}, skipDownstreamTriggers=false,
lifecycleThreshold=deploy, ignoreUpstreamTriggers=false], org.jenkinsci.plugins.pipeline.maven.publishers.MavenLinkerPublisher2[disabled=false]]
[withMaven] Run 'Generated Artifacts Publisher'...
[withMaven] artifactsPublisher - Archive and fingerprint artifacts {} located in workspace
/home/jenkins/jenkins-slave/workspace/maven-source-plugin_MSOURCES-120@2@2
[Fast Archiver] No prior successful build to compare, so performing full copy of artifacts
[withMaven] Run 'Generated Artifacts Publisher'...
[withMaven] artifactsPublisher - Archive and fingerprint artifacts {} located in workspace
/home/jenkins/jenkins-slave/workspace/maven-source-plugin_MSOURCES-120@3
[Fast Archiver] No prior successful build to compare, so performing full copy of artifacts
[withMaven] Run 'Junit Publisher'...
[withMaven] junitPublisher - No org.apache.maven.plugins:maven-surefire-plugin:test execution
found
[withMaven] junitPublisher - No org.apache.maven.plugins:maven-failsafe-plugin:integration-test
execution found
[withMaven] junitPublisher - No org.apache.maven.plugins:tycho-surefire-plugin:test execution
found
[withMaven] Run 'Junit Publisher'...
[withMaven] junitPublisher - No org.apache.maven.plugins:maven-surefire-plugin:test execution
found
[withMaven] junitPublisher - No org.apache.maven.plugins:maven-failsafe-plugin:integration-test
execution found
[withMaven] junitPublisher - No org.apache.maven.plugins:tycho-surefire-plugin:test execution
found
[withMaven] Run 'Findbugs Publisher'...
[withMaven] Run 'Findbugs Publisher'...
[withMaven] Run 'Open Task Scanner Publisher'...
[withMaven] Run 'Open Task Scanner Publisher'...
[withMaven] openTasksPublisher - Scan Tasks for Maven artifact org.apache.maven.plugins:maven-source-plugin:maven-plugin:3.1.1-SNAPSHOT
in source directory linux-jdk7-m3.5.x_build/src/main/java
[withMaven] openTasksPublisher - Scan Tasks for Maven artifact org.apache.maven.plugins:maven-source-plugin:maven-plugin:3.1.1-SNAPSHOT
in source directory linux-jdk7-m3.6.x_build/src/main/java
[TASKS] Scanning folder '/home/jenkins/jenkins-slave/workspace/maven-source-plugin_MSOURCES-120@2@2'
for files matching the pattern 'linux-jdk7-m3.5.x_build/src/main/java/**/*' - excludes: null
[TASKS] Found 7 files to scan for tasks
[TASKS] Found 0 open tasks.
Skipping warnings blame since pipelines do not have an SCM link.%n
[TASKS] Scanning folder '/home/jenkins/jenkins-slave/workspace/maven-source-plugin_MSOURCES-120@3'
for files matching the pattern 'linux-jdk7-m3.6.x_build/src/main/java/**/*' - excludes: null
[TASKS] Found 7 files to scan for tasks
[TASKS] Found 0 open tasks.
Skipping warnings blame since pipelines do not have an SCM link.%n
[withMaven] Run 'Dependencies Fingerprint Publisher'...
[withMaven] dependenciesFingerprintPublisher - filter: versions[snapshot: true, release: false],
scopes:[compile, provided, runtime]
[withMaven] Run 'Dependencies Fingerprint Publisher'...
[withMaven] dependenciesFingerprintPublisher - filter: versions[snapshot: true, release: false],
scopes:[compile, provided, runtime]
[withMaven] Run 'Invoker Publisher'...
[withMaven] invokerPublisher - No org.apache.maven.plugins:maven-invoker-plugin:run or org.apache.maven.plugins:maven-invoker-plugin:integration-test
execution found
[withMaven] Run 'Invoker Publisher'...
[withMaven] invokerPublisher - No org.apache.maven.plugins:maven-invoker-plugin:run or org.apache.maven.plugins:maven-invoker-plugin:integration-test
execution found
[withMaven] Run 'Pipeline Graph Publisher'...
[withMaven] pipelineGraphPublisher - recordParentProject - filter: versions[snapshot: true,
release: false]
[withMaven] pipelineGraphPublisher - Skip recording release parent project: org.apache.maven.plugins:maven-plugins:null:33
[withMaven] pipelineGraphPublisher - recordDependencies - filter: versions[snapshot: true,
release: false], scopes:[compile, provided, runtime]
[withMaven] pipelineGraphPublisher - recordGeneratedArtifacts...
[withMaven] Run 'Pipeline Graph Publisher'...
[withMaven] pipelineGraphPublisher - recordParentProject - filter: versions[snapshot: true,
release: false]
[withMaven] pipelineGraphPublisher - Skip recording release parent project: org.apache.maven.plugins:maven-plugins:null:33
[withMaven] pipelineGraphPublisher - recordDependencies - filter: versions[snapshot: true,
release: false], scopes:[compile, provided, runtime]
[withMaven] pipelineGraphPublisher - recordGeneratedArtifacts...
[withMaven] Run 'Maven Linker Publisher'...
[withMaven] Publishers: Generated Artifacts Publisher: 3819 ms, Open Task Scanner Publisher:
6393 ms
[withMaven] Run 'Maven Linker Publisher'...
[withMaven] Publishers: Generated Artifacts Publisher: 3818 ms, Open Task Scanner Publisher:
6392 ms
[Pipeline] // withMaven
[Pipeline] // withMaven
[Pipeline] cleanWs
[Pipeline] cleanWs
[WS-CLEANUP] Deleting project workspace...
[WS-CLEANUP] Deferred wipeout is used...
[WS-CLEANUP] Deleting project workspace...
[WS-CLEANUP] Deferred wipeout is used...
[WS-CLEANUP] done
[WS-CLEANUP] done
[Pipeline] cleanWs
[Pipeline] cleanWs
[WS-CLEANUP] Deleting project workspace...
[WS-CLEANUP] Deferred wipeout is used...
[WS-CLEANUP] Deleting project workspace...
[WS-CLEANUP] Deferred wipeout is used...
[WS-CLEANUP] done
[Pipeline] }
[Pipeline] // stage
[Pipeline] }
[Pipeline] // ws
[WS-CLEANUP] done
[Pipeline] }
[Pipeline] // node
[Pipeline] }
Failed in branch linux-jdk7-m3.6.x_build
[Pipeline] }
[Pipeline] // stage
[Pipeline] }
[Pipeline] // ws
[Pipeline] }
[Pipeline] // node
[Pipeline] }
Failed in branch linux-jdk7-m3.5.x_build
[Pipeline] // parallel
[Pipeline] stage
[Pipeline] { (Notifications)
[Pipeline] echo
Build result: FAILURE
[Pipeline] jiraIssueSelector
[Pipeline] jiraComment
[Pipeline] echo
The authors of changes [hboutemy].
[Pipeline] echo
Sending email ...
[Pipeline] emailext
Mime
  • Unnamed multipart/mixed (inline, None, 0 bytes)
View raw message