See https://builds.apache.org/job/maven-box/job/maven-javadoc-plugin/job/master/14/ No changes. 2 tests failed. FAILED: org.apache.maven.plugins.javadoc.JavadocReportTest.linux-jdk12-m3.5.x_build / Build linux-jdk12-m3.5.x_build / testDefaultConfiguration Error Message: https://docs.oracle.com/en/java/javase/12/docs/api/ available, but def/configuration/App.html is missing link to java.lang.Object Expected: a string containing "/docs/api/java/lang/Object.html" but: was " App (Maven Javadoc Plugin Default configuration Test 1.0-SNAPSHOT API)

Class App


  • public class App
    extends java.lang.Object
    • Constructor Summary

      Constructors 
      Constructor Description
      App()  
    • Method Summary

      Modifier and Type Method Description
      static void main​(java.lang.String[] args)  
      protected void sampleMethod​(java.lang.String str)  
      • Methods inherited from class java.lang.Object

        clone, equals, finalize, getClass, hashCode, notify, notifyAll, toString, wait, wait, wait
    • Constructor Detail

      • App

        public App()
    • Method Detail

      • main

        public static void main​(java.lang.String[] args)
      • sampleMethod

        protected void sampleMethod​(java.lang.String str)
" Stack Trace: java.lang.AssertionError: https://docs.oracle.com/en/java/javase/12/docs/api/ available, but def/configuration/App.html is missing link to java.lang.Object Expected: a string containing "/docs/api/java/lang/Object.html" but: was " App (Maven Javadoc Plugin Default configuration Test 1.0-SNAPSHOT API)

Class App


  • public class App
    extends java.lang.Object
    • Constructor Summary

      Constructors 
      Constructor Description
      App()  
    • Method Summary

      Modifier and Type Method Description
      static void main​(java.lang.String[] args)  
      protected void sampleMethod​(java.lang.String str)  
      • Methods inherited from class java.lang.Object

        clone, equals, finalize, getClass, hashCode, notify, notifyAll, toString, wait, wait, wait
    • Constructor Detail

      • App

        public App()
    • Method Detail

      • main

        public static void main​(java.lang.String[] args)
      • sampleMethod

        protected void sampleMethod​(java.lang.String str)
" at org.apache.maven.plugins.javadoc.JavadocReportTest.testDefaultConfiguration(JavadocReportTest.java:258) FAILED: org.apache.maven.plugins.javadoc.JavadocReportTest.windows-jdk12-m3.5.x_build / Build windows-jdk12-m3.5.x_build / testDefaultConfiguration Error Message: https://docs.oracle.com/en/java/javase/12/docs/api/ available, but def/configuration/App.html is missing link to java.lang.Object Expected: a string containing "/docs/api/java/lang/Object.html" but: was " App (Maven Javadoc Plugin Default configuration Test 1.0-SNAPSHOT API)

Class App


  • public class App
    extends java.lang.Object
    • Constructor Summary

      Constructors 
      Constructor Description
      App()  
    • Method Summary

      Modifier and Type Method Description
      static void main​(java.lang.String[] args)  
      protected void sampleMethod​(java.lang.String str)  
      • Methods inherited from class java.lang.Object

        clone, equals, finalize, getClass, hashCode, notify, notifyAll, toString, wait, wait, wait
    • Constructor Detail

      • App

        public App()
    • Method Detail

      • main

        public static void main​(java.lang.String[] args)
      • sampleMethod

        protected void sampleMethod​(java.lang.String str)
" Stack Trace: java.lang.AssertionError: https://docs.oracle.com/en/java/javase/12/docs/api/ available, but def/configuration/App.html is missing link to java.lang.Object Expected: a string containing "/docs/api/java/lang/Object.html" but: was " App (Maven Javadoc Plugin Default configuration Test 1.0-SNAPSHOT API)

Class App


  • public class App
    extends java.lang.Object
    • Constructor Summary

      Constructors 
      Constructor Description
      App()  
    • Method Summary

      Modifier and Type Method Description
      static void main​(java.lang.String[] args)  
      protected void sampleMethod​(java.lang.String str)  
      • Methods inherited from class java.lang.Object

        clone, equals, finalize, getClass, hashCode, notify, notifyAll, toString, wait, wait, wait
    • Constructor Detail

      • App

        public App()
    • Method Detail

      • main

        public static void main​(java.lang.String[] args)
      • sampleMethod

        protected void sampleMethod​(java.lang.String str)
" at org.apache.maven.plugins.javadoc.JavadocReportTest.testDefaultConfiguration(JavadocReportTest.java:258) Build log: [...truncated 7517 lines...] [INFO] Building: MJAVADOC-498_aggr_modulepath\pom.xml [INFO] run post-build script verify.bsh [INFO] MJAVADOC-444\pom.xml ............................. SUCCESS (37.7 s) [INFO] Building: MJAVADOC-449_aggr_modulepath\pom.xml [INFO] run post-build script verify.groovy [INFO] MJAVADOC-449_aggr_modulepath\pom.xml ............. SUCCESS (14.2 s) [INFO] Building: MJAVADOC-452_fix-duplicateparams\pom.xml [INFO] MJAVADOC-498_aggr_modulepath\pom.xml ............. SUCCESS (33.3 s) [INFO] Building: MJAVADOC-498_mm_modulepath\pom.xml [INFO] run post-build script verify.groovy [INFO] MJAVADOC-452_fix-duplicateparams\pom.xml ......... SUCCESS (10.8 s) [INFO] Building: MJAVADOC-494_aggregate-repositories\pom.xml [INFO] MJAVADOC-494_aggregate-repositories\pom.xml ...... SUCCESS (12.1 s) [INFO] Building: MJAVADOC-495_offline-filescheme\pom.xml [INFO] MJAVADOC-498_mm_modulepath\pom.xml ............... SUCCESS (16.8 s) [INFO] Building: MJAVADOC-498_modulepath\pom.xml [INFO] run post-build script verify.groovy [INFO] MJAVADOC-495_offline-filescheme\pom.xml .......... SUCCESS (20.0 s) [INFO] Building: MJAVADOC-497\pom.xml [INFO] run post-build script verify.groovy [INFO] MJAVADOC-498_modulepath\pom.xml .................. SUCCESS (20.6 s) [INFO] Building: MJAVADOC-506_excl-module-info\pom.xml [INFO] run post-build script verify.bsh [INFO] MJAVADOC-497\pom.xml ............................. SUCCESS (12.7 s) [INFO] Building: MJAVADOC-498_aggr_modulepath\pom.xml [INFO] run post-build script verify.groovy [INFO] MJAVADOC-506_excl-module-info\pom.xml ............ SUCCESS (13.0 s) [INFO] Building: MJAVADOC-508\pom.xml [INFO] MJAVADOC-508\pom.xml ............................. SUCCESS (11.1 s) [INFO] Building: MJAVADOC-514_3rdparty-doclettags\pom.xml [INFO] MJAVADOC-514_3rdparty-doclettags\pom.xml ......... SUCCESS (8.5 s) [INFO] Building: MJAVADOC-526_aggr-managedDeps\pom.xml [INFO] MJAVADOC-498_aggr_modulepath\pom.xml ............. SUCCESS (32.9 s) [INFO] Building: MJAVADOC-498_mm_modulepath\pom.xml [INFO] MJAVADOC-526_aggr-managedDeps\pom.xml ............ SUCCESS (13.3 s) [INFO] Building: MJAVADOC-528\pom.xml [INFO] run post-build script verify.groovy [INFO] MJAVADOC-528\pom.xml ............................. SUCCESS (12.9 s) [INFO] Building: MJAVADOC-538\pom.xml [INFO] MJAVADOC-498_mm_modulepath\pom.xml ............... SUCCESS (16.2 s) [INFO] Building: MJAVADOC-498_modulepath\pom.xml [INFO] MJAVADOC-538\pom.xml ............................. SUCCESS (10.9 s) [INFO] Building: MJAVADOC-551 spaces\pom.xml [INFO] MJAVADOC-551 spaces\pom.xml ...................... SUCCESS (7.1 s) [INFO] Building: MJAVADOC-552_fix-author\pom.xml [INFO] run post-build script verify.groovy [INFO] MJAVADOC-498_modulepath\pom.xml .................. SUCCESS (20.3 s) [INFO] Building: MJAVADOC-506_excl-module-info\pom.xml [INFO] run post-build script verify.groovy [INFO] MJAVADOC-552_fix-author\pom.xml .................. SUCCESS (11.2 s) [INFO] Building: MJAVADOC-555_aggr_mixed\pom.xml [INFO] run post-build script verify.groovy [INFO] MJAVADOC-506_excl-module-info\pom.xml ............ SUCCESS (12.0 s) [INFO] Building: MJAVADOC-508\pom.xml [INFO] MJAVADOC-508\pom.xml ............................. SUCCESS (8.7 s) [INFO] Building: MJAVADOC-514_3rdparty-doclettags\pom.xml [INFO] run post-build script verify.groovy [INFO] MJAVADOC-555_aggr_mixed\pom.xml .................. SUCCESS (14.9 s) [INFO] Building: MJAVADOC-555_link-automatic-modules\pom.xml [INFO] MJAVADOC-514_3rdparty-doclettags\pom.xml ......... SUCCESS (8.7 s) [INFO] Building: MJAVADOC-526_aggr-managedDeps\pom.xml [INFO] run post-build script verify.groovy [INFO] MJAVADOC-555_link-automatic-modules\pom.xml ...... SUCCESS (17.5 s) [INFO] Building: MJAVADOC-556_hide-non-exported-packages\pom.xml [INFO] MJAVADOC-526_aggr-managedDeps\pom.xml ............ SUCCESS (13.6 s) [INFO] Building: MJAVADOC-528\pom.xml [INFO] MJAVADOC-556_hide-non-exported-packages\pom.xml .. SUCCESS (11.4 s) [INFO] Building: MJAVADOC-558_fix-unknownthrows\pom.xml [INFO] run post-build script verify.groovy [INFO] MJAVADOC-528\pom.xml ............................. SUCCESS (12.2 s) [INFO] Building: MJAVADOC-538\pom.xml [INFO] run post-build script verify.groovy [INFO] MJAVADOC-558_fix-unknownthrows\pom.xml ........... SUCCESS (11.2 s) [INFO] Building: MJAVADOC-562_release\pom.xml [INFO] MJAVADOC-538\pom.xml ............................. SUCCESS (8.6 s) [INFO] Building: MJAVADOC-551 spaces\pom.xml [INFO] MJAVADOC-551 spaces\pom.xml ...................... SUCCESS (8.3 s) [INFO] Building: MJAVADOC-552_fix-author\pom.xml [INFO] MJAVADOC-562_release\pom.xml ..................... SUCCESS (12.6 s) [INFO] Building: MJAVADOC-567_aggr-mixed\pom.xml [INFO] run post-build script verify.groovy [INFO] MJAVADOC-567_aggr-mixed\pom.xml .................. SUCCESS (8.4 s) [INFO] Building: MJAVADOC-568_export-to-testcase\pom.xml [INFO] run post-build script verify.groovy [INFO] MJAVADOC-552_fix-author\pom.xml .................. SUCCESS (12.3 s) [INFO] Building: MJAVADOC-555_aggr_mixed\pom.xml [INFO] run post-build script verify.groovy [INFO] MJAVADOC-555_aggr_mixed\pom.xml .................. SUCCESS (14.0 s) [INFO] Building: MJAVADOC-555_link-automatic-modules\pom.xml [INFO] MJAVADOC-568_export-to-testcase\pom.xml .......... SUCCESS (26.8 s) [INFO] Building: MJAVADOC-568_jar-mixed\pom.xml [INFO] run post-build script verify.groovy [INFO] MJAVADOC-555_link-automatic-modules\pom.xml ...... SUCCESS (15.9 s) [INFO] Building: MJAVADOC-556_hide-non-exported-packages\pom.xml [INFO] MJAVADOC-556_hide-non-exported-packages\pom.xml .. SUCCESS (11.7 s) [INFO] Building: MJAVADOC-558_fix-unknownthrows\pom.xml [INFO] MJAVADOC-568_jar-mixed\pom.xml ................... SUCCESS (19.9 s) [INFO] Building: MJAVADOC-568_manifest-splitpackage\pom.xml [INFO] run post-build script verify.groovy [INFO] MJAVADOC-558_fix-unknownthrows\pom.xml ........... SUCCESS (11.8 s) [INFO] Building: MJAVADOC-562_release\pom.xml [INFO] MJAVADOC-562_release\pom.xml ..................... SUCCESS (13.2 s) [INFO] Building: MJAVADOC-567_aggr-mixed\pom.xml [INFO] MJAVADOC-568_manifest-splitpackage\pom.xml ....... SUCCESS (27.4 s) [INFO] Building: MJAVADOC-569_aggr-mixed\pom.xml [INFO] run post-build script verify.groovy [INFO] MJAVADOC-567_aggr-mixed\pom.xml .................. SUCCESS (7.3 s) [INFO] Building: MJAVADOC-568_export-to-testcase\pom.xml [INFO] MJAVADOC-569_aggr-mixed\pom.xml .................. SUCCESS (22.5 s) [INFO] Building: MJAVADOC-575_source8-module-info\pom.xml [INFO] MJAVADOC-568_export-to-testcase\pom.xml .......... SUCCESS (25.9 s) [INFO] Building: MJAVADOC-568_jar-mixed\pom.xml [INFO] run post-build script verify.groovy [INFO] MJAVADOC-575_source8-module-info\pom.xml ......... SUCCESS (11.4 s) [INFO] Building: MJAVADOC-580_detectLinks\pom.xml [INFO] run post-build script verify.groovy [INFO] MJAVADOC-580_detectLinks\pom.xml ................. SUCCESS (10.2 s) [INFO] Building: site-failOnError\pom.xml [INFO] MJAVADOC-568_jar-mixed\pom.xml ................... SUCCESS (18.0 s) [INFO] Building: MJAVADOC-568_manifest-splitpackage\pom.xml [INFO] site-failOnError\pom.xml ......................... SUCCESS (12.9 s) [INFO] [INFO] --- mrm-maven-plugin:1.1.0:stop (repository) @ maven-javadoc-plugin --- [INFO] Stopping Mock Repository Manager on http://localhost:55808 [INFO] Stopped SocketConnector@0.0.0.0:55808 [INFO] Mock Repository Manager http://localhost:55808 is stopped. [INFO] [INFO] --- mrm-maven-plugin:1.1.0:stop (3rdparty) @ maven-javadoc-plugin --- [INFO] Stopping Mock Repository Manager on http://localhost:55809 [INFO] Stopped SocketConnector@0.0.0.0:55809 [INFO] Mock Repository Manager http://localhost:55809 is stopped. [INFO] [INFO] --- maven-checkstyle-plugin:3.0.0:check (checkstyle-check) @ maven-javadoc-plugin --- [INFO] There are 4 errors reported by Checkstyle 6.18 with config/maven_checks.xml ruleset. [INFO] Ignored 4 errors, 0 violation remaining. [INFO] [INFO] --- maven-invoker-plugin:3.1.0:verify (integration-test) @ maven-javadoc-plugin --- [INFO] ------------------------------------------------- [INFO] Build Summary: [INFO] Passed: 62, Failed: 0, Errors: 0, Skipped: 1 [INFO] ------------------------------------------------- [INFO] ------------------------------------------------------------------------ [INFO] BUILD SUCCESS [INFO] ------------------------------------------------------------------------ [INFO] Total time: 22:29 min [INFO] Finished at: 2019-04-01T15:17:44-07:00 [INFO] Final Memory: 55M/190M [INFO] ------------------------------------------------------------------------ [INFO] [jenkins-event-spy] Generated F:\jenkins\jenkins-slave\workspace\-box_maven-javadoc-plugin_master@2@tmp\withMaven7f77be65\maven-spy-20190401-145514-5895917465369410967443.log [Pipeline] } [Pipeline] // dir [Pipeline] } [withMaven] artifactsPublisher - Archive artifact windows-jdk11-m3.5.x_build\pom.xml under org\apache\maven\plugins\maven-javadoc-plugin\3.1.1-SNAPSHOT\maven-javadoc-plugin-3.1.1-SNAPSHOT.pom [withMaven] artifactsPublisher - Archive artifact windows-jdk11-m3.5.x_build\target\maven-javadoc-plugin-3.1.1-SNAPSHOT.jar under org\apache\maven\plugins\maven-javadoc-plugin\3.1.1-SNAPSHOT\maven-javadoc-plugin-3.1.1-SNAPSHOT.jar [withMaven] junitPublisher - Archive test results for Maven artifact org.apache.maven.plugins:maven-javadoc-plugin:maven-plugin:3.1.1-SNAPSHOT generated by maven-surefire-plugin:test (default-test): windows-jdk11-m3.5.x_build\target\surefire-reports\*.xml Recording test results [withMaven] openTasksPublisher - Scan Tasks for Maven artifact org.apache.maven.plugins:maven-javadoc-plugin:maven-plugin:3.1.1-SNAPSHOT in source directory windows-jdk11-m3.5.x_build\src\main\java [TASKS] Scanning folder 'f:\jenkins\jenkins-slave\workspace\-box_maven-javadoc-plugin_master@2' for files matching the pattern 'windows-jdk11-m3.5.x_build\src\main\java\**\*' - excludes: null [TASKS] Found 26 files to scan for tasks [TASKS] Found 7 open tasks. Skipping warnings blame since pipelines do not have an SCM link.%n [TASKS] Computing warning deltas based on reference build #12 [withMaven] invokerPublisher - Archive invoker results for Maven artifact MavenArtifact{org.apache.maven.plugins:maven-javadoc-plugin:maven-plugin:3.1.1-SNAPSHOT(version: 3.1.1-SNAPSHOT, snapshot:false) } generated by PluginInvocation{org.apache.maven.plugins:maven-invoker-plugin:3.1.0@integration-test integration-test}: windows-jdk11-m3.5.x_build\target\invoker-reports\*.xml [INFO] MJAVADOC-568_manifest-splitpackage\pom.xml ....... SUCCESS (24.1 s) [INFO] Building: MJAVADOC-569_aggr-mixed\pom.xml [INFO] MJAVADOC-569_aggr-mixed\pom.xml .................. SUCCESS (18.7 s) [INFO] Building: MJAVADOC-575_source8-module-info\pom.xml [INFO] run post-build script verify.groovy [INFO] MJAVADOC-575_source8-module-info\pom.xml ......... SUCCESS (11.1 s) [INFO] Building: MJAVADOC-580_detectLinks\pom.xml [INFO] run post-build script verify.groovy [INFO] MJAVADOC-580_detectLinks\pom.xml ................. SUCCESS (7.6 s) [INFO] Building: site-failOnError\pom.xml [INFO] site-failOnError\pom.xml ......................... SUCCESS (10.1 s) [INFO] [INFO] --- mrm-maven-plugin:1.1.0:stop (repository) @ maven-javadoc-plugin --- [INFO] Stopping Mock Repository Manager on http://localhost:55924 [INFO] Stopped SocketConnector@0.0.0.0:55924 [INFO] Mock Repository Manager http://localhost:55924 is stopped. [INFO] [INFO] --- mrm-maven-plugin:1.1.0:stop (3rdparty) @ maven-javadoc-plugin --- [INFO] Stopping Mock Repository Manager on http://localhost:55925 [INFO] Stopped SocketConnector@0.0.0.0:55925 [INFO] Mock Repository Manager http://localhost:55925 is stopped. [INFO] [INFO] --- maven-checkstyle-plugin:3.0.0:check (checkstyle-check) @ maven-javadoc-plugin --- [withMaven] Publishers: Generated Artifacts Publisher: 242 ms, Junit Publisher: 658 ms, Open Task Scanner Publisher: 364 ms, Dependencies Fingerprint Publisher: 1 ms, Invoker Publisher: 56516 ms, Pipeline Graph Publisher: 3 ms [Pipeline] // withMaven [Pipeline] cleanWs [WS-CLEANUP] Deleting project workspace... [WS-CLEANUP] Deferred wipeout is used... [WS-CLEANUP] done [Pipeline] } [Pipeline] // stage [Pipeline] } [Pipeline] // ws [Pipeline] } [Pipeline] // node [Pipeline] } [INFO] There are 4 errors reported by Checkstyle 6.18 with config/maven_checks.xml ruleset. [INFO] Ignored 4 errors, 0 violation remaining. [INFO] [INFO] --- maven-invoker-plugin:3.1.0:verify (integration-test) @ maven-javadoc-plugin --- [INFO] ------------------------------------------------- [INFO] Build Summary: [INFO] Passed: 61, Failed: 0, Errors: 0, Skipped: 2 [INFO] ------------------------------------------------- [INFO] ------------------------------------------------------------------------ [INFO] BUILD SUCCESS [INFO] ------------------------------------------------------------------------ [INFO] Total time: 21:04 min [INFO] Finished at: 2019-04-01T15:18:45-07:00 [INFO] Final Memory: 55M/187M [INFO] ------------------------------------------------------------------------ [INFO] [jenkins-event-spy] Generated F:\jenkins\jenkins-slave\workspace\-box_maven-javadoc-plugin_master@3@2@tmp\withMaven144be703\maven-spy-20190401-145741-27212952786604198879027.log [Pipeline] } [Pipeline] // dir [Pipeline] } [withMaven] artifactsPublisher - Archive artifact windows-jdk12-m3.5.x_build\pom.xml under org\apache\maven\plugins\maven-javadoc-plugin\3.1.1-SNAPSHOT\maven-javadoc-plugin-3.1.1-SNAPSHOT.pom [withMaven] artifactsPublisher - Archive artifact windows-jdk12-m3.5.x_build\target\maven-javadoc-plugin-3.1.1-SNAPSHOT.jar under org\apache\maven\plugins\maven-javadoc-plugin\3.1.1-SNAPSHOT\maven-javadoc-plugin-3.1.1-SNAPSHOT.jar [withMaven] junitPublisher - Archive test results for Maven artifact org.apache.maven.plugins:maven-javadoc-plugin:maven-plugin:3.1.1-SNAPSHOT generated by maven-surefire-plugin:test (default-test): windows-jdk12-m3.5.x_build\target\surefire-reports\*.xml Recording test results [withMaven] openTasksPublisher - Scan Tasks for Maven artifact org.apache.maven.plugins:maven-javadoc-plugin:maven-plugin:3.1.1-SNAPSHOT in source directory windows-jdk12-m3.5.x_build\src\main\java [TASKS] Scanning folder 'f:\jenkins\jenkins-slave\workspace\-box_maven-javadoc-plugin_master@3@2' for files matching the pattern 'windows-jdk12-m3.5.x_build\src\main\java\**\*' - excludes: null [TASKS] Found 26 files to scan for tasks [TASKS] Found 7 open tasks. Skipping warnings blame since pipelines do not have an SCM link.%n [TASKS] Computing warning deltas based on reference build #12 [withMaven] invokerPublisher - Archive invoker results for Maven artifact MavenArtifact{org.apache.maven.plugins:maven-javadoc-plugin:maven-plugin:3.1.1-SNAPSHOT(version: 3.1.1-SNAPSHOT, snapshot:false) } generated by PluginInvocation{org.apache.maven.plugins:maven-invoker-plugin:3.1.0@integration-test integration-test}: windows-jdk12-m3.5.x_build\target\invoker-reports\*.xml [withMaven] Publishers: Generated Artifacts Publisher: 245 ms, Junit Publisher: 759 ms, Open Task Scanner Publisher: 248 ms, Dependencies Fingerprint Publisher: 1 ms, Invoker Publisher: 57783 ms, Pipeline Graph Publisher: 1 ms [Pipeline] // withMaven [Pipeline] cleanWs [WS-CLEANUP] Deleting project workspace... [WS-CLEANUP] Deferred wipeout is used... [WS-CLEANUP] done [Pipeline] } [Pipeline] // stage [Pipeline] } [Pipeline] // ws [Pipeline] } [Pipeline] // node [Pipeline] } [Pipeline] // parallel [Pipeline] stage [Pipeline] { (Notifications) [Pipeline] echo Build result: UNSTABLE [Pipeline] jiraIssueSelector [Pipeline] emailext