maven-notifications mailing list archives

Site index · List index
Message view « Date » · « Thread »
Top « Date » · « Thread »
From Apache Jenkins Server <jenk...@builds.apache.org>
Subject Build failed in Jenkins: Maven TLP » maven-surefire » 1546-1222 #6
Date Wed, 03 Apr 2019 23:29:48 GMT
See https://builds.apache.org/job/maven-box/job/maven-surefire/job/1546-1222/6/

Changes:

* saved network traffic
* saved network traffic
* saved network traffic
* saved network traffic
* saved network traffic
* saved network traffic
* saved network traffic
* saved network traffic

1 tests failed.
FAILED:  org.apache.maven.surefire.its.JUnitPlatformIT.testJupiterEngineWithDisplayNames

Error Message:
Did not find expected message in log

Stack Trace:
junit.framework.AssertionFailedError: Did not find expected message in log
	at org.apache.maven.surefire.its.JUnitPlatformIT.testJupiterEngineWithDisplayNames(JUnitPlatformIT.java:55)




Build log:
[...truncated 44210 lines...]
[2019-04-03T23:29:43.026Z] [ERROR] Failed to execute goal org.apache.maven.plugins:maven-failsafe-plugin:3.0.0-M3:verify
(default) on project surefire-its: There are test failures.
[2019-04-03T23:29:43.026Z] [ERROR] 
[2019-04-03T23:29:43.026Z] [ERROR] Please refer to C:\Users\jenkins\AppData\Local\Temp\2\jenkins-maven-box-maven-surefire-1546-1222-6@2\surefire-its\target\failsafe-reports
for the individual test results.
[2019-04-03T23:29:43.026Z] [ERROR] Please refer to dump files (if any exist) [date].dump,
[date]-jvmRun[N].dump and [date].dumpstream.
[2019-04-03T23:29:43.026Z] [ERROR] -> [Help 1]
[2019-04-03T23:29:43.026Z] org.apache.maven.lifecycle.LifecycleExecutionException: Failed
to execute goal org.apache.maven.plugins:maven-failsafe-plugin:3.0.0-M3:verify (default) on
project surefire-its: There are test failures.
[2019-04-03T23:29:43.026Z] 
[2019-04-03T23:29:43.026Z] Please refer to C:\Users\jenkins\AppData\Local\Temp\2\jenkins-maven-box-maven-surefire-1546-1222-6@2\surefire-its\target\failsafe-reports
for the individual test results.
[2019-04-03T23:29:43.026Z] Please refer to dump files (if any exist) [date].dump, [date]-jvmRun[N].dump
and [date].dumpstream.
[2019-04-03T23:29:43.026Z]     at org.apache.maven.lifecycle.internal.MojoExecutor.execute
(MojoExecutor.java:215)
[2019-04-03T23:29:43.026Z]     at org.apache.maven.lifecycle.internal.MojoExecutor.execute
(MojoExecutor.java:156)
[2019-04-03T23:29:43.026Z]     at org.apache.maven.lifecycle.internal.MojoExecutor.execute
(MojoExecutor.java:148)
[2019-04-03T23:29:43.026Z]     at org.apache.maven.lifecycle.internal.LifecycleModuleBuilder.buildProject
(LifecycleModuleBuilder.java:117)
[2019-04-03T23:29:43.026Z]     at org.apache.maven.lifecycle.internal.LifecycleModuleBuilder.buildProject
(LifecycleModuleBuilder.java:81)
[2019-04-03T23:29:43.026Z]     at org.apache.maven.lifecycle.internal.builder.singlethreaded.SingleThreadedBuilder.build
(SingleThreadedBuilder.java:56)
[2019-04-03T23:29:43.027Z]     at org.apache.maven.lifecycle.internal.LifecycleStarter.execute
(LifecycleStarter.java:128)
[2019-04-03T23:29:43.027Z]     at org.apache.maven.DefaultMaven.doExecute (DefaultMaven.java:305)
[2019-04-03T23:29:43.027Z]     at org.apache.maven.DefaultMaven.doExecute (DefaultMaven.java:192)
[2019-04-03T23:29:43.027Z]     at org.apache.maven.DefaultMaven.execute (DefaultMaven.java:105)
[2019-04-03T23:29:43.027Z]     at org.apache.maven.cli.MavenCli.execute (MavenCli.java:956)
[2019-04-03T23:29:43.027Z]     at org.apache.maven.cli.MavenCli.doMain (MavenCli.java:288)
[2019-04-03T23:29:43.027Z]     at org.apache.maven.cli.MavenCli.main (MavenCli.java:192)
[2019-04-03T23:29:43.027Z]     at sun.reflect.NativeMethodAccessorImpl.invoke0 (Native Method)
[2019-04-03T23:29:43.027Z]     at sun.reflect.NativeMethodAccessorImpl.invoke (NativeMethodAccessorImpl.java:62)
[2019-04-03T23:29:43.027Z]     at sun.reflect.DelegatingMethodAccessorImpl.invoke (DelegatingMethodAccessorImpl.java:43)
[2019-04-03T23:29:43.027Z]     at java.lang.reflect.Method.invoke (Method.java:498)
[2019-04-03T23:29:43.027Z]     at org.codehaus.plexus.classworlds.launcher.Launcher.launchEnhanced
(Launcher.java:289)
[2019-04-03T23:29:43.027Z]     at org.codehaus.plexus.classworlds.launcher.Launcher.launch
(Launcher.java:229)
[2019-04-03T23:29:43.027Z]     at org.codehaus.plexus.classworlds.launcher.Launcher.mainWithExitCode
(Launcher.java:415)
[2019-04-03T23:29:43.027Z]     at org.codehaus.plexus.classworlds.launcher.Launcher.main (Launcher.java:356)
[2019-04-03T23:29:43.027Z] Caused by: org.apache.maven.plugin.MojoFailureException: There
are test failures.
[2019-04-03T23:29:43.027Z] 
[2019-04-03T23:29:43.027Z] Please refer to C:\Users\jenkins\AppData\Local\Temp\2\jenkins-maven-box-maven-surefire-1546-1222-6@2\surefire-its\target\failsafe-reports
for the individual test results.
[2019-04-03T23:29:43.027Z] Please refer to dump files (if any exist) [date].dump, [date]-jvmRun[N].dump
and [date].dumpstream.
[2019-04-03T23:29:43.027Z]     at org.apache.maven.plugin.surefire.SurefireHelper.throwException
(SurefireHelper.java:271)
[2019-04-03T23:29:43.027Z]     at org.apache.maven.plugin.surefire.SurefireHelper.reportExecution
(SurefireHelper.java:159)
[2019-04-03T23:29:43.027Z]     at org.apache.maven.plugin.failsafe.VerifyMojo.execute (VerifyMojo.java:192)
[2019-04-03T23:29:43.027Z]     at org.apache.maven.plugin.DefaultBuildPluginManager.executeMojo
(DefaultBuildPluginManager.java:137)
[2019-04-03T23:29:43.027Z]     at org.apache.maven.lifecycle.internal.MojoExecutor.execute
(MojoExecutor.java:210)
[2019-04-03T23:29:43.027Z]     at org.apache.maven.lifecycle.internal.MojoExecutor.execute
(MojoExecutor.java:156)
[2019-04-03T23:29:43.027Z]     at org.apache.maven.lifecycle.internal.MojoExecutor.execute
(MojoExecutor.java:148)
[2019-04-03T23:29:43.027Z]     at org.apache.maven.lifecycle.internal.LifecycleModuleBuilder.buildProject
(LifecycleModuleBuilder.java:117)
[2019-04-03T23:29:43.027Z]     at org.apache.maven.lifecycle.internal.LifecycleModuleBuilder.buildProject
(LifecycleModuleBuilder.java:81)
[2019-04-03T23:29:43.027Z]     at org.apache.maven.lifecycle.internal.builder.singlethreaded.SingleThreadedBuilder.build
(SingleThreadedBuilder.java:56)
[2019-04-03T23:29:43.027Z]     at org.apache.maven.lifecycle.internal.LifecycleStarter.execute
(LifecycleStarter.java:128)
[2019-04-03T23:29:43.027Z]     at org.apache.maven.DefaultMaven.doExecute (DefaultMaven.java:305)
[2019-04-03T23:29:43.027Z]     at org.apache.maven.DefaultMaven.doExecute (DefaultMaven.java:192)
[2019-04-03T23:29:43.027Z]     at org.apache.maven.DefaultMaven.execute (DefaultMaven.java:105)
[2019-04-03T23:29:43.027Z]     at org.apache.maven.cli.MavenCli.execute (MavenCli.java:956)
[2019-04-03T23:29:43.027Z]     at org.apache.maven.cli.MavenCli.doMain (MavenCli.java:288)
[2019-04-03T23:29:43.027Z]     at org.apache.maven.cli.MavenCli.main (MavenCli.java:192)
[2019-04-03T23:29:43.027Z]     at sun.reflect.NativeMethodAccessorImpl.invoke0 (Native Method)
[2019-04-03T23:29:43.027Z]     at sun.reflect.NativeMethodAccessorImpl.invoke (NativeMethodAccessorImpl.java:62)
[2019-04-03T23:29:43.027Z]     at sun.reflect.DelegatingMethodAccessorImpl.invoke (DelegatingMethodAccessorImpl.java:43)
[2019-04-03T23:29:43.027Z]     at java.lang.reflect.Method.invoke (Method.java:498)
[2019-04-03T23:29:43.027Z]     at org.codehaus.plexus.classworlds.launcher.Launcher.launchEnhanced
(Launcher.java:289)
[2019-04-03T23:29:43.027Z]     at org.codehaus.plexus.classworlds.launcher.Launcher.launch
(Launcher.java:229)
[2019-04-03T23:29:43.027Z] [ERROR] Tests run: 6, Failures: 1, Errors: 0, Skipped: 0, Time
elapsed: 67.805 s <<< FAILURE! - in org.apache.maven.surefire.its.JUnitPlatformIT
[2019-04-03T23:29:43.027Z]     at org.codehaus.plexus.classworlds.launcher.Launcher.mainWithExitCode
(Launcher.java:415)
[2019-04-03T23:29:43.027Z]     at org.codehaus.plexus.classworlds.launcher.Launcher.main (Launcher.java:356)
[2019-04-03T23:29:43.027Z] [ERROR] testJupiterEngineWithDisplayNames(org.apache.maven.surefire.its.JUnitPlatformIT)
 Time elapsed: 8.712 s  <<< FAILURE!
[2019-04-03T23:29:43.027Z] [ERROR] 
[2019-04-03T23:29:43.028Z] junit.framework.AssertionFailedError: Did not find expected message
in log
[2019-04-03T23:29:43.028Z] [ERROR] Re-run Maven using the -X switch to enable full debug logging.
[2019-04-03T23:29:43.028Z] [ERROR] 
[2019-04-03T23:29:43.028Z] 	at org.apache.maven.surefire.its.JUnitPlatformIT.testJupiterEngineWithDisplayNames(JUnitPlatformIT.java:55)
[2019-04-03T23:29:43.028Z] 
[2019-04-03T23:29:43.028Z] [ERROR] For more information about the errors and possible solutions,
please read the following articles:
[2019-04-03T23:29:43.028Z] [INFO] 
[2019-04-03T23:29:43.028Z] [INFO] Results:
[2019-04-03T23:29:43.028Z] [ERROR] [Help 1] http://cwiki.apache.org/confluence/display/MAVEN/MojoFailureException
[2019-04-03T23:29:43.028Z] [ERROR] 
[2019-04-03T23:29:43.028Z] [INFO] 
[2019-04-03T23:29:43.028Z] [ERROR] Failures: 
[2019-04-03T23:29:43.028Z] [ERROR] After correcting the problems, you can resume the build
with the command
[2019-04-03T23:29:43.028Z] [ERROR]   mvn <goals> -rf :surefire-its
[2019-04-03T23:29:43.028Z] [ERROR]   JUnitPlatformIT.testJupiterEngineWithDisplayNames:55
Did not find expected message in log
[2019-04-03T23:29:43.028Z] [INFO] 
[2019-04-03T23:29:43.028Z] [ERROR] Tests run: 6, Failures: 1, Errors: 0, Skipped: 0
[2019-04-03T23:29:43.028Z] [INFO] 
[2019-04-03T23:29:43.028Z] [INFO] 
[2019-04-03T23:29:43.028Z] [INFO] --- maven-checkstyle-plugin:3.0.0:check (checkstyle-check)
@ surefire-its ---
[2019-04-03T23:29:43.028Z] [INFO] 
[2019-04-03T23:29:43.028Z] [INFO] --- maven-failsafe-plugin:3.0.0-M3:verify (default) @ surefire-its
---
[2019-04-03T23:29:43.028Z] [INFO] Failsafe report directory: C:\Users\jenkins\AppData\Local\Temp\2\jenkins-maven-box-maven-surefire-1546-1222-6\surefire-its\target\failsafe-reports
[2019-04-03T23:29:43.028Z] [INFO] ------------------------------------------------------------------------
[2019-04-03T23:29:43.028Z] [INFO] Reactor Summary for Apache Maven Surefire 3.0.0-SNAPSHOT:
[2019-04-03T23:29:43.028Z] [INFO] 
[2019-04-03T23:29:43.028Z] [INFO] Apache Maven Surefire .............................. SUCCESS
[01:04 min]
[2019-04-03T23:29:43.028Z] [INFO] SureFire Logger API ................................ SUCCESS
[ 12.392 s]
[2019-04-03T23:29:43.028Z] [INFO] SureFire API ....................................... SUCCESS
[ 23.974 s]
[2019-04-03T23:29:43.028Z] [INFO] SureFire Booter .................................... SUCCESS
[ 24.448 s]
[2019-04-03T23:29:43.028Z] [INFO] Maven Surefire Test-Grouping Support ............... SUCCESS
[ 14.357 s]
[2019-04-03T23:29:43.028Z] [INFO] SureFire Providers ................................. SUCCESS
[  1.624 s]
[2019-04-03T23:29:43.028Z] [INFO] Shared JUnit3 Provider Code ........................ SUCCESS
[  7.804 s]
[2019-04-03T23:29:43.028Z] [INFO] Shared Java 5 Provider Base ........................ SUCCESS
[  9.824 s]
[2019-04-03T23:29:43.028Z] [INFO] Shared JUnit4 Provider Code ........................ SUCCESS
[  9.386 s]
[2019-04-03T23:29:43.028Z] [INFO] Shared JUnit48 Provider Code ....................... SUCCESS
[ 10.468 s]
[2019-04-03T23:29:43.028Z] [INFO] SureFire JUnit Runner .............................. SUCCESS
[  7.852 s]
[2019-04-03T23:29:43.028Z] [INFO] SureFire JUnit4 Runner ............................. SUCCESS
[  8.100 s]
[2019-04-03T23:29:43.028Z] [INFO] Maven Surefire Common .............................. SUCCESS
[ 48.354 s]
[2019-04-03T23:29:43.028Z] [INFO] SureFire JUnitCore Runner .......................... SUCCESS
[02:23 min]
[2019-04-03T23:29:43.028Z] [INFO] SureFire JUnit Platform Runner ..................... SUCCESS
[ 16.518 s]
[2019-04-03T23:29:43.028Z] [INFO] SureFire TestNG Utils .............................. SUCCESS
[  8.735 s]
[2019-04-03T23:29:43.028Z] [INFO] SureFire TestNG Runner ............................. SUCCESS
[  9.908 s]
[2019-04-03T23:29:43.028Z] [INFO] ShadeFire JUnit3 Provider .......................... SUCCESS
[  2.849 s]
[2019-04-03T23:29:43.028Z] [INFO] Surefire Report Parser ............................. SUCCESS
[ 12.074 s]
[2019-04-03T23:29:43.028Z] [INFO] Maven Surefire Plugin .............................. SUCCESS
[ 20.579 s]
[2019-04-03T23:29:43.028Z] [INFO] Maven Failsafe Plugin .............................. SUCCESS
[02:21 min]
[2019-04-03T23:29:43.028Z] [INFO] Maven Surefire Report Plugin ....................... SUCCESS
[ 24.088 s]
[2019-04-03T23:29:43.028Z] [INFO] Maven Surefire Integration Tests ................... FAILURE
[01:53 min]
[2019-04-03T23:29:43.028Z] [INFO] ------------------------------------------------------------------------
[2019-04-03T23:29:43.028Z] [INFO] BUILD FAILURE
[2019-04-03T23:29:43.028Z] [INFO] ------------------------------------------------------------------------
[2019-04-03T23:29:43.028Z] [INFO] Total time:  12:18 min
[2019-04-03T23:29:43.028Z] [INFO] Finished at: 2019-04-03T16:29:41-07:00
[2019-04-03T23:29:43.028Z] [INFO] ------------------------------------------------------------------------
[2019-04-03T23:29:43.028Z] [ERROR] Failed to execute goal org.apache.maven.plugins:maven-failsafe-plugin:3.0.0-M3:verify
(default) on project surefire-its: There are test failures.
[2019-04-03T23:29:43.028Z] [ERROR] 
[2019-04-03T23:29:43.028Z] [ERROR] Please refer to C:\Users\jenkins\AppData\Local\Temp\2\jenkins-maven-box-maven-surefire-1546-1222-6\surefire-its\target\failsafe-reports
for the individual test results.
[2019-04-03T23:29:43.028Z] [ERROR] Please refer to dump files (if any exist) [date].dump,
[date]-jvmRun[N].dump and [date].dumpstream.
[2019-04-03T23:29:43.028Z] [ERROR] -> [Help 1]
[2019-04-03T23:29:43.028Z] org.apache.maven.lifecycle.LifecycleExecutionException: Failed
to execute goal org.apache.maven.plugins:maven-failsafe-plugin:3.0.0-M3:verify (default) on
project surefire-its: There are test failures.
[2019-04-03T23:29:43.028Z] 
[2019-04-03T23:29:43.028Z] Please refer to C:\Users\jenkins\AppData\Local\Temp\2\jenkins-maven-box-maven-surefire-1546-1222-6\surefire-its\target\failsafe-reports
for the individual test results.
[2019-04-03T23:29:43.028Z] Please refer to dump files (if any exist) [date].dump, [date]-jvmRun[N].dump
and [date].dumpstream.
[2019-04-03T23:29:43.028Z]     at org.apache.maven.lifecycle.internal.MojoExecutor.execute
(MojoExecutor.java:215)
[2019-04-03T23:29:43.028Z]     at org.apache.maven.lifecycle.internal.MojoExecutor.execute
(MojoExecutor.java:156)
[2019-04-03T23:29:43.028Z]     at org.apache.maven.lifecycle.internal.MojoExecutor.execute
(MojoExecutor.java:148)
[2019-04-03T23:29:43.028Z]     at org.apache.maven.lifecycle.internal.LifecycleModuleBuilder.buildProject
(LifecycleModuleBuilder.java:117)
[2019-04-03T23:29:43.028Z]     at org.apache.maven.lifecycle.internal.LifecycleModuleBuilder.buildProject
(LifecycleModuleBuilder.java:81)
[2019-04-03T23:29:43.029Z]     at org.apache.maven.lifecycle.internal.builder.singlethreaded.SingleThreadedBuilder.build
(SingleThreadedBuilder.java:56)
[2019-04-03T23:29:43.029Z]     at org.apache.maven.lifecycle.internal.LifecycleStarter.execute
(LifecycleStarter.java:128)
[2019-04-03T23:29:43.029Z]     at org.apache.maven.DefaultMaven.doExecute (DefaultMaven.java:305)
[2019-04-03T23:29:43.029Z]     at org.apache.maven.DefaultMaven.doExecute (DefaultMaven.java:192)
[2019-04-03T23:29:43.029Z]     at org.apache.maven.DefaultMaven.execute (DefaultMaven.java:105)
[2019-04-03T23:29:43.029Z]     at org.apache.maven.cli.MavenCli.execute (MavenCli.java:956)
[2019-04-03T23:29:43.029Z]     at org.apache.maven.cli.MavenCli.doMain (MavenCli.java:288)
[2019-04-03T23:29:43.029Z]     at org.apache.maven.cli.MavenCli.main (MavenCli.java:192)
[2019-04-03T23:29:43.029Z]     at sun.reflect.NativeMethodAccessorImpl.invoke0 (Native Method)
[2019-04-03T23:29:43.029Z]     at sun.reflect.NativeMethodAccessorImpl.invoke (NativeMethodAccessorImpl.java:62)
[2019-04-03T23:29:43.029Z]     at sun.reflect.DelegatingMethodAccessorImpl.invoke (DelegatingMethodAccessorImpl.java:43)
[2019-04-03T23:29:43.029Z]     at java.lang.reflect.Method.invoke (Method.java:498)
[2019-04-03T23:29:43.029Z]     at org.codehaus.plexus.classworlds.launcher.Launcher.launchEnhanced
(Launcher.java:289)
[2019-04-03T23:29:43.029Z]     at org.codehaus.plexus.classworlds.launcher.Launcher.launch
(Launcher.java:229)
[2019-04-03T23:29:43.029Z]     at org.codehaus.plexus.classworlds.launcher.Launcher.mainWithExitCode
(Launcher.java:415)
[2019-04-03T23:29:43.029Z]     at org.codehaus.plexus.classworlds.launcher.Launcher.main (Launcher.java:356)
[2019-04-03T23:29:43.029Z] Caused by: org.apache.maven.plugin.MojoFailureException: There
are test failures.
[2019-04-03T23:29:43.029Z] 
[2019-04-03T23:29:43.029Z] Please refer to C:\Users\jenkins\AppData\Local\Temp\2\jenkins-maven-box-maven-surefire-1546-1222-6\surefire-its\target\failsafe-reports
for the individual test results.
[2019-04-03T23:29:43.029Z] Please refer to dump files (if any exist) [date].dump, [date]-jvmRun[N].dump
and [date].dumpstream.
[2019-04-03T23:29:43.029Z]     at org.apache.maven.plugin.surefire.SurefireHelper.throwException
(SurefireHelper.java:271)
[2019-04-03T23:29:43.029Z]     at org.apache.maven.plugin.surefire.SurefireHelper.reportExecution
(SurefireHelper.java:159)
[2019-04-03T23:29:43.029Z]     at org.apache.maven.plugin.failsafe.VerifyMojo.execute (VerifyMojo.java:192)
[2019-04-03T23:29:43.029Z]     at org.apache.maven.plugin.DefaultBuildPluginManager.executeMojo
(DefaultBuildPluginManager.java:137)
[2019-04-03T23:29:43.029Z]     at org.apache.maven.lifecycle.internal.MojoExecutor.execute
(MojoExecutor.java:210)
[2019-04-03T23:29:43.029Z]     at org.apache.maven.lifecycle.internal.MojoExecutor.execute
(MojoExecutor.java:156)
[2019-04-03T23:29:43.029Z]     at org.apache.maven.lifecycle.internal.MojoExecutor.execute
(MojoExecutor.java:148)
[2019-04-03T23:29:43.029Z]     at org.apache.maven.lifecycle.internal.LifecycleModuleBuilder.buildProject
(LifecycleModuleBuilder.java:117)
[2019-04-03T23:29:43.029Z]     at org.apache.maven.lifecycle.internal.LifecycleModuleBuilder.buildProject
(LifecycleModuleBuilder.java:81)
[2019-04-03T23:29:43.029Z]     at org.apache.maven.lifecycle.internal.builder.singlethreaded.SingleThreadedBuilder.build
(SingleThreadedBuilder.java:56)
[2019-04-03T23:29:43.029Z]     at org.apache.maven.lifecycle.internal.LifecycleStarter.execute
(LifecycleStarter.java:128)
[2019-04-03T23:29:43.029Z]     at org.apache.maven.DefaultMaven.doExecute (DefaultMaven.java:305)
[2019-04-03T23:29:43.029Z]     at org.apache.maven.DefaultMaven.doExecute (DefaultMaven.java:192)
[2019-04-03T23:29:43.029Z]     at org.apache.maven.DefaultMaven.execute (DefaultMaven.java:105)
[2019-04-03T23:29:43.029Z]     at org.apache.maven.cli.MavenCli.execute (MavenCli.java:956)
[2019-04-03T23:29:43.029Z]     at org.apache.maven.cli.MavenCli.doMain (MavenCli.java:288)
[2019-04-03T23:29:43.029Z]     at org.apache.maven.cli.MavenCli.main (MavenCli.java:192)
[2019-04-03T23:29:43.029Z]     at sun.reflect.NativeMethodAccessorImpl.invoke0 (Native Method)
[2019-04-03T23:29:43.029Z]     at sun.reflect.NativeMethodAccessorImpl.invoke (NativeMethodAccessorImpl.java:62)
[2019-04-03T23:29:43.029Z]     at sun.reflect.DelegatingMethodAccessorImpl.invoke (DelegatingMethodAccessorImpl.java:43)
[2019-04-03T23:29:43.029Z]     at java.lang.reflect.Method.invoke (Method.java:498)
[2019-04-03T23:29:43.029Z]     at org.codehaus.plexus.classworlds.launcher.Launcher.launchEnhanced
(Launcher.java:289)
[2019-04-03T23:29:43.029Z]     at org.codehaus.plexus.classworlds.launcher.Launcher.launch
(Launcher.java:229)
[2019-04-03T23:29:43.029Z]     at org.codehaus.plexus.classworlds.launcher.Launcher.mainWithExitCode
(Launcher.java:415)
[2019-04-03T23:29:43.029Z]     at org.codehaus.plexus.classworlds.launcher.Launcher.main (Launcher.java:356)
[2019-04-03T23:29:43.029Z] [ERROR] 
[2019-04-03T23:29:43.029Z] [ERROR] Re-run Maven using the -X switch to enable full debug logging.
[2019-04-03T23:29:43.029Z] [ERROR] 
[2019-04-03T23:29:43.029Z] [ERROR] For more information about the errors and possible solutions,
please read the following articles:
[2019-04-03T23:29:43.029Z] [ERROR] [Help 1] http://cwiki.apache.org/confluence/display/MAVEN/MojoFailureException
[2019-04-03T23:29:43.029Z] [ERROR] 
[2019-04-03T23:29:43.029Z] [ERROR] After correcting the problems, you can resume the build
with the command
[2019-04-03T23:29:43.029Z] [ERROR]   mvn <goals> -rf :surefire-its
[Pipeline] }
[Pipeline] // withEnv
[Pipeline] }
[Pipeline] }
[Pipeline] // stage
[Pipeline] // withEnv
[Pipeline] fileExists
[Pipeline] }
[Pipeline] // stage
[Pipeline] fileExists
[Pipeline] zip
[Pipeline] zip
[2019-04-03T23:29:43.374Z] Writing zip file of C:\Users\jenkins\AppData\Local\Temp\2\jenkins-maven-box-maven-surefire-1546-1222-6@2\maven-failsafe-plugin\target\it
to C:\Users\jenkins\AppData\Local\Temp\2\jenkins-maven-box-maven-surefire-1546-1222-6@2\maven-failsafe-plugin--windows-jdk11-maven3.6.x.zip
[2019-04-03T23:29:43.402Z] Writing zip file of C:\Users\jenkins\AppData\Local\Temp\2\jenkins-maven-box-maven-surefire-1546-1222-6\maven-failsafe-plugin\target\it
to C:\Users\jenkins\AppData\Local\Temp\2\jenkins-maven-box-maven-surefire-1546-1222-6\maven-failsafe-plugin--windows-jdk12-maven3.6.x.zip
[2019-04-03T23:29:43.543Z] Zipped 79 entries.
[2019-04-03T23:29:43.543Z] Archiving C:\Users\jenkins\AppData\Local\Temp\2\jenkins-maven-box-maven-surefire-1546-1222-6@2\maven-failsafe-plugin--windows-jdk11-maven3.6.x.zip
[2019-04-03T23:29:43.543Z] [Fast Archiver] No prior successful build to compare, so performing
full copy of artifacts
[2019-04-03T23:29:43.548Z] Zipped 79 entries.
[2019-04-03T23:29:43.549Z] Archiving C:\Users\jenkins\AppData\Local\Temp\2\jenkins-maven-box-maven-surefire-1546-1222-6\maven-failsafe-plugin--windows-jdk12-maven3.6.x.zip
[2019-04-03T23:29:43.549Z] [Fast Archiver] No prior successful build to compare, so performing
full copy of artifacts
[Pipeline] fileExists
[Pipeline] fileExists
[Pipeline] zip
[Pipeline] zip
[2019-04-03T23:29:43.678Z] Writing zip file of C:\Users\jenkins\AppData\Local\Temp\2\jenkins-maven-box-maven-surefire-1546-1222-6\surefire-its\target
to C:\Users\jenkins\AppData\Local\Temp\2\jenkins-maven-box-maven-surefire-1546-1222-6\surefire-its--windows-jdk12-maven3.6.x.zip
[2019-04-03T23:29:43.711Z] Writing zip file of C:\Users\jenkins\AppData\Local\Temp\2\jenkins-maven-box-maven-surefire-1546-1222-6@2\surefire-its\target
to C:\Users\jenkins\AppData\Local\Temp\2\jenkins-maven-box-maven-surefire-1546-1222-6@2\surefire-its--windows-jdk11-maven3.6.x.zip
[2019-04-03T23:29:46.401Z] Zipped 1963 entries.
[2019-04-03T23:29:46.401Z] Archiving C:\Users\jenkins\AppData\Local\Temp\2\jenkins-maven-box-maven-surefire-1546-1222-6\surefire-its--windows-jdk12-maven3.6.x.zip
[2019-04-03T23:29:46.402Z] [Fast Archiver] No prior successful build to compare, so performing
full copy of artifacts
[2019-04-03T23:29:46.471Z] Zipped 1963 entries.
[2019-04-03T23:29:46.471Z] Archiving C:\Users\jenkins\AppData\Local\Temp\2\jenkins-maven-box-maven-surefire-1546-1222-6@2\surefire-its--windows-jdk11-maven3.6.x.zip
[2019-04-03T23:29:46.471Z] [Fast Archiver] No prior successful build to compare, so performing
full copy of artifacts
[Pipeline] archiveArtifacts
[2019-04-03T23:29:46.938Z] Archiving artifacts
[2019-04-03T23:29:47.024Z] [Fast Archiver] No prior successful build to compare, so performing
full copy of artifacts
[Pipeline] archiveArtifacts
[2019-04-03T23:29:47.080Z] Archiving artifacts
[2019-04-03T23:29:47.164Z] [Fast Archiver] No prior successful build to compare, so performing
full copy of artifacts
[Pipeline] cleanWs
[2019-04-03T23:29:47.433Z] [WS-CLEANUP] Deleting project workspace...
[2019-04-03T23:29:47.433Z] [WS-CLEANUP] Deferred wipeout is used...
[2019-04-03T23:29:47.510Z] [WS-CLEANUP] done
[Pipeline] }
[Pipeline] // ws
[Pipeline] }
[Pipeline] cleanWs
[2019-04-03T23:29:47.600Z] [WS-CLEANUP] Deleting project workspace...
[2019-04-03T23:29:47.600Z] [WS-CLEANUP] Deferred wipeout is used...
[Pipeline] // timestamps
[Pipeline] }
[2019-04-03T23:29:47.681Z] [WS-CLEANUP] done
[Pipeline] // node
[Pipeline] }
[Pipeline] }
[Pipeline] // ws
[Pipeline] }
[Pipeline] // timestamps
[Pipeline] }
[Pipeline] // node
[Pipeline] }
[Pipeline] // parallel
[Pipeline] echo
Build result: FAILURE
[Pipeline] jiraIssueSelector
[Pipeline] emailext
Mime
  • Unnamed multipart/mixed (inline, None, 0 bytes)
View raw message