maven-notifications mailing list archives

Site index · List index
Message view « Date » · « Thread »
Top « Date » · « Thread »
From Apache Jenkins Server <jenk...@builds.apache.org>
Subject Build failed in Jenkins: Maven TLP » maven-surefire » 1546-1222 #3
Date Tue, 02 Apr 2019 21:01:09 GMT
See https://builds.apache.org/job/maven-box/job/maven-surefire/job/1546-1222/3/

Changes:

* finished subtypes of RunEntry
* finished subtypes of RunEntry
* finished subtypes of RunEntry
* finished subtypes of RunEntry
* finished subtypes of RunEntry
* finished subtypes of RunEntry
* finished subtypes of RunEntry
* finished subtypes of RunEntry

2 tests failed.
FAILED:  org.apache.maven.surefire.its.JUnitPlatformIT.testJupiterEngine

Error Message:
wrong number of tests expected:<5> but was:<7>

Stack Trace:
junit.framework.AssertionFailedError: wrong number of tests expected:<5> but was:<7>
	at org.apache.maven.surefire.its.JUnitPlatformIT.testJupiterEngine(JUnitPlatformIT.java:43)


FAILED:  org.apache.maven.surefire.its.JUnitPlatformIT.testJupiterEngineWithDisplayNames

Error Message:
Did not find expected message in log

Stack Trace:
junit.framework.AssertionFailedError: Did not find expected message in log
	at org.apache.maven.surefire.its.JUnitPlatformIT.testJupiterEngineWithDisplayNames(JUnitPlatformIT.java:60)




Build log:
[...truncated 47615 lines...]
[2019-04-02T20:40:25.041Z] [INFO] Tests run: 2, Failures: 0, Errors: 0, Skipped: 0, Time elapsed:
24.19 s - in org.apache.maven.surefire.its.jiras.Surefire377TestNgAndJUnitTogetherIT
[2019-04-02T20:40:25.041Z] [INFO] Running org.apache.maven.surefire.its.jiras.Surefire408ManualProviderSelectionIT
[2019-04-02T20:40:33.239Z] [INFO] Tests run: 1, Failures: 0, Errors: 0, Skipped: 0, Time elapsed:
11.792 s - in org.apache.maven.surefire.its.jiras.Surefire408ManualProviderSelectionIT
[2019-04-02T20:40:33.239Z] [INFO] Running org.apache.maven.surefire.its.jiras.Surefire42NotExtendingTestCaseIT
[2019-04-02T20:40:46.087Z] [INFO] Tests run: 1, Failures: 0, Errors: 0, Skipped: 0, Time elapsed:
11.433 s - in org.apache.maven.surefire.its.jiras.Surefire42NotExtendingTestCaseIT
[2019-04-02T20:40:46.087Z] [INFO] Running org.apache.maven.surefire.its.jiras.Surefire44InnerClassTestIT
[2019-04-02T20:40:56.684Z] [INFO] Tests run: 1, Failures: 0, Errors: 0, Skipped: 0, Time elapsed:
11.214 s - in org.apache.maven.surefire.its.jiras.Surefire44InnerClassTestIT
[2019-04-02T20:40:56.684Z] [INFO] Running org.apache.maven.surefire.its.jiras.Surefire500PuzzlingErrorIT
[2019-04-02T20:41:09.444Z] [INFO] Tests run: 1, Failures: 0, Errors: 0, Skipped: 0, Time elapsed:
12.515 s - in org.apache.maven.surefire.its.jiras.Surefire500PuzzlingErrorIT
[2019-04-02T20:41:09.444Z] [INFO] Running org.apache.maven.surefire.its.jiras.Surefire510TestClassPathForkModesIT
[2019-04-02T20:41:33.621Z] [INFO] Tests run: 2, Failures: 0, Errors: 0, Skipped: 0, Time elapsed:
23.198 s - in org.apache.maven.surefire.its.jiras.Surefire510TestClassPathForkModesIT
[2019-04-02T20:41:33.621Z] [INFO] Running org.apache.maven.surefire.its.jiras.Surefire569RunTestFromDependencyJarsIT
[2019-04-02T20:41:42.388Z] [INFO] Tests run: 1, Failures: 0, Errors: 0, Skipped: 0, Time elapsed:
11.164 s - in org.apache.maven.surefire.its.jiras.Surefire569RunTestFromDependencyJarsIT
[2019-04-02T20:41:42.388Z] [INFO] Running org.apache.maven.surefire.its.jiras.Surefire570MultipleReportDirectoriesIT
[2019-04-02T20:42:44.120Z] [INFO] Tests run: 2, Failures: 0, Errors: 0, Skipped: 0, Time elapsed:
60.512 s - in org.apache.maven.surefire.its.jiras.Surefire570MultipleReportDirectoriesIT
[2019-04-02T20:42:44.120Z] [INFO] Running org.apache.maven.surefire.its.jiras.Surefire613TestCountInParallelIT
[2019-04-02T20:42:54.705Z] [INFO] Tests run: 1, Failures: 0, Errors: 0, Skipped: 0, Time elapsed:
11.747 s - in org.apache.maven.surefire.its.jiras.Surefire613TestCountInParallelIT
[2019-04-02T20:42:54.705Z] [INFO] Running org.apache.maven.surefire.its.jiras.Surefire621TestCountingJunit3InParallelIT
[2019-04-02T20:44:03.846Z] [INFO] Tests run: 5, Failures: 0, Errors: 0, Skipped: 0, Time elapsed:
65.087 s - in org.apache.maven.surefire.its.jiras.Surefire621TestCountingJunit3InParallelIT
[2019-04-02T20:44:03.846Z] [INFO] Running org.apache.maven.surefire.its.jiras.Surefire628ConsoleOutputBeforeAndAfterClassIT
[2019-04-02T20:44:14.562Z] [INFO] Tests run: 1, Failures: 0, Errors: 0, Skipped: 0, Time elapsed:
13.299 s - in org.apache.maven.surefire.its.jiras.Surefire628ConsoleOutputBeforeAndAfterClassIT
[2019-04-02T20:44:14.562Z] [INFO] Running org.apache.maven.surefire.its.jiras.Surefire634UnsettableSystemPropertiesWarningIT
[2019-04-02T20:44:25.001Z] [INFO] Tests run: 1, Failures: 0, Errors: 0, Skipped: 0, Time elapsed:
11.424 s - in org.apache.maven.surefire.its.jiras.Surefire634UnsettableSystemPropertiesWarningIT
[2019-04-02T20:44:25.001Z] [INFO] Running org.apache.maven.surefire.its.jiras.Surefire649EmptyStringSystemPropertiesIT
[2019-04-02T20:44:45.137Z] [INFO] Tests run: 2, Failures: 0, Errors: 0, Skipped: 0, Time elapsed:
20.073 s - in org.apache.maven.surefire.its.jiras.Surefire649EmptyStringSystemPropertiesIT
[2019-04-02T20:44:45.137Z] [INFO] Running org.apache.maven.surefire.its.jiras.Surefire673MockitoIT
[2019-04-02T20:45:00.594Z] [INFO] Tests run: 1, Failures: 0, Errors: 0, Skipped: 0, Time elapsed:
13.804 s - in org.apache.maven.surefire.its.jiras.Surefire673MockitoIT
[2019-04-02T20:45:00.594Z] [INFO] Running org.apache.maven.surefire.its.jiras.Surefire674BuildFailingWhenErrorsIT
[2019-04-02T20:45:11.385Z] [INFO] Tests run: 1, Failures: 0, Errors: 0, Skipped: 0, Time elapsed:
13.049 s - in org.apache.maven.surefire.its.jiras.Surefire674BuildFailingWhenErrorsIT
[2019-04-02T20:45:11.385Z] [INFO] Running org.apache.maven.surefire.its.jiras.Surefire674BuildFailingWhenFailsafeErrorsIT
[2019-04-02T20:45:33.270Z] [INFO] Tests run: 1, Failures: 0, Errors: 0, Skipped: 0, Time elapsed:
18.483 s - in org.apache.maven.surefire.its.jiras.Surefire674BuildFailingWhenFailsafeErrorsIT
[2019-04-02T20:45:33.270Z] [INFO] Running org.apache.maven.surefire.its.jiras.Surefire685CommaSeparatedIncludesIT
[2019-04-02T20:45:44.410Z] [INFO] Tests run: 1, Failures: 0, Errors: 0, Skipped: 0, Time elapsed:
13.621 s - in org.apache.maven.surefire.its.jiras.Surefire685CommaSeparatedIncludesIT
[2019-04-02T20:45:44.410Z] [INFO] Running org.apache.maven.surefire.its.jiras.Surefire697NiceSummaryIT
[2019-04-02T20:45:57.282Z] [INFO] Tests run: 1, Failures: 0, Errors: 0, Skipped: 0, Time elapsed:
13.042 s - in org.apache.maven.surefire.its.jiras.Surefire697NiceSummaryIT
[2019-04-02T20:45:57.282Z] [INFO] Running org.apache.maven.surefire.its.jiras.Surefire705ParallelForkTimeoutIT
[2019-04-02T20:46:16.782Z] [INFO] Tests run: 1, Failures: 0, Errors: 0, Skipped: 0, Time elapsed:
18.128 s - in org.apache.maven.surefire.its.jiras.Surefire705ParallelForkTimeoutIT
[2019-04-02T20:46:16.782Z] [INFO] Running org.apache.maven.surefire.its.jiras.Surefire733AllOverrridesCapturedIT
[2019-04-02T20:46:33.093Z] [INFO] Tests run: 1, Failures: 0, Errors: 0, Skipped: 0, Time elapsed:
13.392 s - in org.apache.maven.surefire.its.jiras.Surefire733AllOverrridesCapturedIT
[2019-04-02T20:46:33.093Z] [INFO] Running org.apache.maven.surefire.its.jiras.Surefire735ForkFailWithRedirectConsoleOutputIT
[2019-04-02T20:46:52.354Z] [INFO] Tests run: 2, Failures: 0, Errors: 0, Skipped: 0, Time elapsed:
23.447 s - in org.apache.maven.surefire.its.jiras.Surefire735ForkFailWithRedirectConsoleOutputIT
[2019-04-02T20:46:52.354Z] [INFO] Running org.apache.maven.surefire.its.jiras.Surefire740TruncatedCommaIT
[2019-04-02T20:47:03.885Z] [INFO] Tests run: 1, Failures: 0, Errors: 0, Skipped: 0, Time elapsed:
11.893 s - in org.apache.maven.surefire.its.jiras.Surefire740TruncatedCommaIT
[2019-04-02T20:47:03.885Z] [INFO] Running org.apache.maven.surefire.its.jiras.Surefire747MethodParallelWithSuiteCountIT
[2019-04-02T20:47:46.474Z] [INFO] Tests run: 2, Failures: 0, Errors: 0, Skipped: 0, Time elapsed:
37.865 s - in org.apache.maven.surefire.its.jiras.Surefire747MethodParallelWithSuiteCountIT
[2019-04-02T20:47:46.474Z] [INFO] Running org.apache.maven.surefire.its.jiras.Surefire772BothReportsIT
[2019-04-02T20:48:05.397Z] [INFO] Tests run: 3, Failures: 0, Errors: 0, Skipped: 0, Time elapsed:
22.969 s - in org.apache.maven.surefire.its.jiras.Surefire772BothReportsIT
[2019-04-02T20:48:05.397Z] [INFO] Running org.apache.maven.surefire.its.jiras.Surefire772NoFailsafeReportsIT
[2019-04-02T20:48:37.721Z] [INFO] Tests run: 4, Failures: 0, Errors: 0, Skipped: 0, Time elapsed:
31.595 s - in org.apache.maven.surefire.its.jiras.Surefire772NoFailsafeReportsIT
[2019-04-02T20:48:37.721Z] [INFO] Running org.apache.maven.surefire.its.jiras.Surefire772NoSurefireReportsIT
[2019-04-02T20:49:10.796Z] [INFO] Tests run: 4, Failures: 0, Errors: 0, Skipped: 0, Time elapsed:
30.758 s - in org.apache.maven.surefire.its.jiras.Surefire772NoSurefireReportsIT
[2019-04-02T20:49:10.796Z] [INFO] Running org.apache.maven.surefire.its.jiras.Surefire772SpecifiedReportsIT
[2019-04-02T20:49:33.922Z] [INFO] Tests run: 3, Failures: 0, Errors: 0, Skipped: 0, Time elapsed:
23.13 s - in org.apache.maven.surefire.its.jiras.Surefire772SpecifiedReportsIT
[2019-04-02T20:49:33.922Z] [INFO] Running org.apache.maven.surefire.its.jiras.Surefire801ForkModeNoneClassLoaderIT
[2019-04-02T20:49:39.535Z] [INFO] Tests run: 1, Failures: 0, Errors: 0, Skipped: 0, Time elapsed:
9.554 s - in org.apache.maven.surefire.its.jiras.Surefire801ForkModeNoneClassLoaderIT
[2019-04-02T20:49:39.535Z] [INFO] Running org.apache.maven.surefire.its.jiras.Surefire803MultiFailsafeExecsIT
[2019-04-02T20:50:27.489Z] [INFO] Tests run: 2, Failures: 0, Errors: 0, Skipped: 0, Time elapsed:
41.375 s - in org.apache.maven.surefire.its.jiras.Surefire803MultiFailsafeExecsIT
[2019-04-02T20:50:27.489Z] [INFO] Running org.apache.maven.surefire.its.jiras.Surefire806SpecifiedTestControlsIT
[2019-04-02T20:50:32.649Z] [WARNING] Tests run: 3, Failures: 0, Errors: 0, Skipped: 2, Time
elapsed: 11.855 s - in org.apache.maven.surefire.its.jiras.Surefire806SpecifiedTestControlsIT
[2019-04-02T20:50:32.649Z] [INFO] Running org.apache.maven.surefire.its.jiras.Surefire809GroupExpressionsIT
[2019-04-02T20:51:58.820Z] [INFO] Tests run: 6, Failures: 0, Errors: 0, Skipped: 0, Time elapsed:
73.286 s - in org.apache.maven.surefire.its.jiras.Surefire809GroupExpressionsIT
[2019-04-02T20:51:58.820Z] [INFO] Running org.apache.maven.surefire.its.jiras.Surefire812Log4JClassLoaderIT
[2019-04-02T20:51:59.994Z] [INFO] Tests run: 1, Failures: 0, Errors: 0, Skipped: 0, Time elapsed:
14.029 s - in org.apache.maven.surefire.its.jiras.Surefire812Log4JClassLoaderIT
[2019-04-02T20:51:59.995Z] [INFO] Running org.apache.maven.surefire.its.jiras.Surefire817SystemExitIT
[2019-04-02T20:52:15.502Z] [INFO] Tests run: 1, Failures: 0, Errors: 0, Skipped: 0, Time elapsed:
13.36 s - in org.apache.maven.surefire.its.jiras.Surefire817SystemExitIT
[2019-04-02T20:52:15.502Z] [INFO] Running org.apache.maven.surefire.its.jiras.Surefire818NpeIgnoresTestsIT
[2019-04-02T20:52:33.196Z] [INFO] Tests run: 1, Failures: 0, Errors: 0, Skipped: 0, Time elapsed:
14.665 s - in org.apache.maven.surefire.its.jiras.Surefire818NpeIgnoresTestsIT
[2019-04-02T20:52:33.196Z] [INFO] Running org.apache.maven.surefire.its.jiras.Surefire828EmptyGroupExprIT
[2019-04-02T20:53:21.345Z] [INFO] Tests run: 4, Failures: 0, Errors: 0, Skipped: 0, Time elapsed:
50.387 s - in org.apache.maven.surefire.its.jiras.Surefire828EmptyGroupExprIT
[2019-04-02T20:53:21.345Z] [INFO] Running org.apache.maven.surefire.its.jiras.Surefire832ProviderSelectionIT
[2019-04-02T20:53:34.590Z] [INFO] Tests run: 1, Failures: 0, Errors: 0, Skipped: 0, Time elapsed:
12.851 s - in org.apache.maven.surefire.its.jiras.Surefire832ProviderSelectionIT
[2019-04-02T20:53:34.590Z] [INFO] Running org.apache.maven.surefire.its.jiras.Surefire839TestWithoutCategoriesIT
[2019-04-02T20:53:59.623Z] [INFO] Tests run: 2, Failures: 0, Errors: 0, Skipped: 0, Time elapsed:
27.13 s - in org.apache.maven.surefire.its.jiras.Surefire839TestWithoutCategoriesIT
[2019-04-02T20:53:59.623Z] [INFO] Running org.apache.maven.surefire.its.jiras.Surefire847AdditionalFailureIT
[2019-04-02T20:54:13.029Z] [INFO] Tests run: 1, Failures: 0, Errors: 0, Skipped: 0, Time elapsed:
14.772 s - in org.apache.maven.surefire.its.jiras.Surefire847AdditionalFailureIT
[2019-04-02T20:54:13.029Z] [INFO] Running org.apache.maven.surefire.its.jiras.Surefire855AllowFailsafeUseArtifactFileIT
[2019-04-02T20:55:55.677Z] [INFO] Tests run: 4, Failures: 0, Errors: 0, Skipped: 0, Time elapsed:
92.412 s - in org.apache.maven.surefire.its.jiras.Surefire855AllowFailsafeUseArtifactFileIT
[2019-04-02T20:55:55.677Z] [INFO] Running org.apache.maven.surefire.its.jiras.Surefire901MIssingResultfileWhenNoTestsIT
[2019-04-02T20:55:55.974Z] [INFO] Tests run: 1, Failures: 0, Errors: 0, Skipped: 0, Time elapsed:
10.322 s - in org.apache.maven.surefire.its.jiras.Surefire901MIssingResultfileWhenNoTestsIT
[2019-04-02T20:55:55.974Z] [INFO] Running org.apache.maven.surefire.its.jiras.Surefire907PerThreadWithoutThreadCountIT
[2019-04-02T20:56:07.059Z] [INFO] Tests run: 1, Failures: 0, Errors: 0, Skipped: 0, Time elapsed:
9.982 s - in org.apache.maven.surefire.its.jiras.Surefire907PerThreadWithoutThreadCountIT
[2019-04-02T20:56:07.060Z] [INFO] Running org.apache.maven.surefire.its.jiras.Surefire920TestFailureIgnoreWithTimeoutIT
[2019-04-02T20:56:42.407Z] [INFO] Tests run: 2, Failures: 0, Errors: 0, Skipped: 0, Time elapsed:
33.983 s - in org.apache.maven.surefire.its.jiras.Surefire920TestFailureIgnoreWithTimeoutIT
[2019-04-02T20:56:42.407Z] [INFO] Running org.apache.maven.surefire.its.jiras.Surefire926FailureWith2ProvidersIT
[2019-04-02T20:57:01.511Z] [INFO] Tests run: 1, Failures: 0, Errors: 0, Skipped: 0, Time elapsed:
18.697 s - in org.apache.maven.surefire.its.jiras.Surefire926FailureWith2ProvidersIT
[2019-04-02T20:57:01.512Z] [INFO] Running org.apache.maven.surefire.its.jiras.Surefire930TestNgSuiteXmlIT
[2019-04-02T20:57:19.385Z] [INFO] Tests run: 1, Failures: 0, Errors: 0, Skipped: 0, Time elapsed:
19.117 s - in org.apache.maven.surefire.its.jiras.Surefire930TestNgSuiteXmlIT
[2019-04-02T20:57:19.385Z] [INFO] Running org.apache.maven.surefire.its.jiras.Surefire943ReportContentIT
[2019-04-02T20:58:14.122Z] [INFO] Tests run: 2, Failures: 0, Errors: 0, Skipped: 0, Time elapsed:
50.45 s - in org.apache.maven.surefire.its.jiras.Surefire943ReportContentIT
[2019-04-02T20:58:14.122Z] [INFO] Running org.apache.maven.surefire.its.jiras.Surefire946KillMainProcessInReusableForkIT
[2019-04-02T20:58:46.211Z] [INFO] Tests run: 3, Failures: 0, Errors: 0, Skipped: 0, Time elapsed:
36.768 s - in org.apache.maven.surefire.its.jiras.Surefire946KillMainProcessInReusableForkIT
[2019-04-02T20:58:46.211Z] [INFO] Running org.apache.maven.surefire.its.jiras.Surefire972BizarreNoClassDefIT
[2019-04-02T20:59:05.093Z] [INFO] Tests run: 1, Failures: 0, Errors: 0, Skipped: 0, Time elapsed:
19.645 s - in org.apache.maven.surefire.its.jiras.Surefire972BizarreNoClassDefIT
[2019-04-02T20:59:05.093Z] [INFO] Running org.apache.maven.surefire.its.jiras.Surefire975DefaultVMEncodingIT
[2019-04-02T20:59:18.378Z] [INFO] Tests run: 1, Failures: 0, Errors: 0, Skipped: 0, Time elapsed:
12.998 s - in org.apache.maven.surefire.its.jiras.Surefire975DefaultVMEncodingIT
[2019-04-02T20:59:18.378Z] [INFO] Running org.apache.maven.surefire.its.jiras.Surefire979WrongClassLoaderIT
[2019-04-02T20:59:33.438Z] [INFO] Tests run: 1, Failures: 0, Errors: 0, Skipped: 0, Time elapsed:
13.379 s - in org.apache.maven.surefire.its.jiras.Surefire979WrongClassLoaderIT
[2019-04-02T20:59:33.438Z] [INFO] Running org.apache.maven.surefire.its.jiras.Surefire985ParameterizedRunnerAndCategoriesIT
[2019-04-02T20:59:42.019Z] [INFO] Tests run: 1, Failures: 0, Errors: 0, Skipped: 0, Time elapsed:
10.454 s - in org.apache.maven.surefire.its.jiras.Surefire985ParameterizedRunnerAndCategoriesIT
[2019-04-02T20:59:42.019Z] [INFO] Running org.apache.maven.surefire.its.jiras.Surefire995CategoryInheritanceIT
[2019-04-02T21:00:43.325Z] [INFO] Tests run: 5, Failures: 0, Errors: 0, Skipped: 0, Time elapsed:
57.085 s - in org.apache.maven.surefire.its.jiras.Surefire995CategoryInheritanceIT
[2019-04-02T21:00:43.325Z] [INFO] 
[2019-04-02T21:00:43.325Z] [INFO] Results:
[2019-04-02T21:00:43.325Z] [INFO] 
[2019-04-02T21:00:43.325Z] [ERROR] Failures: 
[2019-04-02T21:00:43.325Z] [ERROR]   JUnitPlatformIT.testJupiterEngine:43 wrong number of
tests expected:<5> but was:<7>
[2019-04-02T21:00:43.325Z] [ERROR]   JUnitPlatformIT.testJupiterEngineWithDisplayNames:60
Did not find expected message in log
[2019-04-02T21:00:43.325Z] [INFO] 
[2019-04-02T21:00:43.325Z] [ERROR] Tests run: 792, Failures: 2, Errors: 0, Skipped: 150
[2019-04-02T21:00:43.325Z] [INFO] 
[2019-04-02T21:00:43.325Z] [INFO] 
[2019-04-02T21:00:43.325Z] [INFO] --- maven-checkstyle-plugin:3.0.0:check (checkstyle-check)
@ surefire-its ---
[2019-04-02T21:00:43.325Z] [INFO] 
[2019-04-02T21:00:43.325Z] [INFO] --- maven-failsafe-plugin:3.0.0-M3:verify (default) @ surefire-its
---
[2019-04-02T21:00:43.325Z] [INFO] Failsafe report directory: C:\Users\jenkins\AppData\Local\Temp\2\jenkins-maven-box-maven-surefire-1546-1222-3\surefire-its\target\failsafe-reports
[2019-04-02T21:00:43.325Z] [INFO] ------------------------------------------------------------------------
[2019-04-02T21:00:43.325Z] [INFO] Reactor Summary for Apache Maven Surefire 3.0.0-SNAPSHOT:
[2019-04-02T21:00:43.325Z] [INFO] 
[2019-04-02T21:00:43.325Z] [INFO] Apache Maven Surefire .............................. SUCCESS
[ 49.989 s]
[2019-04-02T21:00:43.325Z] [INFO] SureFire Logger API ................................ SUCCESS
[ 12.999 s]
[2019-04-02T21:00:43.325Z] [INFO] SureFire API ....................................... SUCCESS
[ 23.136 s]
[2019-04-02T21:00:43.325Z] [INFO] SureFire Booter .................................... SUCCESS
[ 27.648 s]
[2019-04-02T21:00:43.325Z] [INFO] Maven Surefire Test-Grouping Support ............... SUCCESS
[ 19.089 s]
[2019-04-02T21:00:43.325Z] [INFO] SureFire Providers ................................. SUCCESS
[  2.476 s]
[2019-04-02T21:00:43.325Z] [INFO] Shared JUnit3 Provider Code ........................ SUCCESS
[  9.130 s]
[2019-04-02T21:00:43.325Z] [INFO] Shared Java 5 Provider Base ........................ SUCCESS
[ 10.739 s]
[2019-04-02T21:00:43.325Z] [INFO] Shared JUnit4 Provider Code ........................ SUCCESS
[ 10.802 s]
[2019-04-02T21:00:43.325Z] [INFO] Shared JUnit48 Provider Code ....................... SUCCESS
[ 13.080 s]
[2019-04-02T21:00:43.325Z] [INFO] SureFire JUnit Runner .............................. SUCCESS
[ 10.270 s]
[2019-04-02T21:00:43.325Z] [INFO] SureFire JUnit4 Runner ............................. SUCCESS
[ 40.166 s]
[2019-04-02T21:00:43.325Z] [INFO] Maven Surefire Common .............................. SUCCESS
[ 52.837 s]
[2019-04-02T21:00:43.325Z] [INFO] SureFire JUnitCore Runner .......................... SUCCESS
[02:23 min]
[2019-04-02T21:00:43.325Z] [INFO] SureFire JUnit Platform Runner ..................... SUCCESS
[ 22.887 s]
[2019-04-02T21:00:43.326Z] [INFO] SureFire TestNG Utils .............................. SUCCESS
[ 11.132 s]
[2019-04-02T21:00:43.326Z] [INFO] SureFire TestNG Runner ............................. SUCCESS
[ 12.146 s]
[2019-04-02T21:00:43.326Z] [INFO] ShadeFire JUnit3 Provider .......................... SUCCESS
[  3.681 s]
[2019-04-02T21:00:43.326Z] [INFO] Surefire Report Parser ............................. SUCCESS
[ 12.953 s]
[2019-04-02T21:00:43.326Z] [INFO] Maven Surefire Plugin .............................. SUCCESS
[ 22.704 s]
[2019-04-02T21:00:43.326Z] [INFO] Maven Failsafe Plugin .............................. SUCCESS
[02:07 min]
[2019-04-02T21:00:43.326Z] [INFO] Maven Surefire Report Plugin ....................... SUCCESS
[ 28.137 s]
[2019-04-02T21:00:43.326Z] [INFO] Maven Surefire Integration Tests ................... FAILURE
[  02:26 h]
[2019-04-02T21:00:43.326Z] [INFO] ------------------------------------------------------------------------
[2019-04-02T21:00:43.326Z] [INFO] BUILD FAILURE
[2019-04-02T21:00:43.326Z] [INFO] ------------------------------------------------------------------------
[2019-04-02T21:00:43.326Z] [INFO] Total time:  02:37 h
[2019-04-02T21:00:43.326Z] [INFO] Finished at: 2019-04-02T21:00:40Z
[2019-04-02T21:00:43.326Z] [INFO] ------------------------------------------------------------------------
[2019-04-02T21:00:43.326Z] [ERROR] Failed to execute goal org.apache.maven.plugins:maven-failsafe-plugin:3.0.0-M3:verify
(default) on project surefire-its: There are test failures.
[2019-04-02T21:00:43.326Z] [ERROR] 
[2019-04-02T21:00:43.326Z] [ERROR] Please refer to C:\Users\jenkins\AppData\Local\Temp\2\jenkins-maven-box-maven-surefire-1546-1222-3\surefire-its\target\failsafe-reports
for the individual test results.
[2019-04-02T21:00:43.326Z] [ERROR] Please refer to dump files (if any exist) [date].dump,
[date]-jvmRun[N].dump and [date].dumpstream.
[2019-04-02T21:00:43.326Z] [ERROR] -> [Help 1]
[2019-04-02T21:00:43.326Z] org.apache.maven.lifecycle.LifecycleExecutionException: Failed
to execute goal org.apache.maven.plugins:maven-failsafe-plugin:3.0.0-M3:verify (default) on
project surefire-its: There are test failures.
[2019-04-02T21:00:43.326Z] 
[2019-04-02T21:00:43.326Z] Please refer to C:\Users\jenkins\AppData\Local\Temp\2\jenkins-maven-box-maven-surefire-1546-1222-3\surefire-its\target\failsafe-reports
for the individual test results.
[2019-04-02T21:00:43.326Z] Please refer to dump files (if any exist) [date].dump, [date]-jvmRun[N].dump
and [date].dumpstream.
[2019-04-02T21:00:43.326Z]     at org.apache.maven.lifecycle.internal.MojoExecutor.execute
(MojoExecutor.java:215)
[2019-04-02T21:00:43.326Z]     at org.apache.maven.lifecycle.internal.MojoExecutor.execute
(MojoExecutor.java:156)
[2019-04-02T21:00:43.326Z]     at org.apache.maven.lifecycle.internal.MojoExecutor.execute
(MojoExecutor.java:148)
[2019-04-02T21:00:43.326Z]     at org.apache.maven.lifecycle.internal.LifecycleModuleBuilder.buildProject
(LifecycleModuleBuilder.java:117)
[2019-04-02T21:00:43.326Z]     at org.apache.maven.lifecycle.internal.LifecycleModuleBuilder.buildProject
(LifecycleModuleBuilder.java:81)
[2019-04-02T21:00:43.326Z]     at org.apache.maven.lifecycle.internal.builder.singlethreaded.SingleThreadedBuilder.build
(SingleThreadedBuilder.java:56)
[2019-04-02T21:00:43.326Z]     at org.apache.maven.lifecycle.internal.LifecycleStarter.execute
(LifecycleStarter.java:128)
[2019-04-02T21:00:43.326Z]     at org.apache.maven.DefaultMaven.doExecute (DefaultMaven.java:305)
[2019-04-02T21:00:43.326Z]     at org.apache.maven.DefaultMaven.doExecute (DefaultMaven.java:192)
[2019-04-02T21:00:43.326Z]     at org.apache.maven.DefaultMaven.execute (DefaultMaven.java:105)
[2019-04-02T21:00:43.326Z]     at org.apache.maven.cli.MavenCli.execute (MavenCli.java:956)
[2019-04-02T21:00:43.326Z]     at org.apache.maven.cli.MavenCli.doMain (MavenCli.java:288)
[2019-04-02T21:00:43.326Z]     at org.apache.maven.cli.MavenCli.main (MavenCli.java:192)
[2019-04-02T21:00:43.326Z]     at sun.reflect.NativeMethodAccessorImpl.invoke0 (Native Method)
[2019-04-02T21:00:43.326Z]     at sun.reflect.NativeMethodAccessorImpl.invoke (NativeMethodAccessorImpl.java:62)
[2019-04-02T21:00:43.326Z]     at sun.reflect.DelegatingMethodAccessorImpl.invoke (DelegatingMethodAccessorImpl.java:43)
[2019-04-02T21:00:43.326Z]     at java.lang.reflect.Method.invoke (Method.java:498)
[2019-04-02T21:00:43.326Z]     at org.codehaus.plexus.classworlds.launcher.Launcher.launchEnhanced
(Launcher.java:289)
[2019-04-02T21:00:43.326Z]     at org.codehaus.plexus.classworlds.launcher.Launcher.launch
(Launcher.java:229)
[2019-04-02T21:00:43.326Z]     at org.codehaus.plexus.classworlds.launcher.Launcher.mainWithExitCode
(Launcher.java:415)
[2019-04-02T21:00:43.326Z]     at org.codehaus.plexus.classworlds.launcher.Launcher.main (Launcher.java:356)
[2019-04-02T21:00:43.326Z] Caused by: org.apache.maven.plugin.MojoFailureException: There
are test failures.
[2019-04-02T21:00:43.326Z] 
[2019-04-02T21:00:43.326Z] Please refer to C:\Users\jenkins\AppData\Local\Temp\2\jenkins-maven-box-maven-surefire-1546-1222-3\surefire-its\target\failsafe-reports
for the individual test results.
[2019-04-02T21:00:43.326Z] Please refer to dump files (if any exist) [date].dump, [date]-jvmRun[N].dump
and [date].dumpstream.
[2019-04-02T21:00:43.326Z]     at org.apache.maven.plugin.surefire.SurefireHelper.throwException
(SurefireHelper.java:271)
[2019-04-02T21:00:43.326Z]     at org.apache.maven.plugin.surefire.SurefireHelper.reportExecution
(SurefireHelper.java:159)
[2019-04-02T21:00:43.326Z]     at org.apache.maven.plugin.failsafe.VerifyMojo.execute (VerifyMojo.java:192)
[2019-04-02T21:00:43.326Z]     at org.apache.maven.plugin.DefaultBuildPluginManager.executeMojo
(DefaultBuildPluginManager.java:137)
[2019-04-02T21:00:43.326Z]     at org.apache.maven.lifecycle.internal.MojoExecutor.execute
(MojoExecutor.java:210)
[2019-04-02T21:00:43.326Z]     at org.apache.maven.lifecycle.internal.MojoExecutor.execute
(MojoExecutor.java:156)
[2019-04-02T21:00:43.326Z]     at org.apache.maven.lifecycle.internal.MojoExecutor.execute
(MojoExecutor.java:148)
[2019-04-02T21:00:43.326Z]     at org.apache.maven.lifecycle.internal.LifecycleModuleBuilder.buildProject
(LifecycleModuleBuilder.java:117)
[2019-04-02T21:00:43.326Z]     at org.apache.maven.lifecycle.internal.LifecycleModuleBuilder.buildProject
(LifecycleModuleBuilder.java:81)
[2019-04-02T21:00:43.326Z]     at org.apache.maven.lifecycle.internal.builder.singlethreaded.SingleThreadedBuilder.build
(SingleThreadedBuilder.java:56)
[2019-04-02T21:00:43.326Z]     at org.apache.maven.lifecycle.internal.LifecycleStarter.execute
(LifecycleStarter.java:128)
[2019-04-02T21:00:43.326Z]     at org.apache.maven.DefaultMaven.doExecute (DefaultMaven.java:305)
[2019-04-02T21:00:43.326Z]     at org.apache.maven.DefaultMaven.doExecute (DefaultMaven.java:192)
[2019-04-02T21:00:43.326Z]     at org.apache.maven.DefaultMaven.execute (DefaultMaven.java:105)
[2019-04-02T21:00:43.326Z]     at org.apache.maven.cli.MavenCli.execute (MavenCli.java:956)
[2019-04-02T21:00:43.326Z]     at org.apache.maven.cli.MavenCli.doMain (MavenCli.java:288)
[2019-04-02T21:00:43.326Z]     at org.apache.maven.cli.MavenCli.main (MavenCli.java:192)
[2019-04-02T21:00:43.326Z]     at sun.reflect.NativeMethodAccessorImpl.invoke0 (Native Method)
[2019-04-02T21:00:43.326Z]     at sun.reflect.NativeMethodAccessorImpl.invoke (NativeMethodAccessorImpl.java:62)
[2019-04-02T21:00:43.326Z]     at sun.reflect.DelegatingMethodAccessorImpl.invoke (DelegatingMethodAccessorImpl.java:43)
[2019-04-02T21:00:43.326Z]     at java.lang.reflect.Method.invoke (Method.java:498)
[2019-04-02T21:00:43.326Z]     at org.codehaus.plexus.classworlds.launcher.Launcher.launchEnhanced
(Launcher.java:289)
[2019-04-02T21:00:43.326Z]     at org.codehaus.plexus.classworlds.launcher.Launcher.launch
(Launcher.java:229)
[2019-04-02T21:00:43.326Z]     at org.codehaus.plexus.classworlds.launcher.Launcher.mainWithExitCode
(Launcher.java:415)
[2019-04-02T21:00:43.326Z]     at org.codehaus.plexus.classworlds.launcher.Launcher.main (Launcher.java:356)
[2019-04-02T21:00:43.327Z] [ERROR] 
[2019-04-02T21:00:43.327Z] [ERROR] Re-run Maven using the -X switch to enable full debug logging.
[2019-04-02T21:00:43.327Z] [ERROR] 
[2019-04-02T21:00:43.327Z] [ERROR] For more information about the errors and possible solutions,
please read the following articles:
[2019-04-02T21:00:43.327Z] [ERROR] [Help 1] http://cwiki.apache.org/confluence/display/MAVEN/MojoFailureException
[2019-04-02T21:00:43.327Z] [ERROR] 
[2019-04-02T21:00:43.327Z] [ERROR] After correcting the problems, you can resume the build
with the command
[2019-04-02T21:00:43.327Z] [ERROR]   mvn <goals> -rf :surefire-its
[Pipeline] }
[Pipeline] // withEnv
[Pipeline] }
[Pipeline] // stage
[Pipeline] fileExists
[Pipeline] zip
[2019-04-02T21:00:43.545Z] Writing zip file of C:\Users\jenkins\AppData\Local\Temp\2\jenkins-maven-box-maven-surefire-1546-1222-3\maven-failsafe-plugin\target\it
to C:\Users\jenkins\AppData\Local\Temp\2\jenkins-maven-box-maven-surefire-1546-1222-3\maven-failsafe-plugin--windows-jdk8-maven3.6.x.zip
[2019-04-02T21:00:44.087Z] Zipped 78 entries.
[2019-04-02T21:00:44.087Z] Archiving C:\Users\jenkins\AppData\Local\Temp\2\jenkins-maven-box-maven-surefire-1546-1222-3\maven-failsafe-plugin--windows-jdk8-maven3.6.x.zip
[2019-04-02T21:00:44.087Z] [Fast Archiver] No prior successful build to compare, so performing
full copy of artifacts
[Pipeline] fileExists
[Pipeline] zip
[2019-04-02T21:00:44.216Z] Writing zip file of C:\Users\jenkins\AppData\Local\Temp\2\jenkins-maven-box-maven-surefire-1546-1222-3\surefire-its\target
to C:\Users\jenkins\AppData\Local\Temp\2\jenkins-maven-box-maven-surefire-1546-1222-3\surefire-its--windows-jdk8-maven3.6.x.zip
[2019-04-02T21:01:04.427Z] Zipped 16044 entries.
[2019-04-02T21:01:04.427Z] Archiving C:\Users\jenkins\AppData\Local\Temp\2\jenkins-maven-box-maven-surefire-1546-1222-3\surefire-its--windows-jdk8-maven3.6.x.zip
[2019-04-02T21:01:04.427Z] [Fast Archiver] No prior successful build to compare, so performing
full copy of artifacts
[Pipeline] archiveArtifacts
[2019-04-02T21:01:06.750Z] Archiving artifacts
[2019-04-02T21:01:06.774Z] [Fast Archiver] No prior successful build to compare, so performing
full copy of artifacts
[Pipeline] cleanWs
[2019-04-02T21:01:08.958Z] [WS-CLEANUP] Deleting project workspace...
[2019-04-02T21:01:08.958Z] [WS-CLEANUP] Deferred wipeout is used...
[2019-04-02T21:01:09.128Z] [WS-CLEANUP] done
[Pipeline] }
[Pipeline] // ws
[Pipeline] }
[Pipeline] // timestamps
[Pipeline] }
[Pipeline] // node
[Pipeline] }
[Pipeline] // parallel
[Pipeline] echo
Build result: FAILURE
[Pipeline] jiraIssueSelector
[Pipeline] emailext
Mime
  • Unnamed multipart/mixed (inline, None, 0 bytes)
View raw message