maven-notifications mailing list archives

Site index · List index
Message view « Date » · « Thread »
Top « Date » · « Thread »
From Apache Jenkins Server <jenk...@builds.apache.org>
Subject Build failed in Jenkins: Maven TLP » maven-antrun-plugin » xmlunit #2
Date Wed, 17 Apr 2019 09:04:58 GMT
See https://builds.apache.org/job/maven-box/job/maven-antrun-plugin/job/xmlunit/2/

No changes.

All tests passed

Build log:
[...truncated 2728 lines...]
	at org.apache.maven.wagon.providers.http.httpclient.protocol.HttpRequestExecutor.execute(HttpRequestExecutor.java:123)
	at org.apache.maven.wagon.providers.http.httpclient.impl.execchain.MainClientExec.execute(MainClientExec.java:254)
	at org.apache.maven.wagon.providers.http.httpclient.impl.execchain.ProtocolExec.execute(ProtocolExec.java:195)
	at org.apache.maven.wagon.providers.http.httpclient.impl.execchain.RetryExec.execute(RetryExec.java:86)
	at org.apache.maven.wagon.providers.http.httpclient.impl.execchain.RedirectExec.execute(RedirectExec.java:108)
	at org.apache.maven.wagon.providers.http.httpclient.impl.client.InternalHttpClient.doExecute(InternalHttpClient.java:184)
	at org.apache.maven.wagon.providers.http.httpclient.impl.client.CloseableHttpClient.execute(CloseableHttpClient.java:82)
	at org.apache.maven.wagon.providers.http.AbstractHttpClientWagon.execute(AbstractHttpClientWagon.java:832)
	at org.apache.maven.wagon.providers.http.AbstractHttpClientWagon.fillInputData(AbstractHttpClientWagon.java:983)
	... 50 more
[ERROR] 
[ERROR] Re-run Maven using the -X switch to enable full debug logging.
[ERROR] 
[ERROR] For more information about the errors and possible solutions, please read the following
articles:
[ERROR] [Help 1] http://cwiki.apache.org/confluence/display/MAVEN/DependencyResolutionException
Picked up JAVA_TOOL_OPTIONS: -Dmaven.ext.class.path="f:\jenkins\jenkins-slave\workspace\-box_maven-antrun-plugin_xmlunit@2@2@tmp\withMavenf5f3e60d\pipeline-maven-spy.jar"
-Dorg.jenkinsci.plugins.pipeline.maven.reportsFolder="f:\jenkins\jenkins-slave\workspace\-box_maven-antrun-plugin_xmlunit@2@2@tmp\withMavenf5f3e60d"

[Pipeline] }
[Pipeline] // dir
[Pipeline] }
[Fast Archiver] No prior successful build to compare, so performing full copy of artifacts
[withMaven] openTasksPublisher - Scan Tasks for Maven artifact org.apache.maven.plugins:maven-antrun-plugin:maven-plugin:3.0.0-SNAPSHOT
in source directory windows-jdk7-m3.3.x_build\src\main\java
[TASKS] Scanning folder 'f:\jenkins\jenkins-slave\workspace\-box_maven-antrun-plugin_xmlunit@2@2'
for files matching the pattern 'windows-jdk7-m3.3.x_build\src\main\java\**\*' - excludes:
null
[TASKS] Found 9 files to scan for tasks
[TASKS] Found 0 open tasks.
Skipping warnings blame since pipelines do not have an SCM link.%n
[withMaven] Publishers: Generated Artifacts Publisher: 20 ms, Open Task Scanner Publisher:
155 ms
[Pipeline] // withMaven
[Pipeline] cleanWs
[WS-CLEANUP] Deleting project workspace...
[WS-CLEANUP] Deferred wipeout is used...
[WS-CLEANUP] done
[Pipeline] cleanWs
[WS-CLEANUP] Deleting project workspace...
[WS-CLEANUP] Deferred wipeout is used...
[WS-CLEANUP] done
[Pipeline] }
[Pipeline] // stage
[Pipeline] }
[Pipeline] // ws
[Pipeline] }
[Pipeline] // node
[Pipeline] }
Failed in branch windows-jdk7-m3.3.x_build
[INFO] Downloaded from central: https://repo.maven.apache.org/maven2/org/xmlunit/xmlunit-core/2.6.2/xmlunit-core-2.6.2.pom
(2.7 kB at 1 B/s)
[INFO] Downloading from central: https://repo.maven.apache.org/maven2/org/xmlunit/xmlunit-matchers/2.6.2/xmlunit-matchers-2.6.2.jar
[INFO] Downloading from central: https://repo.maven.apache.org/maven2/org/xmlunit/xmlunit-core/2.6.2/xmlunit-core-2.6.2.jar
[INFO] Downloaded from central: https://repo.maven.apache.org/maven2/org/xmlunit/xmlunit-matchers/2.6.2/xmlunit-matchers-2.6.2.jar
(20 kB at 113 kB/s)
[INFO] Downloaded from central: https://repo.maven.apache.org/maven2/org/xmlunit/xmlunit-core/2.6.2/xmlunit-core-2.6.2.jar
(168 kB at 509 kB/s)
[INFO] 
[INFO] --- maven-clean-plugin:3.1.0:clean (default-clean) @ maven-antrun-plugin ---
[INFO] 
[INFO] --- maven-enforcer-plugin:1.4.1:enforce (enforce-maven-version) @ maven-antrun-plugin
---
[INFO] 
[INFO] --- maven-enforcer-plugin:1.4.1:enforce (enforce-bytecode-version) @ maven-antrun-plugin
---
[WARNING] Invalid bytecodeVersion for module-info.class: expected 51, but was 53
[INFO] 
[INFO] --- maven-enforcer-plugin:1.4.1:enforce (ban-known-bad-maven-versions) @ maven-antrun-plugin
---
[INFO] 
[INFO] --- maven-enforcer-plugin:1.4.1:enforce (ensure-no-container-api) @ maven-antrun-plugin
---
[INFO] 
[INFO] --- apache-rat-plugin:0.12:check (rat-check) @ maven-antrun-plugin ---
[INFO] Enabled default license matchers.
[INFO] Will parse SCM ignores for exclusions...
[INFO] Parsing exclusions from f:\jenkins\jenkins-slave\workspace\-box_maven-antrun-plugin_xmlunit@3\windows-jdk11-m3.5.x_build\.gitignore
[INFO] Finished adding exclusions from SCM ignore files.
[INFO] 71 implicit excludes (use -debug for more details).
[INFO] Exclude: src/test/resources/configuration-writer/*.xml
[INFO] Exclude: .repository/**
[INFO] Exclude: .maven/spy.log
[INFO] Exclude: dependency-reduced-pom.xml
[INFO] Exclude: .java-version
[INFO] 102 resources included (use -debug for more details)
[INFO] Rat check: Summary over all files. Unapproved: 0, unknown: 0, generated: 0, approved:
102 licenses.
[INFO] 
[INFO] --- maven-plugin-plugin:3.5.2:helpmojo (generate-helpmojo) @ maven-antrun-plugin ---
[INFO] Using 'UTF-8' encoding to read mojo source files.
[INFO] java-javadoc mojo extractor found 0 mojo descriptor.
[INFO] java-annotations mojo extractor found 0 mojo descriptor.
[INFO] 
[INFO] --- maven-remote-resources-plugin:1.5:process (process-resource-bundles) @ maven-antrun-plugin
---
[INFO] 
[INFO] --- maven-resources-plugin:3.1.0:resources (default-resources) @ maven-antrun-plugin
---
[INFO] Using 'UTF-8' encoding to copy filtered resources.
[INFO] Copying 1 resource
[INFO] Copying 3 resources
[INFO] 
[INFO] --- maven-compiler-plugin:3.7.0:compile (default-compile) @ maven-antrun-plugin ---
[INFO] Changes detected - recompiling the module!
[INFO] Compiling 10 source files to f:\jenkins\jenkins-slave\workspace\-box_maven-antrun-plugin_xmlunit@3\windows-jdk11-m3.5.x_build\target\classes
[INFO] 
[INFO] --- maven-plugin-plugin:3.5.2:descriptor (default-descriptor) @ maven-antrun-plugin
---
[INFO] Using 'UTF-8' encoding to read mojo source files.
[INFO] java-javadoc mojo extractor found 0 mojo descriptor.
[INFO] java-annotations mojo extractor found 2 mojo descriptors.
[INFO] 
[INFO] --- maven-resources-plugin:3.1.0:testResources (default-testResources) @ maven-antrun-plugin
---
[INFO] Using 'UTF-8' encoding to copy filtered resources.
[INFO] Copying 4 resources
[INFO] Copying 3 resources
[INFO] 
[INFO] --- maven-compiler-plugin:3.7.0:testCompile (default-testCompile) @ maven-antrun-plugin
---
[INFO] Changes detected - recompiling the module!
[INFO] Compiling 1 source file to f:\jenkins\jenkins-slave\workspace\-box_maven-antrun-plugin_xmlunit@3\windows-jdk11-m3.5.x_build\target\test-classes
[INFO] 
[INFO] --- maven-surefire-plugin:2.22.0:test (default-test) @ maven-antrun-plugin ---
[INFO] Surefire report directory: f:\jenkins\jenkins-slave\workspace\-box_maven-antrun-plugin_xmlunit@3\windows-jdk11-m3.5.x_build\target\surefire-reports
[INFO] 
[INFO] -------------------------------------------------------
[INFO]  T E S T S
[INFO] -------------------------------------------------------
[INFO] Running org.apache.maven.plugins.antrun.AntrunXmlPlexusConfigurationWriterTest
[INFO] Tests run: 4, Failures: 0, Errors: 0, Skipped: 0, Time elapsed: 0.538 s - in org.apache.maven.plugins.antrun.AntrunXmlPlexusConfigurationWriterTest
[INFO] 
[INFO] Results:
[INFO] 
[INFO] Tests run: 4, Failures: 0, Errors: 0, Skipped: 0
[INFO] 
[INFO] 
[INFO] --- maven-jar-plugin:3.1.0:jar (default-jar) @ maven-antrun-plugin ---
[INFO] Building jar: f:\jenkins\jenkins-slave\workspace\-box_maven-antrun-plugin_xmlunit@3\windows-jdk11-m3.5.x_build\target\maven-antrun-plugin-3.0.0-SNAPSHOT.jar
[INFO] 
[INFO] --- maven-plugin-plugin:3.5.2:addPluginArtifactMetadata (default-addPluginArtifactMetadata)
@ maven-antrun-plugin ---
[INFO] 
[INFO] --- maven-site-plugin:3.7.1:attach-descriptor (attach-descriptor) @ maven-antrun-plugin
---
[INFO] Skipping because packaging 'maven-plugin' is not pom.
[INFO] 
[INFO] --- maven-invoker-plugin:3.1.0:install (integration-test) @ maven-antrun-plugin ---
[INFO] Installing f:\jenkins\jenkins-slave\workspace\-box_maven-antrun-plugin_xmlunit@3\windows-jdk11-m3.5.x_build\pom.xml
to f:\jenkins\jenkins-slave\workspace\-box_maven-antrun-plugin_xmlunit@3\windows-jdk11-m3.5.x_build\target\local-repo\org\apache\maven\plugins\maven-antrun-plugin\3.0.0-SNAPSHOT\maven-antrun-plugin-3.0.0-SNAPSHOT.pom
[INFO] Installing f:\jenkins\jenkins-slave\workspace\-box_maven-antrun-plugin_xmlunit@3\windows-jdk11-m3.5.x_build\target\maven-antrun-plugin-3.0.0-SNAPSHOT.jar
to f:\jenkins\jenkins-slave\workspace\-box_maven-antrun-plugin_xmlunit@3\windows-jdk11-m3.5.x_build\target\local-repo\org\apache\maven\plugins\maven-antrun-plugin\3.0.0-SNAPSHOT\maven-antrun-plugin-3.0.0-SNAPSHOT.jar
[INFO] 
[INFO] --- maven-invoker-plugin:3.1.0:integration-test (integration-test) @ maven-antrun-plugin
---
[INFO] Building: ant-1.7-features\pom.xml
[INFO] run post-build script verify.bsh
[INFO]           ant-1.7-features\pom.xml ......................... SUCCESS (23.3 s)
[INFO] Building: antrun-default-test\pom.xml
[INFO] run post-build script verify.bsh
[INFO]           antrun-default-test\pom.xml ...................... SUCCESS (5.4 s)
[INFO] Building: attach-artifact-from-ant-task\pom.xml
[INFO] run post-build script verify.bsh
[INFO]           attach-artifact-from-ant-task\pom.xml ............ SUCCESS (7.3 s)
[INFO] Building: attach-artifact-test\pom.xml
[INFO] run post-build script verify.bsh
[INFO]           attach-artifact-test\pom.xml ..................... SUCCESS (5.1 s)
[INFO] Building: attach-artifact-test-with-prefix\pom.xml
[INFO] run post-build script verify.bsh
[INFO]           attach-artifact-test-with-prefix\pom.xml ......... SUCCESS (5.2 s)
[INFO] Building: attach-artifact-test-with-prefix-unknown\pom.xml
[INFO]           attach-artifact-test-with-prefix-unknown\pom.xml . SUCCESS (4.9 s)
[INFO] Building: classpath-ref-test\pom.xml
[INFO]           classpath-ref-test\pom.xml ....................... SUCCESS (8.1 s)
[INFO] Building: classpath-test-scope-test\pom.xml
[INFO]           classpath-test-scope-test\pom.xml ................ SUCCESS (5.9 s)
[INFO] Building: copy-fail-test\pom.xml
[INFO]           copy-fail-test\pom.xml ........................... SUCCESS (4.6 s)
[INFO] Building: custom-ant-target-attributes\pom.xml
[INFO] run post-build script verify.groovy
WARNING: An illegal reflective access operation has occurred
WARNING: Illegal reflective access by org.codehaus.groovy.reflection.CachedClass (file:/f:/jenkins/jenkins-slave/workspace/.maven_repositories/null/org/codehaus/groovy/groovy-all/2.4.8/groovy-all-2.4.8.jar)
to method java.lang.Object.finalize()
WARNING: Please consider reporting this to the maintainers of org.codehaus.groovy.reflection.CachedClass
WARNING: Use --illegal-access=warn to enable warnings of further illegal reflective access
operations
WARNING: All illegal access operations will be denied in a future release
[INFO]           custom-ant-target-attributes\pom.xml ............. SUCCESS (5.5 s)
[INFO] Building: custom-task-test\pom.xml
[INFO]           custom-task-test\pom.xml ......................... SUCCESS (8.7 s)
[INFO] Building: env-var-test\pom.xml
[INFO]           env-var-test\pom.xml ............................. SUCCESS (6.1 s)
[INFO] Building: export-ant-properties\pom.xml
[INFO]           export-ant-properties\pom.xml .................... SUCCESS (10.8 s)
[INFO] Building: filesets-test\pom.xml
[INFO] run post-build script verify.bsh
[INFO]           filesets-test\pom.xml ............................ SUCCESS (5.9 s)
[INFO] Building: local-repo-prop-test\pom.xml
[INFO]           local-repo-prop-test\pom.xml ..................... SUCCESS (5.0 s)
[INFO] Building: MANTRUN-172\pom.xml
[INFO] run post-build script verify.bsh
[INFO]           MANTRUN-172\pom.xml .............................. SUCCESS (4.8 s)
[INFO] Building: MANTRUN-178\pom.xml
[INFO]           MANTRUN-178\pom.xml .............................. SUCCESS (4.8 s)
[INFO] Building: MANTRUN-179\pom.xml
[INFO] run post-build script verify.bsh
[INFO]           MANTRUN-179\pom.xml .............................. SUCCESS (4.5 s)
[INFO] Building: MANTRUN-192\pom.xml
[INFO]           MANTRUN-192\pom.xml .............................. SUCCESS (4.7 s)
[INFO] Building: multiple-phase-test\pom.xml
[INFO] run post-build script verify.bsh
[INFO]           multiple-phase-test\pom.xml ...................... SUCCESS (4.7 s)
[INFO] Building: never-fail-test\pom.xml
[INFO]           never-fail-test\pom.xml .......................... SUCCESS (4.8 s)
[INFO] Building: plugin-classpath-test\pom.xml
[INFO]           plugin-classpath-test\pom.xml .................... SUCCESS (9.6 s)
[INFO] Building: properties-attributes-test\pom.xml
[INFO]           properties-attributes-test\pom.xml ............... SUCCESS (6.0 s)
[INFO] Building: properties-test\pom.xml
[INFO]           properties-test\pom.xml .......................... SUCCESS (4.9 s)
[INFO] Building: task-encoding-test\pom.xml
[INFO]           task-encoding-test\pom.xml ....................... SUCCESS (4.9 s)
[INFO] Building: tasksattributes-test\pom.xml
[INFO] run post-build script verify.bsh
[INFO]           tasksattributes-test\pom.xml ..................... SUCCESS (6.6 s)
[INFO] 
[INFO] --- maven-checkstyle-plugin:3.0.0:check (checkstyle-check) @ maven-antrun-plugin ---
[INFO] 
[INFO] --- maven-invoker-plugin:3.1.0:verify (integration-test) @ maven-antrun-plugin ---
[INFO] -------------------------------------------------
[INFO] Build Summary:
[INFO]   Passed: 26, Failed: 0, Errors: 0, Skipped: 0
[INFO] -------------------------------------------------
[INFO] ------------------------------------------------------------------------
[INFO] BUILD SUCCESS
[INFO] ------------------------------------------------------------------------
[INFO] Total time: 34:09 min
[INFO] Finished at: 2019-04-17T02:04:50-07:00
[INFO] Final Memory: 43M/154M
[INFO] ------------------------------------------------------------------------
[INFO] [jenkins-event-spy] Generated F:\jenkins\jenkins-slave\workspace\-box_maven-antrun-plugin_xmlunit@3@tmp\withMavenb115346d\maven-spy-20190417-013040-41615310021569019246475.log
[Pipeline] }
[Pipeline] // dir
[Pipeline] }
[withMaven] artifactsPublisher - Archive artifact windows-jdk11-m3.5.x_build\pom.xml under
org\apache\maven\plugins\maven-antrun-plugin\3.0.0-SNAPSHOT\maven-antrun-plugin-3.0.0-SNAPSHOT.pom
[withMaven] artifactsPublisher - Archive artifact windows-jdk11-m3.5.x_build\target\maven-antrun-plugin-3.0.0-SNAPSHOT.jar
under org\apache\maven\plugins\maven-antrun-plugin\3.0.0-SNAPSHOT\maven-antrun-plugin-3.0.0-SNAPSHOT.jar
[Fast Archiver] No prior successful build to compare, so performing full copy of artifacts
[withMaven] junitPublisher - Archive test results for Maven artifact org.apache.maven.plugins:maven-antrun-plugin:maven-plugin:3.0.0-SNAPSHOT
generated by maven-surefire-plugin:test (default-test): windows-jdk11-m3.5.x_build\target\surefire-reports\*.xml
Recording test results
[withMaven] openTasksPublisher - Scan Tasks for Maven artifact org.apache.maven.plugins:maven-antrun-plugin:maven-plugin:3.0.0-SNAPSHOT
in source directory windows-jdk11-m3.5.x_build\src\main\java
[TASKS] Scanning folder 'f:\jenkins\jenkins-slave\workspace\-box_maven-antrun-plugin_xmlunit@3'
for files matching the pattern 'windows-jdk11-m3.5.x_build\src\main\java\**\*' - excludes:
null
[TASKS] Found 9 files to scan for tasks
[TASKS] Found 0 open tasks.
Skipping warnings blame since pipelines do not have an SCM link.%n
[withMaven] invokerPublisher - Archive invoker results for Maven artifact MavenArtifact{org.apache.maven.plugins:maven-antrun-plugin:maven-plugin:3.0.0-SNAPSHOT(version:
3.0.0-SNAPSHOT, snapshot:false) } generated by PluginInvocation{org.apache.maven.plugins:maven-invoker-plugin:3.1.0@integration-test
 integration-test}: windows-jdk11-m3.5.x_build\target\invoker-reports\*.xml
[withMaven] Publishers: Generated Artifacts Publisher: 111 ms, Junit Publisher: 325 ms, Open
Task Scanner Publisher: 93 ms, Invoker Publisher: 5919 ms, Pipeline Graph Publisher: 2 ms
[Pipeline] // withMaven
[Pipeline] cleanWs
[WS-CLEANUP] Deleting project workspace...
[WS-CLEANUP] Deferred wipeout is used...
[WS-CLEANUP] done
[Pipeline] }
[Pipeline] // stage
[Pipeline] }
[Pipeline] // ws
[Pipeline] }
[Pipeline] // node
[Pipeline] }
[Pipeline] // parallel
[Pipeline] stage
[Pipeline] { (Notifications)
[Pipeline] echo
Build result: FAILURE
[Pipeline] jiraIssueSelector
[Pipeline] emailext
Mime
  • Unnamed multipart/mixed (inline, None, 0 bytes)
View raw message