maven-notifications mailing list archives

Site index · List index
Message view « Date » · « Thread »
Top « Date » · « Thread »
From Apache Jenkins Server <jenk...@builds.apache.org>
Subject Build failed in Jenkins: Maven TLP » maven-archetype » master #12
Date Wed, 17 Apr 2019 22:06:17 GMT
See https://builds.apache.org/job/maven-box/job/maven-archetype/job/master/12/

No changes.

All tests passed

Build log:
[...truncated 15949 lines...]
[INFO] ------------------------------------------------------------------------
[INFO] Total time:  02:55 min
[INFO] Finished at: 2019-04-17T21:56:13Z
[INFO] ------------------------------------------------------------------------
[INFO] [jenkins-event-spy] Generated /home/jenkins/jenkins-slave/workspace/maven-box_maven-archetype_master@3@2@tmp/withMavene8a2f924/maven-spy-20190417-215318-2014542040330110177848.log
[ERROR] Failed to execute goal org.apache.maven.plugins:maven-invoker-plugin:3.1.0:run (integration-test)
on project maven-archetype-plugin: 21 builds failed. See console output above for details.
-> [Help 1]
org.apache.maven.lifecycle.LifecycleExecutionException: Failed to execute goal org.apache.maven.plugins:maven-invoker-plugin:3.1.0:run
(integration-test) on project maven-archetype-plugin: 21 builds failed. See console output
above for details.
    at org.apache.maven.lifecycle.internal.MojoExecutor.execute (MojoExecutor.java:215)
    at org.apache.maven.lifecycle.internal.MojoExecutor.execute (MojoExecutor.java:156)
    at org.apache.maven.lifecycle.internal.MojoExecutor.execute (MojoExecutor.java:148)
    at org.apache.maven.lifecycle.internal.LifecycleModuleBuilder.buildProject (LifecycleModuleBuilder.java:117)
    at org.apache.maven.lifecycle.internal.LifecycleModuleBuilder.buildProject (LifecycleModuleBuilder.java:81)
    at org.apache.maven.lifecycle.internal.builder.singlethreaded.SingleThreadedBuilder.build
(SingleThreadedBuilder.java:56)
    at org.apache.maven.lifecycle.internal.LifecycleStarter.execute (LifecycleStarter.java:128)
    at org.apache.maven.DefaultMaven.doExecute (DefaultMaven.java:305)
    at org.apache.maven.DefaultMaven.doExecute (DefaultMaven.java:192)
    at org.apache.maven.DefaultMaven.execute (DefaultMaven.java:105)
    at org.apache.maven.cli.MavenCli.execute (MavenCli.java:956)
    at org.apache.maven.cli.MavenCli.doMain (MavenCli.java:288)
    at org.apache.maven.cli.MavenCli.main (MavenCli.java:192)
    at jdk.internal.reflect.NativeMethodAccessorImpl.invoke0 (Native Method)
    at jdk.internal.reflect.NativeMethodAccessorImpl.invoke (NativeMethodAccessorImpl.java:62)
    at jdk.internal.reflect.DelegatingMethodAccessorImpl.invoke (DelegatingMethodAccessorImpl.java:43)
    at java.lang.reflect.Method.invoke (Method.java:567)
    at org.codehaus.plexus.classworlds.launcher.Launcher.launchEnhanced (Launcher.java:289)
    at org.codehaus.plexus.classworlds.launcher.Launcher.launch (Launcher.java:229)
    at org.codehaus.plexus.classworlds.launcher.Launcher.mainWithExitCode (Launcher.java:415)
    at org.codehaus.plexus.classworlds.launcher.Launcher.main (Launcher.java:356)
Caused by: org.apache.maven.plugin.MojoFailureException: 21 builds failed. See console output
above for details.
    at org.apache.maven.plugins.invoker.InvokerSession.handleFailures (InvokerSession.java:260)
    at org.apache.maven.plugins.invoker.InvokerMojo.processResults (InvokerMojo.java:68)
    at org.apache.maven.plugins.invoker.AbstractInvokerMojo.execute (AbstractInvokerMojo.java:738)
    at org.apache.maven.plugin.DefaultBuildPluginManager.executeMojo (DefaultBuildPluginManager.java:137)
    at org.apache.maven.lifecycle.internal.MojoExecutor.execute (MojoExecutor.java:210)
    at org.apache.maven.lifecycle.internal.MojoExecutor.execute (MojoExecutor.java:156)
    at org.apache.maven.lifecycle.internal.MojoExecutor.execute (MojoExecutor.java:148)
    at org.apache.maven.lifecycle.internal.LifecycleModuleBuilder.buildProject (LifecycleModuleBuilder.java:117)
    at org.apache.maven.lifecycle.internal.LifecycleModuleBuilder.buildProject (LifecycleModuleBuilder.java:81)
    at org.apache.maven.lifecycle.internal.builder.singlethreaded.SingleThreadedBuilder.build
(SingleThreadedBuilder.java:56)
    at org.apache.maven.lifecycle.internal.LifecycleStarter.execute (LifecycleStarter.java:128)
    at org.apache.maven.DefaultMaven.doExecute (DefaultMaven.java:305)
    at org.apache.maven.DefaultMaven.doExecute (DefaultMaven.java:192)
    at org.apache.maven.DefaultMaven.execute (DefaultMaven.java:105)
    at org.apache.maven.cli.MavenCli.execute (MavenCli.java:956)
    at org.apache.maven.cli.MavenCli.doMain (MavenCli.java:288)
    at org.apache.maven.cli.MavenCli.main (MavenCli.java:192)
    at jdk.internal.reflect.NativeMethodAccessorImpl.invoke0 (Native Method)
    at jdk.internal.reflect.NativeMethodAccessorImpl.invoke (NativeMethodAccessorImpl.java:62)
    at jdk.internal.reflect.DelegatingMethodAccessorImpl.invoke (DelegatingMethodAccessorImpl.java:43)
    at java.lang.reflect.Method.invoke (Method.java:567)
    at org.codehaus.plexus.classworlds.launcher.Launcher.launchEnhanced (Launcher.java:289)
    at org.codehaus.plexus.classworlds.launcher.Launcher.launch (Launcher.java:229)
    at org.codehaus.plexus.classworlds.launcher.Launcher.mainWithExitCode (Launcher.java:415)
    at org.codehaus.plexus.classworlds.launcher.Launcher.main (Launcher.java:356)
[ERROR] 
[ERROR] Re-run Maven using the -X switch to enable full debug logging.
[ERROR] 
[ERROR] For more information about the errors and possible solutions, please read the following
articles:
[ERROR] [Help 1] http://cwiki.apache.org/confluence/display/MAVEN/MojoFailureException
[ERROR] 
[ERROR] After correcting the problems, you can resume the build with the command
[ERROR]   mvn <goals> -rf :maven-archetype-plugin
[Pipeline] }
[Pipeline] // dir
[Pipeline] }
[withMaven] artifactsPublisher - Archive artifact linux-jdk12-m3.6.x_build/pom.xml under org/apache/maven/archetype/maven-archetype/3.0.2-SNAPSHOT/maven-archetype-3.0.2-SNAPSHOT.pom
[withMaven] artifactsPublisher - Archive artifact linux-jdk12-m3.6.x_build/target/maven-archetype-3.0.2-SNAPSHOT-site.xml
under org/apache/maven/archetype/maven-archetype/3.0.2-SNAPSHOT/maven-archetype-3.0.2-SNAPSHOT-site.xml
[withMaven] artifactsPublisher - Archive artifact linux-jdk12-m3.6.x_build/archetype-models/pom.xml
under org/apache/maven/archetype/archetype-models/3.0.2-SNAPSHOT/archetype-models-3.0.2-SNAPSHOT.pom
[withMaven] artifactsPublisher - Archive artifact linux-jdk12-m3.6.x_build/archetype-models/target/archetype-models-3.0.2-SNAPSHOT-site.xml
under org/apache/maven/archetype/archetype-models/3.0.2-SNAPSHOT/archetype-models-3.0.2-SNAPSHOT-site.xml
[withMaven] artifactsPublisher - Archive artifact linux-jdk12-m3.6.x_build/archetype-models/archetype-catalog/pom.xml
under org/apache/maven/archetype/archetype-catalog/3.0.2-SNAPSHOT/archetype-catalog-3.0.2-SNAPSHOT.pom
[withMaven] artifactsPublisher - Archive artifact linux-jdk12-m3.6.x_build/archetype-models/archetype-catalog/target/archetype-catalog-3.0.2-SNAPSHOT.jar
under org/apache/maven/archetype/archetype-catalog/3.0.2-SNAPSHOT/archetype-catalog-3.0.2-SNAPSHOT.jar
[withMaven] artifactsPublisher - Archive artifact linux-jdk12-m3.6.x_build/archetype-models/archetype-descriptor/pom.xml
under org/apache/maven/archetype/archetype-descriptor/3.0.2-SNAPSHOT/archetype-descriptor-3.0.2-SNAPSHOT.pom
[withMaven] artifactsPublisher - Archive artifact linux-jdk12-m3.6.x_build/archetype-models/archetype-descriptor/target/archetype-descriptor-3.0.2-SNAPSHOT.jar
under org/apache/maven/archetype/archetype-descriptor/3.0.2-SNAPSHOT/archetype-descriptor-3.0.2-SNAPSHOT.jar
[withMaven] artifactsPublisher - Archive artifact linux-jdk12-m3.6.x_build/archetype-common/pom.xml
under org/apache/maven/archetype/archetype-common/3.0.2-SNAPSHOT/archetype-common-3.0.2-SNAPSHOT.pom
[withMaven] artifactsPublisher - Archive artifact linux-jdk12-m3.6.x_build/archetype-common/target/archetype-common-3.0.2-SNAPSHOT.jar
under org/apache/maven/archetype/archetype-common/3.0.2-SNAPSHOT/archetype-common-3.0.2-SNAPSHOT.jar
[withMaven] artifactsPublisher - Archive artifact linux-jdk12-m3.6.x_build/archetype-packaging/pom.xml
under org/apache/maven/archetype/archetype-packaging/3.0.2-SNAPSHOT/archetype-packaging-3.0.2-SNAPSHOT.pom
[withMaven] artifactsPublisher - Archive artifact linux-jdk12-m3.6.x_build/archetype-packaging/target/archetype-packaging-3.0.2-SNAPSHOT.jar
under org/apache/maven/archetype/archetype-packaging/3.0.2-SNAPSHOT/archetype-packaging-3.0.2-SNAPSHOT.jar
[withMaven] junitPublisher - Archive test results for Maven artifact org.apache.maven.archetype:archetype-catalog:jar:3.0.2-SNAPSHOT
generated by maven-surefire-plugin:test (default-test): linux-jdk12-m3.6.x_build/archetype-models/archetype-catalog/target/surefire-reports/*.xml
Recording test results
None of the test reports contained any result
[withMaven] junitPublisher - Archive test results for Maven artifact org.apache.maven.archetype:archetype-descriptor:jar:3.0.2-SNAPSHOT
generated by maven-surefire-plugin:test (default-test): linux-jdk12-m3.6.x_build/archetype-models/archetype-descriptor/target/surefire-reports/*.xml
Recording test results
None of the test reports contained any result
[withMaven] junitPublisher - Archive test results for Maven artifact org.apache.maven.archetype:archetype-common:jar:3.0.2-SNAPSHOT
generated by maven-surefire-plugin:test (default-test): linux-jdk12-m3.6.x_build/archetype-common/target/surefire-reports/*.xml
Recording test results
[withMaven] junitPublisher - Archive test results for Maven artifact org.apache.maven.archetype:archetype-packaging:jar:3.0.2-SNAPSHOT
generated by maven-surefire-plugin:test (default-test): linux-jdk12-m3.6.x_build/archetype-packaging/target/surefire-reports/*.xml
Recording test results
None of the test reports contained any result
[withMaven] junitPublisher - Archive test results for Maven artifact org.apache.maven.plugins:maven-archetype-plugin:maven-plugin:3.0.2-SNAPSHOT
generated by maven-surefire-plugin:test (default-test): linux-jdk12-m3.6.x_build/maven-archetype-plugin/target/surefire-reports/*.xml
Recording test results
[withMaven] openTasksPublisher - Scan Tasks for Maven artifact org.apache.maven.archetype:archetype-common:jar:3.0.2-SNAPSHOT
in source directory linux-jdk12-m3.6.x_build/archetype-common/src/main/java
[withMaven] openTasksPublisher - Scan Tasks for Maven artifact org.apache.maven.plugins:maven-archetype-plugin:maven-plugin:3.0.2-SNAPSHOT
in source directory linux-jdk12-m3.6.x_build/maven-archetype-plugin/src/main/java
[TASKS] Scanning folder '/home/jenkins/jenkins-slave/workspace/maven-box_maven-archetype_master@3@2'
for files matching the pattern 'linux-jdk12-m3.6.x_build/archetype-common/src/main/java/**/*,linux-jdk12-m3.6.x_build/maven-archetype-plugin/src/main/java/**/*'
- excludes: null
[TASKS] Found 88 files to scan for tasks
[TASKS] Found 27 open tasks.
Skipping warnings blame since pipelines do not have an SCM link.%n
[TASKS] Computing warning deltas based on reference build #7
[withMaven] invokerPublisher - Archive invoker results for Maven artifact MavenArtifact{org.apache.maven.plugins:maven-archetype-plugin:maven-plugin:3.0.2-SNAPSHOT(version:
3.0.2-SNAPSHOT, snapshot:false) } generated by PluginInvocation{org.apache.maven.plugins:maven-invoker-plugin:3.1.0@run
 integration-test}: linux-jdk12-m3.6.x_build/maven-archetype-plugin/target/invoker-reports/*.xml
[INFO] run post-build script verify.groovy
[INFO]           create-3\pom.xml ................................. SUCCESS (59.5 s)
[INFO] Building: create-4\pom.xml
[withMaven] Publishers: Generated Artifacts Publisher: 5122 ms, Junit Publisher: 9451 ms,
Open Task Scanner Publisher: 3731 ms, Dependencies Fingerprint Publisher: 1601 ms, Invoker
Publisher: 22681 ms, Pipeline Graph Publisher: 24 ms
[Pipeline] // withMaven
[Pipeline] cleanWs
[WS-CLEANUP] Deleting project workspace...
[WS-CLEANUP] Deferred wipeout is used...
[WS-CLEANUP] done
[Pipeline] cleanWs
[WS-CLEANUP] Deleting project workspace...
[WS-CLEANUP] Deferred wipeout is used...
[WS-CLEANUP] done
[Pipeline] }
[Pipeline] // stage
[Pipeline] }
[Pipeline] // ws
[Pipeline] }
[Pipeline] // node
[Pipeline] }
Failed in branch linux-jdk12-m3.6.x_build
[INFO] run post-build script verify.groovy
[INFO]           create-4\pom.xml ................................. SUCCESS (76.4 s)
[INFO] Building: create-5\pom.xml
[INFO] run post-build script verify.groovy
[INFO]           create-5\pom.xml ................................. SUCCESS (107.7 s)
[INFO] Building: create-6\pom.xml
[INFO] run post-build script verify.groovy
[INFO]           create-6\pom.xml ................................. SUCCESS (19.6 s)
[INFO] Building: create-from-project\pom.xml
[INFO] run post-build script verify.bsh
[INFO]           create-from-project\pom.xml ...................... SUCCESS (7.8 s)
[INFO] Building: create-from-project-exclude-patterns\pom.xml
[INFO] run post-build script verify.bsh
[INFO]           create-from-project-exclude-patterns\pom.xml ..... SUCCESS (8.5 s)
[INFO] Building: exclude-patterns\pom.xml
[INFO] run post-build script verify.groovy
[INFO]           exclude-patterns\pom.xml ......................... SUCCESS (8.8 s)
[INFO] Building: exclude-patterns-2\pom.xml
[INFO] run post-build script verify.groovy
[INFO]           exclude-patterns-2\pom.xml ....................... SUCCESS (10.3 s)
[INFO] Building: generate-basic
[INFO] run post-build script verify.bsh
[INFO]           generate-basic ................................... SUCCESS (14.7 s)
[INFO] Building: include-file-with-no-extension\pom.xml
[INFO] run post-build script verify.groovy
[INFO]           include-file-with-no-extension\pom.xml ........... SUCCESS (76.2 s)
[INFO] Building: included-system-properties\pom.xml
[INFO] run post-build script verify.groovy
[INFO]           included-system-properties\pom.xml ............... SUCCESS (56.9 s)
[INFO] Building: property-setting-cli\pom.xml
[INFO]           property-setting-cli\pom.xml ..................... SUCCESS (36.3 s)
[INFO] Building: roundtrip-1-project
[INFO] run post-build script verify.groovy
[INFO]           roundtrip-1-project .............................. SUCCESS (75.4 s)
[INFO] Building: roundtrip-multi\pom.xml
[INFO] run post-build script verify.groovy
[INFO]           roundtrip-multi\pom.xml .......................... SUCCESS (14.9 s)
[INFO] -------------------------------------------------
[INFO] Build Summary:
[INFO]   Passed: 25, Failed: 0, Errors: 0, Skipped: 0
[INFO] -------------------------------------------------
[INFO] 
[INFO] --- mrm-maven-plugin:1.1.0:stop (mirror) @ maven-archetype-plugin ---
[INFO] Stopping Mock Repository Manager on http://localhost:59942
[INFO] Stopped SocketConnector@0.0.0.0:59942
[INFO] Mock Repository Manager http://localhost:59942 is stopped.
[INFO] 
[INFO] --- mrm-maven-plugin:1.1.0:stop (archetype-repository) @ maven-archetype-plugin ---
[INFO] Stopping Mock Repository Manager on http://localhost:59946
[INFO] Stopped SocketConnector@0.0.0.0:59946
[INFO] Mock Repository Manager http://localhost:59946 is stopped.
[INFO] 
[INFO] --- maven-checkstyle-plugin:3.0.0:check (checkstyle-check) @ maven-archetype-plugin
---
[INFO] There are 46 errors reported by Checkstyle 6.18 with config/maven_checks.xml ruleset.
[INFO] Ignored 46 errors, 0 violation remaining.
[INFO] ------------------------------------------------------------------------
[INFO] Reactor Summary for Maven Archetype 3.0.2-SNAPSHOT:
[INFO] 
[INFO] Maven Archetype .................................... SUCCESS [ 45.891 s]
[INFO] Maven Archetype Models ............................. SUCCESS [  2.881 s]
[INFO] Maven Archetype Catalog Model ...................... SUCCESS [ 18.119 s]
[INFO] Maven Archetype Descriptor Model ................... SUCCESS [  4.995 s]
[INFO] Maven Archetype Common ............................. SUCCESS [ 17.758 s]
[INFO] Maven Archetype Packaging .......................... SUCCESS [  0.410 s]
[INFO] Maven Archetype Plugin ............................. SUCCESS [20:00 min]
[INFO] ------------------------------------------------------------------------
[INFO] BUILD SUCCESS
[INFO] ------------------------------------------------------------------------
[INFO] Total time:  21:33 min
[INFO] Finished at: 2019-04-17T22:05:29Z
[INFO] ------------------------------------------------------------------------
[INFO] [jenkins-event-spy] Generated F:\short\jenkins-maven-box-maven-archetype-master-12@tmp\withMavenaf86bfdd\maven-spy-20190417-214355-51291060352419508780.log
[Pipeline] }
[Pipeline] // dir
[Pipeline] }
[withMaven] artifactsPublisher - Archive artifact j11m3.6.xb\pom.xml under org\apache\maven\archetype\maven-archetype\3.0.2-SNAPSHOT\maven-archetype-3.0.2-SNAPSHOT.pom
[withMaven] artifactsPublisher - Archive artifact j11m3.6.xb\target\maven-archetype-3.0.2-SNAPSHOT-site.xml
under org\apache\maven\archetype\maven-archetype\3.0.2-SNAPSHOT\maven-archetype-3.0.2-SNAPSHOT-site.xml
[withMaven] artifactsPublisher - Archive artifact j11m3.6.xb\archetype-models\pom.xml under
org\apache\maven\archetype\archetype-models\3.0.2-SNAPSHOT\archetype-models-3.0.2-SNAPSHOT.pom
[withMaven] artifactsPublisher - Archive artifact j11m3.6.xb\archetype-models\target\archetype-models-3.0.2-SNAPSHOT-site.xml
under org\apache\maven\archetype\archetype-models\3.0.2-SNAPSHOT\archetype-models-3.0.2-SNAPSHOT-site.xml
[withMaven] artifactsPublisher - Archive artifact j11m3.6.xb\archetype-models\archetype-catalog\pom.xml
under org\apache\maven\archetype\archetype-catalog\3.0.2-SNAPSHOT\archetype-catalog-3.0.2-SNAPSHOT.pom
[withMaven] artifactsPublisher - Archive artifact j11m3.6.xb\archetype-models\archetype-catalog\target\archetype-catalog-3.0.2-SNAPSHOT.jar
under org\apache\maven\archetype\archetype-catalog\3.0.2-SNAPSHOT\archetype-catalog-3.0.2-SNAPSHOT.jar
[withMaven] artifactsPublisher - Archive artifact j11m3.6.xb\archetype-models\archetype-descriptor\pom.xml
under org\apache\maven\archetype\archetype-descriptor\3.0.2-SNAPSHOT\archetype-descriptor-3.0.2-SNAPSHOT.pom
[withMaven] artifactsPublisher - Archive artifact j11m3.6.xb\archetype-models\archetype-descriptor\target\archetype-descriptor-3.0.2-SNAPSHOT.jar
under org\apache\maven\archetype\archetype-descriptor\3.0.2-SNAPSHOT\archetype-descriptor-3.0.2-SNAPSHOT.jar
[withMaven] artifactsPublisher - Archive artifact j11m3.6.xb\archetype-common\pom.xml under
org\apache\maven\archetype\archetype-common\3.0.2-SNAPSHOT\archetype-common-3.0.2-SNAPSHOT.pom
[withMaven] artifactsPublisher - Archive artifact j11m3.6.xb\archetype-common\target\archetype-common-3.0.2-SNAPSHOT.jar
under org\apache\maven\archetype\archetype-common\3.0.2-SNAPSHOT\archetype-common-3.0.2-SNAPSHOT.jar
[withMaven] artifactsPublisher - Archive artifact j11m3.6.xb\archetype-packaging\pom.xml under
org\apache\maven\archetype\archetype-packaging\3.0.2-SNAPSHOT\archetype-packaging-3.0.2-SNAPSHOT.pom
[withMaven] artifactsPublisher - Archive artifact j11m3.6.xb\archetype-packaging\target\archetype-packaging-3.0.2-SNAPSHOT.jar
under org\apache\maven\archetype\archetype-packaging\3.0.2-SNAPSHOT\archetype-packaging-3.0.2-SNAPSHOT.jar
[withMaven] artifactsPublisher - Archive artifact j11m3.6.xb\maven-archetype-plugin\pom.xml
under org\apache\maven\plugins\maven-archetype-plugin\3.0.2-SNAPSHOT\maven-archetype-plugin-3.0.2-SNAPSHOT.pom
[withMaven] artifactsPublisher - Archive artifact j11m3.6.xb\maven-archetype-plugin\target\maven-archetype-plugin-3.0.2-SNAPSHOT.jar
under org\apache\maven\plugins\maven-archetype-plugin\3.0.2-SNAPSHOT\maven-archetype-plugin-3.0.2-SNAPSHOT.jar
[withMaven] junitPublisher - Archive test results for Maven artifact org.apache.maven.archetype:archetype-catalog:jar:3.0.2-SNAPSHOT
generated by maven-surefire-plugin:test (default-test): j11m3.6.xb\archetype-models\archetype-catalog\target\surefire-reports\*.xml
Recording test results
None of the test reports contained any result
[withMaven] junitPublisher - Archive test results for Maven artifact org.apache.maven.archetype:archetype-descriptor:jar:3.0.2-SNAPSHOT
generated by maven-surefire-plugin:test (default-test): j11m3.6.xb\archetype-models\archetype-descriptor\target\surefire-reports\*.xml
Recording test results
None of the test reports contained any result
[withMaven] junitPublisher - Archive test results for Maven artifact org.apache.maven.archetype:archetype-common:jar:3.0.2-SNAPSHOT
generated by maven-surefire-plugin:test (default-test): j11m3.6.xb\archetype-common\target\surefire-reports\*.xml
Recording test results
[withMaven] junitPublisher - Archive test results for Maven artifact org.apache.maven.archetype:archetype-packaging:jar:3.0.2-SNAPSHOT
generated by maven-surefire-plugin:test (default-test): j11m3.6.xb\archetype-packaging\target\surefire-reports\*.xml
Recording test results
None of the test reports contained any result
[withMaven] junitPublisher - Archive test results for Maven artifact org.apache.maven.plugins:maven-archetype-plugin:maven-plugin:3.0.2-SNAPSHOT
generated by maven-surefire-plugin:test (default-test): j11m3.6.xb\maven-archetype-plugin\target\surefire-reports\*.xml
Recording test results
[withMaven] openTasksPublisher - Scan Tasks for Maven artifact org.apache.maven.archetype:archetype-common:jar:3.0.2-SNAPSHOT
in source directory j11m3.6.xb\archetype-common\src\main\java
[withMaven] openTasksPublisher - Scan Tasks for Maven artifact org.apache.maven.plugins:maven-archetype-plugin:maven-plugin:3.0.2-SNAPSHOT
in source directory j11m3.6.xb\maven-archetype-plugin\src\main\java
[TASKS] Scanning folder 'F:\short\jenkins-maven-box-maven-archetype-master-12' for files matching
the pattern 'j11m3.6.xb\archetype-common\src\main\java\**\*,j11m3.6.xb\maven-archetype-plugin\src\main\java\**\*'
- excludes: null
[TASKS] Found 88 files to scan for tasks
[TASKS] Found 27 open tasks.
Skipping warnings blame since pipelines do not have an SCM link.%n
[TASKS] Computing warning deltas based on reference build #7
[withMaven] invokerPublisher - Archive invoker results for Maven artifact MavenArtifact{org.apache.maven.plugins:maven-archetype-plugin:maven-plugin:3.0.2-SNAPSHOT(version:
3.0.2-SNAPSHOT, snapshot:false) } generated by PluginInvocation{org.apache.maven.plugins:maven-invoker-plugin:3.1.0@run
 integration-test}: j11m3.6.xb\maven-archetype-plugin\target\invoker-reports\*.xml
[withMaven] Publishers: Generated Artifacts Publisher: 3954 ms, Junit Publisher: 6018 ms,
Open Task Scanner Publisher: 2370 ms, Dependencies Fingerprint Publisher: 1435 ms, Invoker
Publisher: 30791 ms, Pipeline Graph Publisher: 6 ms
[Pipeline] // withMaven
[Pipeline] cleanWs
[WS-CLEANUP] Deleting project workspace...
[WS-CLEANUP] Deferred wipeout is used...
[WS-CLEANUP] done
[Pipeline] }
[Pipeline] // stage
[Pipeline] }
[Pipeline] // ws
[Pipeline] }
[Pipeline] // node
[Pipeline] }
[Pipeline] // parallel
[Pipeline] stage
[Pipeline] { (Notifications)
[Pipeline] echo
Build result: FAILURE
[Pipeline] jiraIssueSelector
[Pipeline] emailext
Mime
  • Unnamed multipart/mixed (inline, None, 0 bytes)
View raw message