maven-notifications mailing list archives

Site index · List index
Message view « Date » · « Thread »
Top « Date » · « Thread »
From Apache Jenkins Server <jenk...@builds.apache.org>
Subject Build failed in Jenkins: Maven TLP » maven-resolver » master #12
Date Tue, 16 Apr 2019 11:21:27 GMT
See https://builds.apache.org/job/maven-box/job/maven-resolver/job/master/12/

Changes:

* [MRESOLVER-7] Download dependency POMs in parallel
* [MRESOLVER-7] Download dependency POMs in parallel
* [MRESOLVER-7] Download dependency POMs in parallel

All tests passed

Build log:
[...truncated 7637 lines...]
[INFO] Tests run: 4, Failures: 0, Errors: 0, Skipped: 0, Time elapsed: 0 s - in org.eclipse.aether.DefaultRepositoryCacheTest
[INFO] Running org.eclipse.aether.DefaultRepositorySystemSessionTest
[INFO] Installing F:\jenkins\jenkins-slave\workspace\maven-box_maven-resolver_master@2\m\maven-resolver-transport-wagon\pom.xml
to F:\jenkins\jenkins-slave\workspace\maven-box_maven-resolver_master@2\m\maven-resolver-demos\maven-resolver-demo-maven-plugin\target\local-repo\org\apache\maven\resolver\maven-resolver-transport-wagon\1.4.0-SNAPSHOT\maven-resolver-transport-wagon-1.4.0-SNAPSHOT.pom
[INFO] Tests run: 5, Failures: 0, Errors: 0, Skipped: 0, Time elapsed: 1.857 s - in org.eclipse.aether.DefaultRepositorySystemSessionTest
[INFO] Running org.eclipse.aether.DefaultSessionDataTest
[INFO] Tests run: 5, Failures: 0, Errors: 0, Skipped: 0, Time elapsed: 0.078 s - in org.eclipse.aether.DefaultSessionDataTest
[INFO] Running org.eclipse.aether.graph.DependencyTest
[INFO] Installing F:\jenkins\jenkins-slave\workspace\maven-box_maven-resolver_master@2\m\maven-resolver-transport-wagon\target\maven-resolver-transport-wagon-1.4.0-SNAPSHOT.jar
to F:\jenkins\jenkins-slave\workspace\maven-box_maven-resolver_master@2\m\maven-resolver-demos\maven-resolver-demo-maven-plugin\target\local-repo\org\apache\maven\resolver\maven-resolver-transport-wagon\1.4.0-SNAPSHOT\maven-resolver-transport-wagon-1.4.0-SNAPSHOT.jar
[INFO] Tests run: 2, Failures: 0, Errors: 0, Skipped: 0, Time elapsed: 0 s - in org.eclipse.aether.graph.DependencyTest
[INFO] Running org.eclipse.aether.repository.AuthenticationContextTest
[INFO] Installing F:\jenkins\jenkins-slave\workspace\maven-box_maven-resolver_master@2\m\maven-resolver-demos\pom.xml
to F:\jenkins\jenkins-slave\workspace\maven-box_maven-resolver_master@2\m\maven-resolver-demos\maven-resolver-demo-maven-plugin\target\local-repo\org\apache\maven\resolver\maven-resolver-demos\1.4.0-SNAPSHOT\maven-resolver-demos-1.4.0-SNAPSHOT.pom
[INFO] Tests run: 9, Failures: 0, Errors: 0, Skipped: 0, Time elapsed: 0.058 s - in org.eclipse.aether.repository.AuthenticationContextTest
[INFO] Running org.eclipse.aether.repository.AuthenticationDigestTest
[INFO] Tests run: 5, Failures: 0, Errors: 0, Skipped: 0, Time elapsed: 0.001 s - in org.eclipse.aether.repository.AuthenticationDigestTest
[INFO] Installing F:\jenkins\jenkins-slave\workspace\maven-box_maven-resolver_master@2\m\maven-resolver-demos\target\maven-resolver-demos-1.4.0-SNAPSHOT-site.xml
to F:\jenkins\jenkins-slave\workspace\maven-box_maven-resolver_master@2\m\maven-resolver-demos\maven-resolver-demo-maven-plugin\target\local-repo\org\apache\maven\resolver\maven-resolver-demos\1.4.0-SNAPSHOT\maven-resolver-demos-1.4.0-SNAPSHOT-site.xml
[INFO] Running org.eclipse.aether.repository.RemoteRepositoryBuilderTest
[INFO] Installing F:\jenkins\jenkins-slave\workspace\maven-box_maven-resolver_master@2\m\maven-resolver-demos\maven-resolver-demo-snippets\pom.xml
to F:\jenkins\jenkins-slave\workspace\maven-box_maven-resolver_master@2\m\maven-resolver-demos\maven-resolver-demo-maven-plugin\target\local-repo\org\apache\maven\resolver\maven-resolver-demo-snippets\1.4.0-SNAPSHOT\maven-resolver-demo-snippets-1.4.0-SNAPSHOT.pom
[INFO] Tests run: 13, Failures: 0, Errors: 0, Skipped: 0, Time elapsed: 0.001 s - in org.eclipse.aether.repository.RemoteRepositoryBuilderTest
[INFO] Running org.eclipse.aether.repository.RemoteRepositoryTest
[INFO] Installing F:\jenkins\jenkins-slave\workspace\maven-box_maven-resolver_master@2\m\maven-resolver-demos\maven-resolver-demo-snippets\target\maven-resolver-demo-snippets-1.4.0-SNAPSHOT.jar
to F:\jenkins\jenkins-slave\workspace\maven-box_maven-resolver_master@2\m\maven-resolver-demos\maven-resolver-demo-maven-plugin\target\local-repo\org\apache\maven\resolver\maven-resolver-demo-snippets\1.4.0-SNAPSHOT\maven-resolver-demo-snippets-1.4.0-SNAPSHOT.jar
[INFO] Tests run: 2, Failures: 0, Errors: 0, Skipped: 0, Time elapsed: 0 s - in org.eclipse.aether.repository.RemoteRepositoryTest
[INFO] Running org.eclipse.aether.RepositoryExceptionTest
[INFO] Tests run: 16, Failures: 0, Errors: 0, Skipped: 0, Time elapsed: 0.048 s - in org.eclipse.aether.RepositoryExceptionTest
[INFO] Installing F:\jenkins\jenkins-slave\workspace\maven-box_maven-resolver_master@2\m\maven-resolver-demos\maven-resolver-demo-maven-plugin\pom.xml
to F:\jenkins\jenkins-slave\workspace\maven-box_maven-resolver_master@2\m\maven-resolver-demos\maven-resolver-demo-maven-plugin\target\local-repo\org\apache\maven\resolver\maven-resolver-demo-maven-plugin\1.4.0-SNAPSHOT\maven-resolver-demo-maven-plugin-1.4.0-SNAPSHOT.pom
[INFO] Running org.eclipse.aether.RequestTraceTest
[INFO] Tests run: 3, Failures: 0, Errors: 0, Skipped: 0, Time elapsed: 0 s - in org.eclipse.aether.RequestTraceTest
[INFO] Running org.eclipse.aether.transfer.AbstractTransferListenerTest
[INFO] Installing F:\jenkins\jenkins-slave\workspace\maven-box_maven-resolver_master@2\m\maven-resolver-demos\maven-resolver-demo-maven-plugin\target\maven-resolver-demo-maven-plugin-1.4.0-SNAPSHOT.jar
to F:\jenkins\jenkins-slave\workspace\maven-box_maven-resolver_master@2\m\maven-resolver-demos\maven-resolver-demo-maven-plugin\target\local-repo\org\apache\maven\resolver\maven-resolver-demo-maven-plugin\1.4.0-SNAPSHOT\maven-resolver-demo-maven-plugin-1.4.0-SNAPSHOT.jar
[INFO] 
[INFO] Tests run: 1, Failures: 0, Errors: 0, Skipped: 0, Time elapsed: 0 s - in org.eclipse.aether.transfer.AbstractTransferListenerTest
[INFO] Running org.eclipse.aether.transfer.TransferEventTest
[INFO] --- maven-invoker-plugin:3.0.1:run (integration-test) @ maven-resolver-demo-maven-plugin
---
[INFO] Tests run: 2, Failures: 0, Errors: 0, Skipped: 0, Time elapsed: 0 s - in org.eclipse.aether.transfer.TransferEventTest
[INFO] 
[INFO] Results:
[INFO] 
[INFO] Running Setup Jobs
[INFO] Tests run: 76, Failures: 0, Errors: 0, Skipped: 0
[INFO] 
[INFO] 
[INFO] Building: resolve-artifact\pom.xml
[INFO] --- maven-jar-plugin:3.1.0:jar (default-jar) @ maven-resolver-api ---
[INFO]           resolve-artifact\pom.xml ......................... SUCCESS (5.8 s)
[INFO] Downloading from central: https://repo.maven.apache.org/maven2/org/apache/maven/maven-archiver/3.2.0/maven-archiver-3.2.0.pom
[INFO] -------------------------------------------------
[INFO] Downloaded from central: https://repo.maven.apache.org/maven2/org/apache/maven/maven-archiver/3.2.0/maven-archiver-3.2.0.pom
(4.3 kB at 253 kB/s)
[INFO] Build Summary:
[INFO] Downloading from central: https://repo.maven.apache.org/maven2/org/apache/maven/shared/maven-shared-utils/3.2.0/maven-shared-utils-3.2.0.pom
[INFO]   Passed: 1, Failed: 0, Errors: 0, Skipped: 0
[INFO] Downloaded from central: https://repo.maven.apache.org/maven2/org/apache/maven/shared/maven-shared-utils/3.2.0/maven-shared-utils-3.2.0.pom
(4.9 kB at 446 kB/s)
[INFO] -------------------------------------------------
[INFO] Downloading from central: https://repo.maven.apache.org/maven2/org/codehaus/plexus/plexus-archiver/3.5/plexus-archiver-3.5.pom
[INFO] 
[INFO] Downloaded from central: https://repo.maven.apache.org/maven2/org/codehaus/plexus/plexus-archiver/3.5/plexus-archiver-3.5.pom
(4.8 kB at 601 kB/s)
[INFO] Downloading from central: https://repo.maven.apache.org/maven2/org/codehaus/plexus/plexus/5.0/plexus-5.0.pom
[INFO] --- maven-checkstyle-plugin:3.0.0:check (checkstyle-check) @ maven-resolver-demo-maven-plugin
---
[INFO] Downloaded from central: https://repo.maven.apache.org/maven2/org/codehaus/plexus/plexus/5.0/plexus-5.0.pom
(21 kB at 2.4 MB/s)
[INFO] ------------------------------------------------------------------------
[INFO] Downloading from central: https://repo.maven.apache.org/maven2/org/codehaus/plexus/plexus-io/3.0.0/plexus-io-3.0.0.pom
[INFO] Reactor Summary:
[INFO] Downloaded from central: https://repo.maven.apache.org/maven2/org/codehaus/plexus/plexus-io/3.0.0/plexus-io-3.0.0.pom
(4.5 kB at 568 kB/s)
[INFO] Downloading from central: https://repo.maven.apache.org/maven2/org/apache/commons/commons-compress/1.14/commons-compress-1.14.pom
[INFO] 
[INFO] Downloaded from central: https://repo.maven.apache.org/maven2/org/apache/commons/commons-compress/1.14/commons-compress-1.14.pom
(13 kB at 1.5 MB/s)
[INFO] Maven Artifact Resolver ............................ SUCCESS [ 17.993 s]
[INFO] Downloading from central: https://repo.maven.apache.org/maven2/org/tukaani/xz/1.6/xz-1.6.pom
[INFO] Maven Artifact Resolver API ........................ SUCCESS [ 19.776 s]
[INFO] Downloaded from central: https://repo.maven.apache.org/maven2/org/tukaani/xz/1.6/xz-1.6.pom
(1.9 kB at 212 kB/s)
[INFO] Maven Artifact Resolver SPI ........................ SUCCESS [  3.313 s]
[INFO] Downloading from central: https://repo.maven.apache.org/maven2/org/apache/maven/maven-archiver/3.2.0/maven-archiver-3.2.0.jar
[INFO] Downloading from central: https://repo.maven.apache.org/maven2/org/codehaus/plexus/plexus-io/3.0.0/plexus-io-3.0.0.jar
[INFO] Downloading from central: https://repo.maven.apache.org/maven2/org/apache/maven/shared/maven-shared-utils/3.2.0/maven-shared-utils-3.2.0.jar
[INFO] Downloading from central: https://repo.maven.apache.org/maven2/org/codehaus/plexus/plexus-archiver/3.5/plexus-archiver-3.5.jar
[INFO] Downloading from central: https://repo.maven.apache.org/maven2/org/apache/commons/commons-compress/1.14/commons-compress-1.14.jar
[INFO] Downloaded from central: https://repo.maven.apache.org/maven2/org/apache/maven/maven-archiver/3.2.0/maven-archiver-3.2.0.jar
(24 kB at 1.0 MB/s)
[INFO] Downloading from central: https://repo.maven.apache.org/maven2/org/tukaani/xz/1.6/xz-1.6.jar
[INFO] Downloaded from central: https://repo.maven.apache.org/maven2/org/codehaus/plexus/plexus-io/3.0.0/plexus-io-3.0.0.jar
(74 kB at 3.2 MB/s)
[INFO] Downloaded from central: https://repo.maven.apache.org/maven2/org/apache/maven/shared/maven-shared-utils/3.2.0/maven-shared-utils-3.2.0.jar
(165 kB at 5.2 MB/s)
[INFO] Downloaded from central: https://repo.maven.apache.org/maven2/org/tukaani/xz/1.6/xz-1.6.jar
(103 kB at 2.4 MB/s)
[INFO] Downloaded from central: https://repo.maven.apache.org/maven2/org/codehaus/plexus/plexus-archiver/3.5/plexus-archiver-3.5.jar
(187 kB at 4.3 MB/s)
[INFO] Downloaded from central: https://repo.maven.apache.org/maven2/org/apache/commons/commons-compress/1.14/commons-compress-1.14.jar
(530 kB at 9.3 MB/s)
[INFO] Building jar: F:\jenkins\jenkins-slave\workspace\maven-box_maven-resolver_master\m\maven-resolver-api\target\maven-resolver-api-1.4.0-SNAPSHOT.jar
[INFO] 
[INFO] --- maven-site-plugin:3.7.1:attach-descriptor (attach-descriptor) @ maven-resolver-api
---
[INFO] Skipping because packaging 'jar' is not pom.
[INFO] 
[INFO] --- maven-checkstyle-plugin:3.0.0:check (checkstyle-check) @ maven-resolver-api ---
[INFO] There are 44 errors reported by Checkstyle 6.18 with config/maven_checks.xml ruleset.
[INFO] Maven Artifact Resolver Test Utilities ............. SUCCESS [  5.559 s]
[INFO] Ignored 44 errors, 0 violation remaining.
[INFO] 
[INFO] ------------------------------------------------------------------------
[INFO] Building Maven Artifact Resolver SPI 1.4.0-SNAPSHOT
[INFO] ------------------------------------------------------------------------
[INFO] 
[INFO] --- maven-clean-plugin:3.1.0:clean (default-clean) @ maven-resolver-spi ---
[INFO] 
Resuming build at Sat Apr 13 20:04:10 UTC 2019 after Jenkins restart
Waiting to resume part of Maven TLP » maven-resolver » master #12: ???
Waiting to resume part of Maven TLP » maven-resolver » master #12: Jenkins is about to shut
down
Waiting to resume part of Maven TLP » maven-resolver » master #12: Jenkins is about to shut
down
Waiting to resume part of Maven TLP » maven-resolver » master #12: Jenkins is about to shut
down
Waiting to resume part of Maven TLP » maven-resolver » master #12: Jenkins is about to shut
down
Waiting to resume part of Maven TLP » maven-resolver » master #12: Jenkins is about to shut
down
Waiting to resume part of Maven TLP » maven-resolver » master #12: Jenkins is about to shut
down
Waiting to resume part of Maven TLP » maven-resolver » master #12: Waiting for pending items
to get a node assigned
‘H0’ doesn’t have label ‘windows-2016-1’
‘H10’ doesn’t have label ‘windows-2016-1’
‘H12’ doesn’t have label ‘windows-2016-1’
‘H13’ doesn’t have label ‘windows-2016-1’
‘H14’ doesn’t have label ‘windows-2016-1’
‘H15’ doesn’t have label ‘windows-2016-1’
‘H16’ doesn’t have label ‘windows-2016-1’
‘H17’ doesn’t have label ‘windows-2016-1’
‘H18’ doesn’t have label ‘windows-2016-1’
‘H19’ doesn’t have label ‘windows-2016-1’
‘H1’ doesn’t have label ‘windows-2016-1’
‘H20’ doesn’t have label ‘windows-2016-1’
‘H21’ doesn’t have label ‘windows-2016-1’
‘H22’ doesn’t have label ‘windows-2016-1’
‘H23’ doesn’t have label ‘windows-2016-1’
‘H24’ doesn’t have label ‘windows-2016-1’
‘H25’ doesn’t have label ‘windows-2016-1’
‘H26’ doesn’t have label ‘windows-2016-1’
‘H27’ doesn’t have label ‘windows-2016-1’
‘H28’ doesn’t have label ‘windows-2016-1’
‘H29’ doesn’t have label ‘windows-2016-1’
‘H2’ doesn’t have label ‘windows-2016-1’
‘H30’ doesn’t have label ‘windows-2016-1’
‘H31’ doesn’t have label ‘windows-2016-1’
‘H32’ doesn’t have label ‘windows-2016-1’
‘H33’ doesn’t have label ‘windows-2016-1’
‘H34’ doesn’t have label ‘windows-2016-1’
‘H35’ doesn’t have label ‘windows-2016-1’
‘H36’ doesn’t have label ‘windows-2016-1’
‘H37’ doesn’t have label ‘windows-2016-1’
‘H38’ doesn’t have label ‘windows-2016-1’
‘H39’ doesn’t have label ‘windows-2016-1’
‘H40’ doesn’t have label ‘windows-2016-1’
‘H41’ doesn’t have label ‘windows-2016-1’
‘H42’ doesn’t have label ‘windows-2016-1’
‘H43’ doesn’t have label ‘windows-2016-1’
‘H4’ doesn’t have label ‘windows-2016-1’
‘H5’ doesn’t have label ‘windows-2016-1’
‘H6’ doesn’t have label ‘windows-2016-1’
‘H9’ doesn’t have label ‘windows-2016-1’
‘Jenkins’ doesn’t have label ‘windows-2016-1’
‘apache-beam-jenkins-12’ doesn’t have label ‘windows-2016-1’
‘apache-beam-jenkins-1’ doesn’t have label ‘windows-2016-1’
‘apache-beam-jenkins-2’ doesn’t have label ‘windows-2016-1’
‘apache-beam-jenkins-4’ doesn’t have label ‘windows-2016-1’
‘apache-beam-jenkins-7’ doesn’t have label ‘windows-2016-1’
‘apache-beam-jenkins-8’ doesn’t have label ‘windows-2016-1’
‘apache-beam-jenkins-9’ doesn’t have label ‘windows-2016-1’
‘arm1’ doesn’t have label ‘windows-2016-1’
‘beam10’ doesn’t have label ‘windows-2016-1’
‘beam11’ doesn’t have label ‘windows-2016-1’
‘beam12’ doesn’t have label ‘windows-2016-1’
‘beam13’ doesn’t have label ‘windows-2016-1’
‘beam14’ doesn’t have label ‘windows-2016-1’
‘beam15’ doesn’t have label ‘windows-2016-1’
‘beam16’ doesn’t have label ‘windows-2016-1’
‘beam17-jnlp’ doesn’t have label ‘windows-2016-1’
‘beam17’ doesn’t have label ‘windows-2016-1’
‘beam1’ doesn’t have label ‘windows-2016-1’
‘beam2’ doesn’t have label ‘windows-2016-1’
‘beam3’ doesn’t have label ‘windows-2016-1’
‘beam4’ doesn’t have label ‘windows-2016-1’
‘beam5’ doesn’t have label ‘windows-2016-1’
‘beam6’ doesn’t have label ‘windows-2016-1’
‘beam7’ doesn’t have label ‘windows-2016-1’
‘beam8’ doesn’t have label ‘windows-2016-1’
‘beam9’ doesn’t have label ‘windows-2016-1’
‘cassandra10’ doesn’t have label ‘windows-2016-1’
‘cassandra11’ doesn’t have label ‘windows-2016-1’
‘cassandra12’ doesn’t have label ‘windows-2016-1’
‘cassandra13’ doesn’t have label ‘windows-2016-1’
‘cassandra14’ doesn’t have label ‘windows-2016-1’
‘cassandra15’ doesn’t have label ‘windows-2016-1’
‘cassandra16’ doesn’t have label ‘windows-2016-1’
‘cassandra1’ doesn’t have label ‘windows-2016-1’
‘cassandra2’ doesn’t have label ‘windows-2016-1’
‘cassandra3’ doesn’t have label ‘windows-2016-1’
‘cassandra4’ doesn’t have label ‘windows-2016-1’
‘cassandra5’ doesn’t have label ‘windows-2016-1’
‘cassandra6’ doesn’t have label ‘windows-2016-1’
‘cassandra7’ doesn’t have label ‘windows-2016-1’
‘cassandra8’ doesn’t have label ‘windows-2016-1’
‘cassandra9’ doesn’t have label ‘windows-2016-1’
‘couchdb-freebsd1’ doesn’t have label ‘windows-2016-1’
‘couchdb-freebsd2’ doesn’t have label ‘windows-2016-1’
‘couchdb-macos1’ doesn’t have label ‘windows-2016-1’
‘hadoop-ppc64le-1’ doesn’t have label ‘windows-2016-1’
‘hadoop-win1’ doesn’t have label ‘windows-2016-1’
‘lucene2’ doesn’t have label ‘windows-2016-1’
‘lucene’ doesn’t have label ‘windows-2016-1’
‘openwhisk1’ doesn’t have label ‘windows-2016-1’
‘openwhisk2’ doesn’t have label ‘windows-2016-1’
‘openwhisk3’ doesn’t have label ‘windows-2016-1’
‘plc4x1’ doesn’t have label ‘windows-2016-1’
‘tapestry’ doesn’t have label ‘windows-2016-1’
‘ubuntu-1’ doesn’t have label ‘windows-2016-1’
‘ubuntu-2’ doesn’t have label ‘windows-2016-1’
‘ubuntu-4’ doesn’t have label ‘windows-2016-1’
‘ubuntu-eu2’ doesn’t have label ‘windows-2016-1’
‘ubuntu-eu3’ doesn’t have label ‘windows-2016-1’
‘ubuntu-ppc64le’ doesn’t have label ‘windows-2016-1’
‘websites1’ doesn’t have label ‘windows-2016-1’
‘windows-2012-1’ doesn’t have label ‘windows-2016-1’
‘windows-2012-2’ doesn’t have label ‘windows-2016-1’
‘windows-2012-3’ doesn’t have label ‘windows-2016-1’
‘windows-2016-2’ doesn’t have label ‘windows-2016-1’
‘windows-2016-3’ doesn’t have label ‘windows-2016-1’
Ready to run at Sat Apr 13 20:05:08 UTC 2019
Cannot contact windows-2016-1: java.lang.InterruptedException
Aborted by tibordigana
Sending interrupt signal to process
Sending interrupt signal to process
Aborted by tibordigana
Sending interrupt signal to process
Sending interrupt signal to process
After 10s process did not stop
[Pipeline] }
[Pipeline] // dir
[Pipeline] }
[withMaven] One or multiple Maven executions have been ignored by the Jenkins Pipeline Maven
Plugin because they have been interrupted before completion (1). See Pipeline Maven Plugin
FAQ for more details.
[Pipeline] // withMaven
[Pipeline] echo
[FAILURE-004] org.jenkinsci.plugins.workflow.steps.FlowInterruptedException
[Pipeline] cleanWs
[WS-CLEANUP] Deleting project workspace...
[WS-CLEANUP] Deferred wipeout is used...
[WS-CLEANUP] done
[Pipeline] }
[Pipeline] // stage
[Pipeline] }
[Pipeline] // node
[Pipeline] }
Failed in branch windows-jdk7
[Pipeline] // parallel
[Pipeline] echo
[FAILURE-001] org.jenkinsci.plugins.scriptsecurity.sandbox.RejectedAccessException: Scripts
not permitted to use method org.jenkinsci.plugins.workflow.support.steps.build.RunWrapper
getRawBuild
[Pipeline] stage
[Pipeline] { (Notifications)
[Pipeline] echo
Build result: FAILURE
[Pipeline] jiraIssueSelector
[Pipeline] jiraComment
[Pipeline] emailext
Mime
  • Unnamed multipart/mixed (inline, None, 0 bytes)
View raw message