maven-notifications mailing list archives

Site index · List index
Message view « Date » · « Thread »
Top « Date » · « Thread »
From Apache Jenkins Server <jenk...@builds.apache.org>
Subject Build failed in Jenkins: Maven TLP » maven-surefire » 1546-1222 #7
Date Thu, 04 Apr 2019 02:18:20 GMT
See https://builds.apache.org/job/maven-box/job/maven-surefire/job/1546-1222/7/

Changes:

* StatelessXmlReporter using display names without configuration
* StatelessXmlReporter using display names without configuration
* StatelessXmlReporter using display names without configuration
* StatelessXmlReporter using display names without configuration
* StatelessXmlReporter using display names without configuration
* StatelessXmlReporter using display names without configuration
* StatelessXmlReporter using display names without configuration
* StatelessXmlReporter using display names without configuration

1 tests failed.
FAILED:  org.apache.maven.surefire.its.JUnitPlatformIT.testJupiterEngineWithDisplayNames

Error Message:
Did not find expected message in log

Stack Trace:
junit.framework.AssertionFailedError: Did not find expected message in log
	at org.apache.maven.surefire.its.JUnitPlatformIT.testJupiterEngineWithDisplayNames(JUnitPlatformIT.java:55)




Build log:
[...truncated 44210 lines...]
[2019-04-04T02:17:52.194Z]     at java.lang.reflect.Method.invoke (Method.java:498)
[2019-04-04T02:17:52.194Z]     at org.codehaus.plexus.classworlds.launcher.Launcher.launchEnhanced
(Launcher.java:289)
[2019-04-04T02:17:52.194Z]     at org.codehaus.plexus.classworlds.launcher.Launcher.launch
(Launcher.java:229)
[2019-04-04T02:17:52.194Z]     at org.codehaus.plexus.classworlds.launcher.Launcher.mainWithExitCode
(Launcher.java:415)
[2019-04-04T02:17:52.194Z]     at org.codehaus.plexus.classworlds.launcher.Launcher.main (Launcher.java:356)
[2019-04-04T02:17:52.194Z] Caused by: org.apache.maven.plugin.MojoFailureException: There
are test failures.
[2019-04-04T02:17:52.194Z] 
[2019-04-04T02:17:52.194Z] Please refer to C:\Users\jenkins\AppData\Local\Temp\2\jenkins-maven-box-maven-surefire-1546-1222-7@2\surefire-its\target\failsafe-reports
for the individual test results.
[2019-04-04T02:17:52.194Z] Please refer to dump files (if any exist) [date].dump, [date]-jvmRun[N].dump
and [date].dumpstream.
[2019-04-04T02:17:52.194Z]     at org.apache.maven.plugin.surefire.SurefireHelper.throwException
(SurefireHelper.java:271)
[2019-04-04T02:17:52.194Z]     at org.apache.maven.plugin.surefire.SurefireHelper.reportExecution
(SurefireHelper.java:159)
[2019-04-04T02:17:52.194Z]     at org.apache.maven.plugin.failsafe.VerifyMojo.execute (VerifyMojo.java:192)
[2019-04-04T02:17:52.194Z]     at org.apache.maven.plugin.DefaultBuildPluginManager.executeMojo
(DefaultBuildPluginManager.java:137)
[2019-04-04T02:17:52.194Z]     at org.apache.maven.lifecycle.internal.MojoExecutor.execute
(MojoExecutor.java:210)
[2019-04-04T02:17:52.194Z]     at org.apache.maven.lifecycle.internal.MojoExecutor.execute
(MojoExecutor.java:156)
[2019-04-04T02:17:52.194Z]     at org.apache.maven.lifecycle.internal.MojoExecutor.execute
(MojoExecutor.java:148)
[2019-04-04T02:17:52.194Z]     at org.apache.maven.lifecycle.internal.LifecycleModuleBuilder.buildProject
(LifecycleModuleBuilder.java:117)
[2019-04-04T02:17:52.194Z]     at org.apache.maven.lifecycle.internal.LifecycleModuleBuilder.buildProject
(LifecycleModuleBuilder.java:81)
[2019-04-04T02:17:52.194Z]     at org.apache.maven.lifecycle.internal.builder.singlethreaded.SingleThreadedBuilder.build
(SingleThreadedBuilder.java:56)
[2019-04-04T02:17:52.194Z]     at org.apache.maven.lifecycle.internal.LifecycleStarter.execute
(LifecycleStarter.java:128)
[2019-04-04T02:17:52.194Z]     at org.apache.maven.DefaultMaven.doExecute (DefaultMaven.java:305)
[2019-04-04T02:17:52.194Z]     at org.apache.maven.DefaultMaven.doExecute (DefaultMaven.java:192)
[2019-04-04T02:17:52.194Z]     at org.apache.maven.DefaultMaven.execute (DefaultMaven.java:105)
[2019-04-04T02:17:52.194Z]     at org.apache.maven.cli.MavenCli.execute (MavenCli.java:956)
[2019-04-04T02:17:52.194Z]     at org.apache.maven.cli.MavenCli.doMain (MavenCli.java:288)
[2019-04-04T02:17:52.194Z]     at org.apache.maven.cli.MavenCli.main (MavenCli.java:192)
[2019-04-04T02:17:52.194Z]     at sun.reflect.NativeMethodAccessorImpl.invoke0 (Native Method)
[2019-04-04T02:17:52.194Z]     at sun.reflect.NativeMethodAccessorImpl.invoke (NativeMethodAccessorImpl.java:62)
[2019-04-04T02:17:52.194Z]     at sun.reflect.DelegatingMethodAccessorImpl.invoke (DelegatingMethodAccessorImpl.java:43)
[2019-04-04T02:17:52.194Z]     at java.lang.reflect.Method.invoke (Method.java:498)
[2019-04-04T02:17:52.194Z]     at org.codehaus.plexus.classworlds.launcher.Launcher.launchEnhanced
(Launcher.java:289)
[2019-04-04T02:17:52.194Z]     at org.codehaus.plexus.classworlds.launcher.Launcher.launch
(Launcher.java:229)
[2019-04-04T02:17:52.194Z]     at org.codehaus.plexus.classworlds.launcher.Launcher.mainWithExitCode
(Launcher.java:415)
[2019-04-04T02:17:52.194Z]     at org.codehaus.plexus.classworlds.launcher.Launcher.main (Launcher.java:356)
[2019-04-04T02:17:52.194Z] [ERROR] 
[2019-04-04T02:17:52.194Z] [ERROR] Re-run Maven using the -X switch to enable full debug logging.
[2019-04-04T02:17:52.194Z] [ERROR] 
[2019-04-04T02:17:52.194Z] [ERROR] For more information about the errors and possible solutions,
please read the following articles:
[2019-04-04T02:17:52.194Z] [ERROR] [Help 1] http://cwiki.apache.org/confluence/display/MAVEN/MojoFailureException
[2019-04-04T02:17:52.194Z] [ERROR] 
[2019-04-04T02:17:52.194Z] [ERROR] After correcting the problems, you can resume the build
with the command
[2019-04-04T02:17:52.194Z] [ERROR]   mvn <goals> -rf :surefire-its
[Pipeline] zip
[Pipeline] }
[Pipeline] // withEnv
[Pipeline] }
[2019-04-04T02:17:53.149Z] Writing zip file of C:\Users\jenkins\AppData\Local\Temp\2\jenkins-maven-box-maven-surefire-1546-1222-7\maven-failsafe-plugin\target\it
to C:\Users\jenkins\AppData\Local\Temp\2\jenkins-maven-box-maven-surefire-1546-1222-7\maven-failsafe-plugin--windows-jdk12-maven3.6.x.zip
[Pipeline] // stage
[Pipeline] fileExists
[2019-04-04T02:17:53.308Z] Zipped 78 entries.
[2019-04-04T02:17:53.309Z] Archiving C:\Users\jenkins\AppData\Local\Temp\2\jenkins-maven-box-maven-surefire-1546-1222-7\maven-failsafe-plugin--windows-jdk12-maven3.6.x.zip
[2019-04-04T02:17:53.309Z] [Fast Archiver] No prior successful build to compare, so performing
full copy of artifacts
[Pipeline] fileExists
[Pipeline] zip
[Pipeline] zip
[2019-04-04T02:17:54.023Z] Writing zip file of C:\Users\jenkins\AppData\Local\Temp\2\jenkins-maven-box-maven-surefire-1546-1222-7@2\maven-failsafe-plugin\target\it
to C:\Users\jenkins\AppData\Local\Temp\2\jenkins-maven-box-maven-surefire-1546-1222-7@2\maven-failsafe-plugin--windows-jdk11-maven3.6.x.zip
[2019-04-04T02:17:54.053Z] Writing zip file of C:\Users\jenkins\AppData\Local\Temp\2\jenkins-maven-box-maven-surefire-1546-1222-7\surefire-its\target
to C:\Users\jenkins\AppData\Local\Temp\2\jenkins-maven-box-maven-surefire-1546-1222-7\surefire-its--windows-jdk12-maven3.6.x.zip
[2019-04-04T02:17:54.193Z] Zipped 80 entries.
[2019-04-04T02:17:54.193Z] Archiving C:\Users\jenkins\AppData\Local\Temp\2\jenkins-maven-box-maven-surefire-1546-1222-7@2\maven-failsafe-plugin--windows-jdk11-maven3.6.x.zip
[2019-04-04T02:17:54.194Z] [Fast Archiver] No prior successful build to compare, so performing
full copy of artifacts
[Pipeline] fileExists
[Pipeline] zip
[2019-04-04T02:17:54.329Z] Writing zip file of C:\Users\jenkins\AppData\Local\Temp\2\jenkins-maven-box-maven-surefire-1546-1222-7@2\surefire-its\target
to C:\Users\jenkins\AppData\Local\Temp\2\jenkins-maven-box-maven-surefire-1546-1222-7@2\surefire-its--windows-jdk11-maven3.6.x.zip
[2019-04-04T02:17:56.752Z] Zipped 1963 entries.
[2019-04-04T02:17:56.752Z] Archiving C:\Users\jenkins\AppData\Local\Temp\2\jenkins-maven-box-maven-surefire-1546-1222-7\surefire-its--windows-jdk12-maven3.6.x.zip
[2019-04-04T02:17:56.753Z] [Fast Archiver] No prior successful build to compare, so performing
full copy of artifacts
[2019-04-04T02:17:57.072Z] Zipped 1963 entries.
[2019-04-04T02:17:57.072Z] Archiving C:\Users\jenkins\AppData\Local\Temp\2\jenkins-maven-box-maven-surefire-1546-1222-7@2\surefire-its--windows-jdk11-maven3.6.x.zip
[2019-04-04T02:17:57.073Z] [Fast Archiver] No prior successful build to compare, so performing
full copy of artifacts
[Pipeline] archiveArtifacts
[2019-04-04T02:17:57.171Z] Archiving artifacts
[2019-04-04T02:17:57.204Z] [Fast Archiver] No prior successful build to compare, so performing
full copy of artifacts
[Pipeline] archiveArtifacts
[2019-04-04T02:17:57.544Z] Archiving artifacts
[2019-04-04T02:17:57.599Z] [Fast Archiver] No prior successful build to compare, so performing
full copy of artifacts
[Pipeline] cleanWs
[2019-04-04T02:17:57.741Z] [WS-CLEANUP] Deleting project workspace...
[2019-04-04T02:17:57.741Z] [WS-CLEANUP] Deferred wipeout is used...
[2019-04-04T02:17:57.836Z] [WS-CLEANUP] done
[Pipeline] }
[Pipeline] // ws
[Pipeline] }
[Pipeline] // timestamps
[Pipeline] }
[Pipeline] // node
[Pipeline] }
[Pipeline] cleanWs
[2019-04-04T02:17:58.057Z] [WS-CLEANUP] Deleting project workspace...
[2019-04-04T02:17:58.057Z] [WS-CLEANUP] Deferred wipeout is used...
[2019-04-04T02:17:58.142Z] [WS-CLEANUP] done
[Pipeline] }
[Pipeline] // ws
[Pipeline] }
[Pipeline] // timestamps
[Pipeline] }
[Pipeline] // node
[Pipeline] }
[2019-04-04T02:18:16.006Z] [ERROR] Tests run: 6, Failures: 1, Errors: 0, Skipped: 0, Time
elapsed: 74.05 s <<< FAILURE! - in org.apache.maven.surefire.its.JUnitPlatformIT
[2019-04-04T02:18:16.006Z] [ERROR] testJupiterEngineWithDisplayNames(org.apache.maven.surefire.its.JUnitPlatformIT)
 Time elapsed: 9.275 s  <<< FAILURE!
[2019-04-04T02:18:16.006Z] junit.framework.AssertionFailedError: Did not find expected message
in log
[2019-04-04T02:18:16.006Z] 	at org.apache.maven.surefire.its.JUnitPlatformIT.testJupiterEngineWithDisplayNames(JUnitPlatformIT.java:55)
[2019-04-04T02:18:16.006Z] 
[2019-04-04T02:18:16.006Z] [INFO] 
[2019-04-04T02:18:16.006Z] [INFO] Results:
[2019-04-04T02:18:16.006Z] [INFO] 
[2019-04-04T02:18:16.006Z] [ERROR] Failures: 
[2019-04-04T02:18:16.006Z] [ERROR]   JUnitPlatformIT.testJupiterEngineWithDisplayNames:55
Did not find expected message in log
[2019-04-04T02:18:16.006Z] [INFO] 
[2019-04-04T02:18:16.006Z] [ERROR] Tests run: 6, Failures: 1, Errors: 0, Skipped: 0
[2019-04-04T02:18:16.006Z] [INFO] 
[2019-04-04T02:18:16.006Z] [INFO] 
[2019-04-04T02:18:16.006Z] [INFO] --- maven-checkstyle-plugin:3.0.0:check (checkstyle-check)
@ surefire-its ---
[2019-04-04T02:18:16.006Z] [INFO] 
[2019-04-04T02:18:16.006Z] [INFO] --- maven-failsafe-plugin:3.0.0-M3:verify (default) @ surefire-its
---
[2019-04-04T02:18:16.006Z] [INFO] Failsafe report directory: C:\Users\jenkins\AppData\Local\Temp\2\jenkins-maven-box-maven-surefire-1546-1222-7\surefire-its\target\failsafe-reports
[2019-04-04T02:18:16.006Z] [INFO] ------------------------------------------------------------------------
[2019-04-04T02:18:16.006Z] [INFO] Reactor Summary for Apache Maven Surefire 3.0.0-SNAPSHOT:
[2019-04-04T02:18:16.006Z] [INFO] 
[2019-04-04T02:18:16.006Z] [INFO] Apache Maven Surefire .............................. SUCCESS
[01:26 min]
[2019-04-04T02:18:16.006Z] [INFO] SureFire Logger API ................................ SUCCESS
[ 19.861 s]
[2019-04-04T02:18:16.006Z] [INFO] SureFire API ....................................... SUCCESS
[ 23.852 s]
[2019-04-04T02:18:16.006Z] [INFO] SureFire Booter .................................... SUCCESS
[ 22.509 s]
[2019-04-04T02:18:16.006Z] [INFO] Maven Surefire Test-Grouping Support ............... SUCCESS
[ 14.002 s]
[2019-04-04T02:18:16.006Z] [INFO] SureFire Providers ................................. SUCCESS
[  1.839 s]
[2019-04-04T02:18:16.006Z] [INFO] Shared JUnit3 Provider Code ........................ SUCCESS
[  7.078 s]
[2019-04-04T02:18:16.006Z] [INFO] Shared Java 5 Provider Base ........................ SUCCESS
[  9.322 s]
[2019-04-04T02:18:16.006Z] [INFO] Shared JUnit4 Provider Code ........................ SUCCESS
[  9.285 s]
[2019-04-04T02:18:16.006Z] [INFO] Shared JUnit48 Provider Code ....................... SUCCESS
[ 10.106 s]
[2019-04-04T02:18:16.006Z] [INFO] SureFire JUnit Runner .............................. SUCCESS
[  7.530 s]
[2019-04-04T02:18:16.006Z] [INFO] SureFire JUnit4 Runner ............................. SUCCESS
[ 37.879 s]
[2019-04-04T02:18:16.006Z] [INFO] Maven Surefire Common .............................. SUCCESS
[ 38.807 s]
[2019-04-04T02:18:16.006Z] [INFO] SureFire JUnitCore Runner .......................... SUCCESS
[02:26 min]
[2019-04-04T02:18:16.006Z] [INFO] SureFire JUnit Platform Runner ..................... SUCCESS
[ 15.063 s]
[2019-04-04T02:18:16.006Z] [INFO] SureFire TestNG Utils .............................. SUCCESS
[  7.898 s]
[2019-04-04T02:18:16.006Z] [INFO] SureFire TestNG Runner ............................. SUCCESS
[  7.942 s]
[2019-04-04T02:18:16.006Z] [INFO] ShadeFire JUnit3 Provider .......................... SUCCESS
[  2.878 s]
[2019-04-04T02:18:16.006Z] [INFO] Surefire Report Parser ............................. SUCCESS
[ 10.355 s]
[2019-04-04T02:18:16.006Z] [INFO] Maven Surefire Plugin .............................. SUCCESS
[ 20.574 s]
[2019-04-04T02:18:16.006Z] [INFO] Maven Failsafe Plugin .............................. SUCCESS
[02:12 min]
[2019-04-04T02:18:16.006Z] [INFO] Maven Surefire Report Plugin ....................... SUCCESS
[ 24.692 s]
[2019-04-04T02:18:16.006Z] [INFO] Maven Surefire Integration Tests ................... FAILURE
[01:59 min]
[2019-04-04T02:18:16.006Z] [INFO] ------------------------------------------------------------------------
[2019-04-04T02:18:16.006Z] [INFO] BUILD FAILURE
[2019-04-04T02:18:16.006Z] [INFO] ------------------------------------------------------------------------
[2019-04-04T02:18:16.006Z] [INFO] Total time:  13:01 min
[2019-04-04T02:18:16.006Z] [INFO] Finished at: 2019-04-03T19:18:07-07:00
[2019-04-04T02:18:16.006Z] [INFO] ------------------------------------------------------------------------
[2019-04-04T02:18:16.006Z] [ERROR] Failed to execute goal org.apache.maven.plugins:maven-failsafe-plugin:3.0.0-M3:verify
(default) on project surefire-its: There are test failures.
[2019-04-04T02:18:16.006Z] [ERROR] 
[2019-04-04T02:18:16.006Z] [ERROR] Please refer to C:\Users\jenkins\AppData\Local\Temp\2\jenkins-maven-box-maven-surefire-1546-1222-7\surefire-its\target\failsafe-reports
for the individual test results.
[2019-04-04T02:18:16.006Z] [ERROR] Please refer to dump files (if any exist) [date].dump,
[date]-jvmRun[N].dump and [date].dumpstream.
[2019-04-04T02:18:16.006Z] [ERROR] -> [Help 1]
[2019-04-04T02:18:16.006Z] org.apache.maven.lifecycle.LifecycleExecutionException: Failed
to execute goal org.apache.maven.plugins:maven-failsafe-plugin:3.0.0-M3:verify (default) on
project surefire-its: There are test failures.
[2019-04-04T02:18:16.006Z] 
[2019-04-04T02:18:16.006Z] Please refer to C:\Users\jenkins\AppData\Local\Temp\2\jenkins-maven-box-maven-surefire-1546-1222-7\surefire-its\target\failsafe-reports
for the individual test results.
[2019-04-04T02:18:16.006Z] Please refer to dump files (if any exist) [date].dump, [date]-jvmRun[N].dump
and [date].dumpstream.
[2019-04-04T02:18:16.006Z]     at org.apache.maven.lifecycle.internal.MojoExecutor.execute
(MojoExecutor.java:215)
[2019-04-04T02:18:16.006Z]     at org.apache.maven.lifecycle.internal.MojoExecutor.execute
(MojoExecutor.java:156)
[2019-04-04T02:18:16.006Z]     at org.apache.maven.lifecycle.internal.MojoExecutor.execute
(MojoExecutor.java:148)
[2019-04-04T02:18:16.006Z]     at org.apache.maven.lifecycle.internal.LifecycleModuleBuilder.buildProject
(LifecycleModuleBuilder.java:117)
[2019-04-04T02:18:16.007Z]     at org.apache.maven.lifecycle.internal.LifecycleModuleBuilder.buildProject
(LifecycleModuleBuilder.java:81)
[2019-04-04T02:18:16.007Z]     at org.apache.maven.lifecycle.internal.builder.singlethreaded.SingleThreadedBuilder.build
(SingleThreadedBuilder.java:56)
[2019-04-04T02:18:16.007Z]     at org.apache.maven.lifecycle.internal.LifecycleStarter.execute
(LifecycleStarter.java:128)
[2019-04-04T02:18:16.007Z]     at org.apache.maven.DefaultMaven.doExecute (DefaultMaven.java:305)
[2019-04-04T02:18:16.007Z]     at org.apache.maven.DefaultMaven.doExecute (DefaultMaven.java:192)
[2019-04-04T02:18:16.007Z]     at org.apache.maven.DefaultMaven.execute (DefaultMaven.java:105)
[2019-04-04T02:18:16.007Z]     at org.apache.maven.cli.MavenCli.execute (MavenCli.java:956)
[2019-04-04T02:18:16.007Z]     at org.apache.maven.cli.MavenCli.doMain (MavenCli.java:288)
[2019-04-04T02:18:16.007Z]     at org.apache.maven.cli.MavenCli.main (MavenCli.java:192)
[2019-04-04T02:18:16.007Z]     at sun.reflect.NativeMethodAccessorImpl.invoke0 (Native Method)
[2019-04-04T02:18:16.007Z]     at sun.reflect.NativeMethodAccessorImpl.invoke (NativeMethodAccessorImpl.java:62)
[2019-04-04T02:18:16.007Z]     at sun.reflect.DelegatingMethodAccessorImpl.invoke (DelegatingMethodAccessorImpl.java:43)
[2019-04-04T02:18:16.007Z]     at java.lang.reflect.Method.invoke (Method.java:498)
[2019-04-04T02:18:16.007Z]     at org.codehaus.plexus.classworlds.launcher.Launcher.launchEnhanced
(Launcher.java:289)
[2019-04-04T02:18:16.007Z]     at org.codehaus.plexus.classworlds.launcher.Launcher.launch
(Launcher.java:229)
[2019-04-04T02:18:16.007Z]     at org.codehaus.plexus.classworlds.launcher.Launcher.mainWithExitCode
(Launcher.java:415)
[2019-04-04T02:18:16.007Z]     at org.codehaus.plexus.classworlds.launcher.Launcher.main (Launcher.java:356)
[2019-04-04T02:18:16.007Z] Caused by: org.apache.maven.plugin.MojoFailureException: There
are test failures.
[2019-04-04T02:18:16.007Z] 
[2019-04-04T02:18:16.007Z] Please refer to C:\Users\jenkins\AppData\Local\Temp\2\jenkins-maven-box-maven-surefire-1546-1222-7\surefire-its\target\failsafe-reports
for the individual test results.
[2019-04-04T02:18:16.007Z] Please refer to dump files (if any exist) [date].dump, [date]-jvmRun[N].dump
and [date].dumpstream.
[2019-04-04T02:18:16.007Z]     at org.apache.maven.plugin.surefire.SurefireHelper.throwException
(SurefireHelper.java:271)
[2019-04-04T02:18:16.007Z]     at org.apache.maven.plugin.surefire.SurefireHelper.reportExecution
(SurefireHelper.java:159)
[2019-04-04T02:18:16.007Z]     at org.apache.maven.plugin.failsafe.VerifyMojo.execute (VerifyMojo.java:192)
[2019-04-04T02:18:16.007Z]     at org.apache.maven.plugin.DefaultBuildPluginManager.executeMojo
(DefaultBuildPluginManager.java:137)
[2019-04-04T02:18:16.007Z]     at org.apache.maven.lifecycle.internal.MojoExecutor.execute
(MojoExecutor.java:210)
[2019-04-04T02:18:16.007Z]     at org.apache.maven.lifecycle.internal.MojoExecutor.execute
(MojoExecutor.java:156)
[2019-04-04T02:18:16.007Z]     at org.apache.maven.lifecycle.internal.MojoExecutor.execute
(MojoExecutor.java:148)
[2019-04-04T02:18:16.007Z]     at org.apache.maven.lifecycle.internal.LifecycleModuleBuilder.buildProject
(LifecycleModuleBuilder.java:117)
[2019-04-04T02:18:16.007Z]     at org.apache.maven.lifecycle.internal.LifecycleModuleBuilder.buildProject
(LifecycleModuleBuilder.java:81)
[2019-04-04T02:18:16.007Z]     at org.apache.maven.lifecycle.internal.builder.singlethreaded.SingleThreadedBuilder.build
(SingleThreadedBuilder.java:56)
[2019-04-04T02:18:16.007Z]     at org.apache.maven.lifecycle.internal.LifecycleStarter.execute
(LifecycleStarter.java:128)
[2019-04-04T02:18:16.007Z]     at org.apache.maven.DefaultMaven.doExecute (DefaultMaven.java:305)
[2019-04-04T02:18:16.007Z]     at org.apache.maven.DefaultMaven.doExecute (DefaultMaven.java:192)
[2019-04-04T02:18:16.007Z]     at org.apache.maven.DefaultMaven.execute (DefaultMaven.java:105)
[2019-04-04T02:18:16.007Z]     at org.apache.maven.cli.MavenCli.execute (MavenCli.java:956)
[2019-04-04T02:18:16.007Z]     at org.apache.maven.cli.MavenCli.doMain (MavenCli.java:288)
[2019-04-04T02:18:16.007Z]     at org.apache.maven.cli.MavenCli.main (MavenCli.java:192)
[2019-04-04T02:18:16.007Z]     at sun.reflect.NativeMethodAccessorImpl.invoke0 (Native Method)
[2019-04-04T02:18:16.007Z]     at sun.reflect.NativeMethodAccessorImpl.invoke (NativeMethodAccessorImpl.java:62)
[2019-04-04T02:18:16.007Z]     at sun.reflect.DelegatingMethodAccessorImpl.invoke (DelegatingMethodAccessorImpl.java:43)
[2019-04-04T02:18:16.007Z]     at java.lang.reflect.Method.invoke (Method.java:498)
[2019-04-04T02:18:16.007Z]     at org.codehaus.plexus.classworlds.launcher.Launcher.launchEnhanced
(Launcher.java:289)
[2019-04-04T02:18:16.007Z]     at org.codehaus.plexus.classworlds.launcher.Launcher.launch
(Launcher.java:229)
[2019-04-04T02:18:16.007Z]     at org.codehaus.plexus.classworlds.launcher.Launcher.mainWithExitCode
(Launcher.java:415)
[2019-04-04T02:18:16.007Z]     at org.codehaus.plexus.classworlds.launcher.Launcher.main (Launcher.java:356)
[2019-04-04T02:18:16.007Z] [ERROR] 
[2019-04-04T02:18:16.007Z] [ERROR] Re-run Maven using the -X switch to enable full debug logging.
[2019-04-04T02:18:16.007Z] [ERROR] 
[2019-04-04T02:18:16.007Z] [ERROR] For more information about the errors and possible solutions,
please read the following articles:
[2019-04-04T02:18:16.007Z] [ERROR] [Help 1] http://cwiki.apache.org/confluence/display/MAVEN/MojoFailureException
[2019-04-04T02:18:16.007Z] [ERROR] 
[2019-04-04T02:18:16.007Z] [ERROR] After correcting the problems, you can resume the build
with the command
[2019-04-04T02:18:16.007Z] [ERROR]   mvn <goals> -rf :surefire-its
[Pipeline] }
[Pipeline] // withEnv
[Pipeline] }
[Pipeline] // stage
[Pipeline] fileExists
[Pipeline] zip
[2019-04-04T02:18:16.220Z] Writing zip file of C:\Users\jenkins\AppData\Local\Temp\2\jenkins-maven-box-maven-surefire-1546-1222-7\maven-failsafe-plugin\target\it
to C:\Users\jenkins\AppData\Local\Temp\2\jenkins-maven-box-maven-surefire-1546-1222-7\maven-failsafe-plugin--windows-jdk8-maven3.6.x.zip
[2019-04-04T02:18:16.363Z] Zipped 78 entries.
[2019-04-04T02:18:16.364Z] Archiving C:\Users\jenkins\AppData\Local\Temp\2\jenkins-maven-box-maven-surefire-1546-1222-7\maven-failsafe-plugin--windows-jdk8-maven3.6.x.zip
[2019-04-04T02:18:16.364Z] [Fast Archiver] No prior successful build to compare, so performing
full copy of artifacts
[Pipeline] fileExists
[Pipeline] zip
[2019-04-04T02:18:16.508Z] Writing zip file of C:\Users\jenkins\AppData\Local\Temp\2\jenkins-maven-box-maven-surefire-1546-1222-7\surefire-its\target
to C:\Users\jenkins\AppData\Local\Temp\2\jenkins-maven-box-maven-surefire-1546-1222-7\surefire-its--windows-jdk8-maven3.6.x.zip
[2019-04-04T02:18:18.896Z] Zipped 1963 entries.
[2019-04-04T02:18:18.896Z] Archiving C:\Users\jenkins\AppData\Local\Temp\2\jenkins-maven-box-maven-surefire-1546-1222-7\surefire-its--windows-jdk8-maven3.6.x.zip
[2019-04-04T02:18:18.896Z] [Fast Archiver] No prior successful build to compare, so performing
full copy of artifacts
[Pipeline] archiveArtifacts
[2019-04-04T02:18:19.258Z] Archiving artifacts
[2019-04-04T02:18:19.280Z] [Fast Archiver] No prior successful build to compare, so performing
full copy of artifacts
[Pipeline] cleanWs
[2019-04-04T02:18:19.818Z] [WS-CLEANUP] Deleting project workspace...
[2019-04-04T02:18:19.818Z] [WS-CLEANUP] Deferred wipeout is used...
[2019-04-04T02:18:19.900Z] [WS-CLEANUP] done
[Pipeline] }
[Pipeline] // ws
[Pipeline] }
[Pipeline] // timestamps
[Pipeline] }
[Pipeline] // node
[Pipeline] }
[Pipeline] // parallel
[Pipeline] echo
Build result: FAILURE
[Pipeline] jiraIssueSelector
[Pipeline] emailext
Mime
  • Unnamed multipart/mixed (inline, None, 0 bytes)
View raw message