maven-notifications mailing list archives

Site index · List index
Message view « Date » · « Thread »
Top « Date » · « Thread »
From Apache Jenkins Server <jenk...@builds.apache.org>
Subject Build failed in Jenkins: Maven TLP » maven-indexer » MINDEXER-115 #1
Date Wed, 17 Apr 2019 19:13:44 GMT
See https://builds.apache.org/job/maven-box/job/maven-indexer/job/MINDEXER-115/1/

No changes.

All tests passed

Build log:
[...truncated 16795 lines...]
[INFO] Changes detected - recompiling the module!
[INFO] Compiling 10 source files to F:\jenkins\jenkins-slave\workspace\n-box_maven-indexer_MINDEXER-115\m\indexer-reader\target\classes
[INFO] /F:/jenkins/jenkins-slave/workspace/n-box_maven-indexer_MINDEXER-115/m/indexer-reader/src/main/java/org/apache/maven/index/reader/RecordExpander.java:
F:\jenkins\jenkins-slave\workspace\n-box_maven-indexer_MINDEXER-115\m\indexer-reader\src\main\java\org\apache\maven\index\reader\RecordExpander.java
uses unchecked or unsafe operations.
[INFO] /F:/jenkins/jenkins-slave/workspace/n-box_maven-indexer_MINDEXER-115/m/indexer-reader/src/main/java/org/apache/maven/index/reader/RecordExpander.java:
Recompile with -Xlint:unchecked for details.
[INFO] 
[INFO] --- animal-sniffer-maven-plugin:1.16:check (check-java-compat) @ indexer-reader ---
[INFO] Checking unresolved references to org.codehaus.mojo.signature:java17:1.0
[INFO] 
[INFO] --- maven-resources-plugin:3.1.0:testResources (default-testResources) @ indexer-reader
---
[INFO] Using 'UTF-8' encoding to copy filtered resources.
[INFO] Copying 2 resources
[INFO] Copying 3 resources
[INFO] 
[INFO] --- maven-compiler-plugin:3.7.0:testCompile (default-testCompile) @ indexer-reader
---
[INFO] Changes detected - recompiling the module!
[INFO] Compiling 9 source files to F:\jenkins\jenkins-slave\workspace\n-box_maven-indexer_MINDEXER-115\m\indexer-reader\target\test-classes
[INFO] 
[INFO] --- maven-surefire-plugin:2.22.0:test (default-test) @ indexer-reader ---
[INFO] 
[INFO] -------------------------------------------------------
[INFO]  T E S T S
[INFO] -------------------------------------------------------
[INFO] Running org.apache.maven.index.reader.ChunkReaderTest
[INFO] Tests run: 2, Failures: 0, Errors: 0, Skipped: 0, Time elapsed: 1.24 s - in org.apache.maven.index.reader.ChunkReaderTest
[INFO] Running org.apache.maven.index.reader.IndexReaderTest
[WARNING] Tests run: 4, Failures: 0, Errors: 0, Skipped: 1, Time elapsed: 1.293 s - in org.apache.maven.index.reader.IndexReaderTest
[INFO] Running org.apache.maven.index.reader.IndexWriterTest
[INFO] Tests run: 1, Failures: 0, Errors: 0, Skipped: 0, Time elapsed: 0 s - in org.apache.maven.index.reader.IndexWriterTest
[INFO] Running org.apache.maven.index.reader.TransformTest
[INFO] Tests run: 1, Failures: 0, Errors: 0, Skipped: 0, Time elapsed: 0.398 s - in org.apache.maven.index.reader.TransformTest
[INFO] 
[INFO] Results:
[INFO] 
[WARNING] Tests run: 8, Failures: 0, Errors: 0, Skipped: 1
[INFO] 
[INFO] 
[INFO] --- maven-bundle-plugin:3.0.0:bundle (default-bundle) @ indexer-reader ---
[INFO] 
[INFO] --- maven-site-plugin:3.7.1:attach-descriptor (attach-descriptor) @ indexer-reader
---
[INFO] Skipping because packaging 'bundle' is not pom.
[INFO] 
[INFO] --- maven-checkstyle-plugin:2.17:check (checkstyle-check) @ indexer-reader ---
[INFO] There are 20 errors reported by Checkstyle 6.11.2 with config/maven_checks.xml ruleset.
[INFO] Ignored 20 errors, 0 violation remaining.
[INFO] 
[INFO] ----------< org.apache.maven.indexer:maven-indexer-examples >-----------
[INFO] Building Maven :: Indexer Examples 6.0.1-SNAPSHOT                  [5/7]
[INFO] --------------------------------[ pom ]---------------------------------
[INFO] 
[INFO] --- maven-clean-plugin:3.1.0:clean (default-clean) @ maven-indexer-examples ---
[INFO] 
[INFO] --- maven-enforcer-plugin:1.4.1:enforce (enforce-maven-version) @ maven-indexer-examples
---
[INFO] 
[INFO] --- maven-enforcer-plugin:1.4.1:enforce (enforce-bytecode-version) @ maven-indexer-examples
---
[INFO] 
[INFO] --- maven-enforcer-plugin:1.4.1:enforce (ban-known-bad-maven-versions) @ maven-indexer-examples
---
[INFO] 
[INFO] --- apache-rat-plugin:0.12:check (rat-check) @ maven-indexer-examples ---
[INFO] Enabled default license matchers.
[INFO] Will parse SCM ignores for exclusions...
[INFO] Finished adding exclusions from SCM ignore files.
[INFO] 63 implicit excludes (use -debug for more details).
[INFO] Exclude: .repository/**
[INFO] Exclude: .maven/spy.log
[INFO] Exclude: dependency-reduced-pom.xml
[INFO] Exclude: .java-version
[INFO] Exclude: README.md
[INFO] Exclude: .gitignore
[INFO] Exclude: NOTICE
[INFO] Exclude: **/packageinfo
[INFO] Exclude: .git/**
[INFO] Exclude: .idea/**
[INFO] Exclude: **/*.iml
[INFO] Exclude: src/test/**/*.sha1
[INFO] Exclude: src/test/**/*.md5
[INFO] Exclude: src/test/**/*.xml
[INFO] Exclude: src/test/**/*.pom
[INFO] Exclude: src/test/**/*.asc
[INFO] Exclude: src/test/**/*.properties
[INFO] Exclude: src/test/**/*.swc
[INFO] Exclude: src/test/**/*.txt
[INFO] Exclude: src/test/**/*.filename
[INFO] Exclude: src/test/**/.placeholder
[INFO] 1 resources included (use -debug for more details)
[INFO] Rat check: Summary over all files. Unapproved: 0, unknown: 0, generated: 0, approved:
1 licenses.
[INFO] 
[INFO] --- maven-remote-resources-plugin:1.5:process (process-resource-bundles) @ maven-indexer-examples
---
[INFO] 
[INFO] --- animal-sniffer-maven-plugin:1.16:check (check-java-compat) @ maven-indexer-examples
---
[INFO] Checking unresolved references to org.codehaus.mojo.signature:java17:1.0
[INFO] 
[INFO] --- maven-site-plugin:3.7.1:attach-descriptor (attach-descriptor) @ maven-indexer-examples
---
[INFO] No site descriptor found: nothing to attach.
[INFO] 
[INFO] --- maven-checkstyle-plugin:2.17:check (checkstyle-check) @ maven-indexer-examples
---
[INFO] 
[INFO] ----------< org.apache.maven.indexer:indexer-examples-basic >-----------
[INFO] Building Maven :: Indexer Examples [Basic] 6.0.1-SNAPSHOT          [6/7]
[INFO] --------------------------------[ jar ]---------------------------------
[INFO] Downloading from central: https://repo.maven.apache.org/maven2/org/apache/maven/wagon/wagon-http-lightweight/2.12/wagon-http-lightweight-2.12.pom
[INFO] Downloaded from central: https://repo.maven.apache.org/maven2/org/apache/maven/wagon/wagon-http-lightweight/2.12/wagon-http-lightweight-2.12.pom
(2.6 kB at 3.1 kB/s)
[INFO] Downloading from central: https://repo.maven.apache.org/maven2/org/apache/maven/wagon/wagon-http-lightweight/2.12/wagon-http-lightweight-2.12.jar
[INFO] Downloaded from central: https://repo.maven.apache.org/maven2/org/apache/maven/wagon/wagon-http-lightweight/2.12/wagon-http-lightweight-2.12.jar
(17 kB at 11 kB/s)
[INFO] 
[INFO] --- maven-clean-plugin:3.1.0:clean (default-clean) @ indexer-examples-basic ---
[INFO] 
[INFO] --- maven-enforcer-plugin:1.4.1:enforce (enforce-maven-version) @ indexer-examples-basic
---
[INFO] 
[INFO] --- maven-enforcer-plugin:1.4.1:enforce (enforce-bytecode-version) @ indexer-examples-basic
---
[INFO] 
[INFO] --- maven-enforcer-plugin:1.4.1:enforce (ban-known-bad-maven-versions) @ indexer-examples-basic
---
[INFO] 
[INFO] --- apache-rat-plugin:0.12:check (rat-check) @ indexer-examples-basic ---
[INFO] Enabled default license matchers.
[INFO] Will parse SCM ignores for exclusions...
[INFO] Finished adding exclusions from SCM ignore files.
[INFO] 61 implicit excludes (use -debug for more details).
[INFO] Exclude: .repository/**
[INFO] Exclude: .maven/spy.log
[INFO] Exclude: dependency-reduced-pom.xml
[INFO] Exclude: .java-version
[INFO] Exclude: README.md
[INFO] Exclude: .gitignore
[INFO] Exclude: NOTICE
[INFO] Exclude: **/packageinfo
[INFO] Exclude: .git/**
[INFO] Exclude: .idea/**
[INFO] Exclude: **/*.iml
[INFO] Exclude: src/test/**/*.sha1
[INFO] Exclude: src/test/**/*.md5
[INFO] Exclude: src/test/**/*.xml
[INFO] Exclude: src/test/**/*.pom
[INFO] Exclude: src/test/**/*.asc
[INFO] Exclude: src/test/**/*.properties
[INFO] Exclude: src/test/**/*.swc
[INFO] Exclude: src/test/**/*.txt
[INFO] Exclude: src/test/**/*.filename
[INFO] Exclude: src/test/**/.placeholder
[INFO] 4 resources included (use -debug for more details)
[INFO] Rat check: Summary over all files. Unapproved: 0, unknown: 0, generated: 0, approved:
4 licenses.
[INFO] 
[INFO] --- maven-remote-resources-plugin:1.5:process (process-resource-bundles) @ indexer-examples-basic
---
[INFO] 
[INFO] --- maven-resources-plugin:3.1.0:resources (default-resources) @ indexer-examples-basic
---
[INFO] Using 'UTF-8' encoding to copy filtered resources.
[INFO] skip non existing resourceDirectory F:\jenkins\jenkins-slave\workspace\n-box_maven-indexer_MINDEXER-115\m\indexer-examples\indexer-examples-basic\src\main\resources
[INFO] Copying 3 resources
[INFO] 
[INFO] --- maven-compiler-plugin:3.7.0:compile (default-compile) @ indexer-examples-basic
---
[INFO] Changes detected - recompiling the module!
[INFO] Compiling 1 source file to F:\jenkins\jenkins-slave\workspace\n-box_maven-indexer_MINDEXER-115\m\indexer-examples\indexer-examples-basic\target\classes
[INFO] 
[INFO] --- animal-sniffer-maven-plugin:1.16:check (check-java-compat) @ indexer-examples-basic
---
[INFO] Checking unresolved references to org.codehaus.mojo.signature:java17:1.0
[INFO] 
[INFO] --- maven-resources-plugin:3.1.0:testResources (default-testResources) @ indexer-examples-basic
---
[INFO] Using 'UTF-8' encoding to copy filtered resources.
[INFO] skip non existing resourceDirectory F:\jenkins\jenkins-slave\workspace\n-box_maven-indexer_MINDEXER-115\m\indexer-examples\indexer-examples-basic\src\test\resources
[INFO] Copying 3 resources
[INFO] 
[INFO] --- maven-compiler-plugin:3.7.0:testCompile (default-testCompile) @ indexer-examples-basic
---
[INFO] Changes detected - recompiling the module!
[INFO] Compiling 1 source file to F:\jenkins\jenkins-slave\workspace\n-box_maven-indexer_MINDEXER-115\m\indexer-examples\indexer-examples-basic\target\test-classes
[INFO] 
[INFO] --- maven-surefire-plugin:2.22.0:test (default-test) @ indexer-examples-basic ---
[INFO] Tests are skipped.
[INFO] 
[INFO] --- maven-jar-plugin:3.1.0:jar (default-jar) @ indexer-examples-basic ---
[INFO] Building jar: F:\jenkins\jenkins-slave\workspace\n-box_maven-indexer_MINDEXER-115\m\indexer-examples\indexer-examples-basic\target\indexer-examples-basic-6.0.1-SNAPSHOT.jar
[INFO] 
[INFO] --- maven-site-plugin:3.7.1:attach-descriptor (attach-descriptor) @ indexer-examples-basic
---
[INFO] Skipping because packaging 'jar' is not pom.
[INFO] 
[INFO] --- maven-checkstyle-plugin:2.17:check (checkstyle-check) @ indexer-examples-basic
---
[INFO] There are 3 errors reported by Checkstyle 6.11.2 with config/maven_checks.xml ruleset.
[ERROR] src\main\java\org\apache\maven\indexer\examples\BasicUsageExample.java:[244] (sizes)
LineLength: Line is longer than 120 characters (found 128).
[ERROR] src\main\java\org\apache\maven\indexer\examples\BasicUsageExample.java:[317] (sizes)
LineLength: Line is longer than 120 characters (found 131).
[INFO] Ignored 1 error, 2 violations remaining.
[INFO] ------------------------------------------------------------------------
[INFO] Reactor Summary for Maven-Indexer 6.0.1-SNAPSHOT:
[INFO] 
[INFO] Maven-Indexer ...................................... SUCCESS [04:48 min]
[INFO] Maven :: Indexer Core .............................. SUCCESS [30:13 min]
[INFO] Maven :: Indexer CLI ............................... SUCCESS [05:13 min]
[INFO] Maven :: Indexer Reader ............................ SUCCESS [01:09 min]
[INFO] Maven :: Indexer Examples .......................... SUCCESS [  9.577 s]
[INFO] Maven :: Indexer Examples [Basic] .................. FAILURE [ 38.493 s]
[INFO] Maven :: Indexer Examples [Spring] ................. SKIPPED
[INFO] ------------------------------------------------------------------------
[INFO] BUILD FAILURE
[INFO] ------------------------------------------------------------------------
[INFO] Total time:  42:32 min
[INFO] Finished at: 2019-04-17T19:12:58Z
[INFO] ------------------------------------------------------------------------
[WARNING] The requested profile "run-its" could not be activated because it does not exist.
[INFO] [jenkins-event-spy] Generated F:\jenkins\jenkins-slave\workspace\n-box_maven-indexer_MINDEXER-115@tmp\withMavenaa46bd4a\maven-spy-20190417-183024-93812545437005077547729.log
[ERROR] Failed to execute goal org.apache.maven.plugins:maven-checkstyle-plugin:2.17:check
(checkstyle-check) on project indexer-examples-basic: You have 2 Checkstyle violations. ->
[Help 1]
[ERROR] 
[ERROR] To see the full stack trace of the errors, re-run Maven with the -e switch.
[ERROR] Re-run Maven using the -X switch to enable full debug logging.
[ERROR] 
[ERROR] For more information about the errors and possible solutions, please read the following
articles:
[ERROR] [Help 1] http://cwiki.apache.org/confluence/display/MAVEN/MojoFailureException
[ERROR] 
[ERROR] After correcting the problems, you can resume the build with the command
[ERROR]   mvn <goals> -rf :indexer-examples-basic
[Pipeline] }
[Pipeline] // dir
[Pipeline] }
[withMaven] junitPublisher - Archive test results for Maven artifact org.apache.maven.indexer:indexer-core:jar:6.0.1-SNAPSHOT
generated by maven-surefire-plugin:test (default-test): m\indexer-core\target\surefire-reports\*.xml
Recording test results
[withMaven] junitPublisher - Archive test results for Maven artifact org.apache.maven.indexer:indexer-cli:jar:6.0.1-SNAPSHOT
generated by maven-surefire-plugin:test (default-test): m\indexer-cli\target\surefire-reports\*.xml
Recording test results
[withMaven] junitPublisher - Archive test results for Maven artifact org.apache.maven.indexer:indexer-reader:bundle:6.0.1-SNAPSHOT
generated by maven-surefire-plugin:test (default-test): m\indexer-reader\target\surefire-reports\*.xml
Recording test results
[withMaven] junitPublisher - Archive test results for Maven artifact org.apache.maven.indexer:indexer-examples-basic:jar:6.0.1-SNAPSHOT
generated by maven-surefire-plugin:test (default-test): m\indexer-examples\indexer-examples-basic\target\surefire-reports\*.xml
Recording test results
None of the test reports contained any result
[withMaven] junitPublisher - Archive test results for Maven artifact org.apache.maven.indexer:indexer-core:jar:6.0.1-SNAPSHOT
generated by maven-failsafe-plugin:integration-test (default): m\indexer-core\target\failsafe-reports\*.xml
Recording test results
[withMaven] junitPublisher - Archive test results for Maven artifact org.apache.maven.indexer:indexer-cli:jar:6.0.1-SNAPSHOT
generated by maven-failsafe-plugin:integration-test (default): m\indexer-cli\target\failsafe-reports\*.xml
Recording test results
[withMaven] Publishers: Pipeline Graph Publisher: 4 ms, Junit Publisher: 32311 ms, Dependencies
Fingerprint Publisher: 739 ms
[Pipeline] // withMaven
[Pipeline] echo
[FAILURE-004] hudson.AbortException: script returned exit code 1
[Pipeline] cleanWs
[WS-CLEANUP] Deleting project workspace...
[WS-CLEANUP] Deferred wipeout is used...
[WS-CLEANUP] done
[Pipeline] cleanWs
[WS-CLEANUP] Deleting project workspace...
[WS-CLEANUP] Deferred wipeout is used...
[WS-CLEANUP] done
[Pipeline] }
[Pipeline] // stage
[Pipeline] }
[Pipeline] // node
[Pipeline] }
Failed in branch windows-jdk11
[Pipeline] // parallel
[Pipeline] echo
[FAILURE-003] AbortException hudson.AbortException: script returned exit code 1
[Pipeline] stage
[Pipeline] { (Notifications)
[Pipeline] echo
Build result: FAILURE
[Pipeline] jiraIssueSelector
[Pipeline] emailext
Mime
  • Unnamed multipart/mixed (inline, None, 0 bytes)
View raw message