maven-notifications mailing list archives

Site index · List index
Message view « Date » · « Thread »
Top « Date » · « Thread »
From Apache Jenkins Server <jenk...@builds.apache.org>
Subject Build failed in Jenkins: Maven TLP » maven-scm-publish-plugin » stabilize #8
Date Sun, 21 Apr 2019 09:53:52 GMT
See https://builds.apache.org/job/maven-box/job/maven-scm-publish-plugin/job/stabilize/8/

Changes:

* Fix ITs
* Fix ITs
* Fix ITs
* Fix ITs
* Fix ITs
* Fix ITs
* Fix ITs
* Fix ITs
* Fix ITs
* Fix ITs
* Fix ITs
* Fix ITs

No tests ran.

Build log:
[...truncated 137598 lines...]
[INFO] [DEBUG]   Included: jdom:jdom:jar:1.0
[INFO] [DEBUG]   Included: org.sonatype.aether:aether-util:jar:1.7
[INFO] [DEBUG]   Included: org.sonatype.sisu:sisu-inject-bean:jar:1.4.2
[INFO] [DEBUG]   Included: org.sonatype.sisu:sisu-guice:jar:noaop:2.1.7
[INFO] [DEBUG]   Included: org.codehaus.plexus:plexus-component-annotations:jar:1.7.1
[INFO] [DEBUG]   Included: org.apache.maven.scm:maven-scm-api:jar:1.10.0
[INFO] [DEBUG]   Included: org.apache.maven.scm:maven-scm-provider-gitexe:jar:1.10.0
[INFO] [DEBUG]   Included: org.apache.maven.scm:maven-scm-provider-git-commons:jar:1.10.0
[INFO] [DEBUG]   Included: org.apache.maven.scm:maven-scm-provider-svnexe:jar:1.10.0
[INFO] [DEBUG]   Included: org.apache.maven.scm:maven-scm-provider-svn-commons:jar:1.10.0
[INFO] [DEBUG]   Included: org.apache.maven.shared:maven-shared-utils:jar:3.2.0
[INFO] [DEBUG]   Included: org.codehaus.jackson:jackson-core-asl:jar:1.9.4
[INFO] [DEBUG]   Included: org.codehaus.jackson:jackson-mapper-asl:jar:1.9.4
[INFO] [DEBUG]   Included: commons-io:commons-io:jar:2.5
[INFO] [DEBUG]   Included: org.apache.commons:commons-lang3:jar:3.1
[INFO] [DEBUG]   Included: org.codehaus.plexus:plexus-utils:jar:3.0.24
[INFO] [DEBUG] Configuring mojo org.apache.maven.plugins:maven-scm-publish-plugin:3.1.0-SNAPSHOT:publish-scm
from plugin realm ClassRealm[plugin>org.apache.maven.plugins:maven-scm-publish-plugin:3.1.0-SNAPSHOT,
parent: sun.misc.Launcher$AppClassLoader@33909752]
[INFO] [DEBUG] Configuring mojo 'org.apache.maven.plugins:maven-scm-publish-plugin:3.1.0-SNAPSHOT:publish-scm'
with basic configurator -->
[INFO] [DEBUG]   (f) addUniqueDirectory = false
[INFO] [DEBUG]   (f) automaticRemotePathCreation = true
[INFO] [DEBUG]   (f) basedir = F:\jenkins\jenkins-slave\workspace\ven-scm-publish-plugin_stabilize@3\windows-jdk8-m3.6.x_build\target\it\site-deploy
[INFO] [DEBUG]   (f) checkinComment = Site checkin for project maven-scm-publish-plugin-004-005-site-lifecycle
[INFO] [DEBUG]   (f) checkoutDirectory = F:\jenkins\jenkins-slave\workspace\ven-scm-publish-plugin_stabilize@3\windows-jdk8-m3.6.x_build\target\it\site-deploy\target\scmpublish-checkout
[INFO] [DEBUG]   (f) content = F:\jenkins\jenkins-slave\workspace\ven-scm-publish-plugin_stabilize@3\windows-jdk8-m3.6.x_build\target\it\site-deploy\target\staging
[INFO] [DEBUG]   (f) localCheckout = false
[INFO] [DEBUG]   (f) project = MavenProject: org.apache.maven.plugins:maven-scm-publish-plugin-005-site-lifecycle:1.0-SNAPSHOT
@ F:\jenkins\jenkins-slave\workspace\ven-scm-publish-plugin_stabilize@3\windows-jdk8-m3.6.x_build\target\it\site-deploy\pom.xml
[INFO] [DEBUG]   (s) pubScmUrl = scm:svn:file:///F:/jenkins/jenkins-slave/workspace/ven-scm-publish-plugin_stabilize@3/windows-jdk8-m3.6.x_build/target/it/site-deploy//target/svn-root
[INFO] [DEBUG]   (f) settings = org.apache.maven.execution.SettingsAdapter@2f5ac102
[INFO] [DEBUG]   (f) skipDeletedFiles = false
[INFO] [DEBUG]   (f) skipDeployement = false
[INFO] [DEBUG]   (f) tryUpdate = false
[INFO] [DEBUG] -- end configuration --
[INFO] [WARNING] No output encoding, defaulting to UTF-8.
[INFO] [DEBUG] AbstractSvnScmProvider used, so we can check if remote url exists and eventually
create it.
[INFO] [INFO] ------------------------------------------------------------------------
[INFO] [INFO] BUILD FAILURE
[INFO] [INFO] ------------------------------------------------------------------------
[INFO] [INFO] Total time:  14.649 s
[INFO] [INFO] Finished at: 2019-04-21T02:53:46-07:00
[INFO] [INFO] ------------------------------------------------------------------------
[INFO] [ERROR] Failed to execute goal org.apache.maven.plugins:maven-scm-publish-plugin:3.1.0-SNAPSHOT:publish-scm
(scm-publish) on project maven-scm-publish-plugin-005-site-lifecycle: cmd.exe /X /C "svn --username
/F --password /jenkins/jenkins-slave/workspace/ven-scm-publish-plugin_stabilize --no-auth-cache
--non-interactive ls file://3/windows-jdk8-m3.6.x_build/target/it/site-deploy//target/svn-root".The
svn command failed:svn: E180001: Unable to connect to a repository at URL 'file://3/windows-jdk8-m3.6.x_build/target/it/site-deploy/target/svn-root'
[INFO] [ERROR] svn: E180001: Unable to open an ra_local session to URL
[INFO] [ERROR] svn: E180001: Unable to open repository 'file://3/windows-jdk8-m3.6.x_build/target/it/site-deploy/target/svn-root'
[INFO] [ERROR] -> [Help 1]
[INFO] org.apache.maven.lifecycle.LifecycleExecutionException: Failed to execute goal org.apache.maven.plugins:maven-scm-publish-plugin:3.1.0-SNAPSHOT:publish-scm
(scm-publish) on project maven-scm-publish-plugin-005-site-lifecycle: cmd.exe /X /C "svn --username
/F --password /jenkins/jenkins-slave/workspace/ven-scm-publish-plugin_stabilize --no-auth-cache
--non-interactive ls file://3/windows-jdk8-m3.6.x_build/target/it/site-deploy//target/svn-root".The
svn command failed:svn: E180001: Unable to connect to a repository at URL 'file://3/windows-jdk8-m3.6.x_build/target/it/site-deploy/target/svn-root'
[INFO] svn: E180001: Unable to open an ra_local session to URL
[INFO] svn: E180001: Unable to open repository 'file://3/windows-jdk8-m3.6.x_build/target/it/site-deploy/target/svn-root'
[INFO] 
[INFO]     at org.apache.maven.lifecycle.internal.MojoExecutor.execute (MojoExecutor.java:215)
[INFO]     at org.apache.maven.lifecycle.internal.MojoExecutor.execute (MojoExecutor.java:156)
[INFO]     at org.apache.maven.lifecycle.internal.MojoExecutor.execute (MojoExecutor.java:148)
[INFO]     at org.apache.maven.lifecycle.internal.LifecycleModuleBuilder.buildProject (LifecycleModuleBuilder.java:117)
[INFO]     at org.apache.maven.lifecycle.internal.LifecycleModuleBuilder.buildProject (LifecycleModuleBuilder.java:81)
[INFO]     at org.apache.maven.lifecycle.internal.builder.singlethreaded.SingleThreadedBuilder.build
(SingleThreadedBuilder.java:56)
[INFO]     at org.apache.maven.lifecycle.internal.LifecycleStarter.execute (LifecycleStarter.java:128)
[INFO]     at org.apache.maven.DefaultMaven.doExecute (DefaultMaven.java:305)
[INFO]     at org.apache.maven.DefaultMaven.doExecute (DefaultMaven.java:192)
[INFO]     at org.apache.maven.DefaultMaven.execute (DefaultMaven.java:105)
[INFO]     at org.apache.maven.cli.MavenCli.execute (MavenCli.java:956)
[INFO]     at org.apache.maven.cli.MavenCli.doMain (MavenCli.java:288)
[INFO]     at org.apache.maven.cli.MavenCli.main (MavenCli.java:192)
[INFO]     at sun.reflect.NativeMethodAccessorImpl.invoke0 (Native Method)
[INFO]     at sun.reflect.NativeMethodAccessorImpl.invoke (NativeMethodAccessorImpl.java:62)
[INFO]     at sun.reflect.DelegatingMethodAccessorImpl.invoke (DelegatingMethodAccessorImpl.java:43)
[INFO]     at java.lang.reflect.Method.invoke (Method.java:498)
[INFO]     at org.codehaus.plexus.classworlds.launcher.Launcher.launchEnhanced (Launcher.java:289)
[INFO]     at org.codehaus.plexus.classworlds.launcher.Launcher.launch (Launcher.java:229)
[INFO]     at org.codehaus.plexus.classworlds.launcher.Launcher.mainWithExitCode (Launcher.java:415)
[INFO]     at org.codehaus.plexus.classworlds.launcher.Launcher.main (Launcher.java:356)
[INFO] Caused by: org.apache.maven.plugin.MojoExecutionException: cmd.exe /X /C "svn --username
/F --password /jenkins/jenkins-slave/workspace/ven-scm-publish-plugin_stabilize --no-auth-cache
--non-interactive ls file://3/windows-jdk8-m3.6.x_build/target/it/site-deploy//target/svn-root".The
svn command failed:svn: E180001: Unable to connect to a repository at URL 'file://3/windows-jdk8-m3.6.x_build/target/it/site-deploy/target/svn-root'
[INFO] svn: E180001: Unable to open an ra_local session to URL
[INFO] svn: E180001: Unable to open repository 'file://3/windows-jdk8-m3.6.x_build/target/it/site-deploy/target/svn-root'
[INFO] 
[INFO]     at org.apache.maven.plugins.scmpublish.AbstractScmPublishMojo.checkCreateRemoteSvnPath
(AbstractScmPublishMojo.java:488)
[INFO]     at org.apache.maven.plugins.scmpublish.AbstractScmPublishMojo.checkoutExisting
(AbstractScmPublishMojo.java:379)
[INFO]     at org.apache.maven.plugins.scmpublish.ScmPublishPublishScmMojo.scmPublishExecute
(ScmPublishPublishScmMojo.java:277)
[INFO]     at org.apache.maven.plugins.scmpublish.AbstractScmPublishMojo.execute (AbstractScmPublishMojo.java:591)
[INFO]     at org.apache.maven.plugin.DefaultBuildPluginManager.executeMojo (DefaultBuildPluginManager.java:137)
[INFO]     at org.apache.maven.lifecycle.internal.MojoExecutor.execute (MojoExecutor.java:210)
[INFO]     at org.apache.maven.lifecycle.internal.MojoExecutor.execute (MojoExecutor.java:156)
[INFO]     at org.apache.maven.lifecycle.internal.MojoExecutor.execute (MojoExecutor.java:148)
[INFO]     at org.apache.maven.lifecycle.internal.LifecycleModuleBuilder.buildProject (LifecycleModuleBuilder.java:117)
[INFO]     at org.apache.maven.lifecycle.internal.LifecycleModuleBuilder.buildProject (LifecycleModuleBuilder.java:81)
[INFO]     at org.apache.maven.lifecycle.internal.builder.singlethreaded.SingleThreadedBuilder.build
(SingleThreadedBuilder.java:56)
[INFO]     at org.apache.maven.lifecycle.internal.LifecycleStarter.execute (LifecycleStarter.java:128)
[INFO]     at org.apache.maven.DefaultMaven.doExecute (DefaultMaven.java:305)
[INFO]     at org.apache.maven.DefaultMaven.doExecute (DefaultMaven.java:192)
[INFO]     at org.apache.maven.DefaultMaven.execute (DefaultMaven.java:105)
[INFO]     at org.apache.maven.cli.MavenCli.execute (MavenCli.java:956)
[INFO]     at org.apache.maven.cli.MavenCli.doMain (MavenCli.java:288)
[INFO]     at org.apache.maven.cli.MavenCli.main (MavenCli.java:192)
[INFO]     at sun.reflect.NativeMethodAccessorImpl.invoke0 (Native Method)
[INFO]     at sun.reflect.NativeMethodAccessorImpl.invoke (NativeMethodAccessorImpl.java:62)
[INFO]     at sun.reflect.DelegatingMethodAccessorImpl.invoke (DelegatingMethodAccessorImpl.java:43)
[INFO]     at java.lang.reflect.Method.invoke (Method.java:498)
[INFO]     at org.codehaus.plexus.classworlds.launcher.Launcher.launchEnhanced (Launcher.java:289)
[INFO]     at org.codehaus.plexus.classworlds.launcher.Launcher.launch (Launcher.java:229)
[INFO]     at org.codehaus.plexus.classworlds.launcher.Launcher.mainWithExitCode (Launcher.java:415)
[INFO]     at org.codehaus.plexus.classworlds.launcher.Launcher.main (Launcher.java:356)
[INFO] Caused by: org.apache.maven.scm.ScmException: cmd.exe /X /C "svn --username /F --password
/jenkins/jenkins-slave/workspace/ven-scm-publish-plugin_stabilize --no-auth-cache --non-interactive
ls file://3/windows-jdk8-m3.6.x_build/target/it/site-deploy//target/svn-root".The svn command
failed:svn: E180001: Unable to connect to a repository at URL 'file://3/windows-jdk8-m3.6.x_build/target/it/site-deploy/target/svn-root'
[INFO] svn: E180001: Unable to open an ra_local session to URL
[INFO] svn: E180001: Unable to open repository 'file://3/windows-jdk8-m3.6.x_build/target/it/site-deploy/target/svn-root'
[INFO] 
[INFO]     at org.apache.maven.scm.provider.svn.svnexe.command.remoteinfo.SvnRemoteInfoCommand.remoteUrlExist
(SvnRemoteInfoCommand.java:160)
[INFO]     at org.apache.maven.scm.provider.svn.svnexe.SvnExeScmProvider.remoteUrlExist (SvnExeScmProvider.java:212)
[INFO]     at org.apache.maven.plugins.scmpublish.AbstractScmPublishMojo.checkCreateRemoteSvnPath
(AbstractScmPublishMojo.java:479)
[INFO]     at org.apache.maven.plugins.scmpublish.AbstractScmPublishMojo.checkoutExisting
(AbstractScmPublishMojo.java:379)
[INFO]     at org.apache.maven.plugins.scmpublish.ScmPublishPublishScmMojo.scmPublishExecute
(ScmPublishPublishScmMojo.java:277)
[INFO]     at org.apache.maven.plugins.scmpublish.AbstractScmPublishMojo.execute (AbstractScmPublishMojo.java:591)
[INFO]     at org.apache.maven.plugin.DefaultBuildPluginManager.executeMojo (DefaultBuildPluginManager.java:137)
[INFO]     at org.apache.maven.lifecycle.internal.MojoExecutor.execute (MojoExecutor.java:210)
[INFO]     at org.apache.maven.lifecycle.internal.MojoExecutor.execute (MojoExecutor.java:156)
[INFO]     at org.apache.maven.lifecycle.internal.MojoExecutor.execute (MojoExecutor.java:148)
[INFO]     at org.apache.maven.lifecycle.internal.LifecycleModuleBuilder.buildProject (LifecycleModuleBuilder.java:117)
[INFO]     at org.apache.maven.lifecycle.internal.LifecycleModuleBuilder.buildProject (LifecycleModuleBuilder.java:81)
[INFO]     at org.apache.maven.lifecycle.internal.builder.singlethreaded.SingleThreadedBuilder.build
(SingleThreadedBuilder.java:56)
[INFO]     at org.apache.maven.lifecycle.internal.LifecycleStarter.execute (LifecycleStarter.java:128)
[INFO]     at org.apache.maven.DefaultMaven.doExecute (DefaultMaven.java:305)
[INFO]     at org.apache.maven.DefaultMaven.doExecute (DefaultMaven.java:192)
[INFO]     at org.apache.maven.DefaultMaven.execute (DefaultMaven.java:105)
[INFO]     at org.apache.maven.cli.MavenCli.execute (MavenCli.java:956)
[INFO]     at org.apache.maven.cli.MavenCli.doMain (MavenCli.java:288)
[INFO]     at org.apache.maven.cli.MavenCli.main (MavenCli.java:192)
[INFO]     at sun.reflect.NativeMethodAccessorImpl.invoke0 (Native Method)
[INFO]     at sun.reflect.NativeMethodAccessorImpl.invoke (NativeMethodAccessorImpl.java:62)
[INFO]     at sun.reflect.DelegatingMethodAccessorImpl.invoke (DelegatingMethodAccessorImpl.java:43)
[INFO]     at java.lang.reflect.Method.invoke (Method.java:498)
[INFO]     at org.codehaus.plexus.classworlds.launcher.Launcher.launchEnhanced (Launcher.java:289)
[INFO]     at org.codehaus.plexus.classworlds.launcher.Launcher.launch (Launcher.java:229)
[INFO]     at org.codehaus.plexus.classworlds.launcher.Launcher.mainWithExitCode (Launcher.java:415)
[INFO]     at org.codehaus.plexus.classworlds.launcher.Launcher.main (Launcher.java:356)
[INFO] [ERROR] 
[INFO] [ERROR] 
[INFO] [ERROR] For more information about the errors and possible solutions, please read the
following articles:
[INFO] [ERROR] [Help 1] http://cwiki.apache.org/confluence/display/MAVEN/MojoExecutionException
[INFO] Picked up JAVA_TOOL_OPTIONS: -Dmaven.ext.class.path="f:\jenkins\jenkins-slave\workspace\ven-scm-publish-plugin_stabilize@3@tmp\withMaven6530aa1f\pipeline-maven-spy.jar"
-Dorg.jenkinsci.plugins.pipeline.maven.reportsFolder="f:\jenkins\jenkins-slave\workspace\ven-scm-publish-plugin_stabilize@3@tmp\withMaven6530aa1f"

[INFO]           site-deploy\pom.xml .............................. FAILED (20.6 s)
[INFO]   The build exited with code 1. See f:\jenkins\jenkins-slave\workspace\ven-scm-publish-plugin_stabilize@3\windows-jdk8-m3.6.x_build\target\it\site-deploy\build.log
for details.
[INFO] 
[INFO] --- maven-checkstyle-plugin:3.0.0:check (checkstyle-check) @ maven-scm-publish-plugin
---
[INFO] 
[INFO] --- maven-invoker-plugin:3.1.0:verify (integration-test) @ maven-scm-publish-plugin
---
[INFO] -------------------------------------------------
[INFO] Build Summary:
[INFO]   Passed: 0, Failed: 2, Errors: 0, Skipped: 1
[INFO] -------------------------------------------------
[ERROR] The following builds failed:
[ERROR] *  publish-scm-staged\pom.xml
[ERROR] *  site-deploy\pom.xml
[INFO] -------------------------------------------------
[INFO] ------------------------------------------------------------------------
[INFO] BUILD FAILURE
[INFO] ------------------------------------------------------------------------
[INFO] Total time:  03:14 min
[INFO] Finished at: 2019-04-21T02:53:49-07:00
[INFO] ------------------------------------------------------------------------
[INFO] [jenkins-event-spy] Generated F:\jenkins\jenkins-slave\workspace\ven-scm-publish-plugin_stabilize@3@tmp\withMaven6530aa1f\maven-spy-20190421-025034-444378709959596898956.log
[ERROR] Failed to execute goal org.apache.maven.plugins:maven-invoker-plugin:3.1.0:verify
(integration-test) on project maven-scm-publish-plugin: 2 builds failed. See console output
above for details. -> [Help 1]
org.apache.maven.lifecycle.LifecycleExecutionException: Failed to execute goal org.apache.maven.plugins:maven-invoker-plugin:3.1.0:verify
(integration-test) on project maven-scm-publish-plugin: 2 builds failed. See console output
above for details.
    at org.apache.maven.lifecycle.internal.MojoExecutor.execute (MojoExecutor.java:215)
    at org.apache.maven.lifecycle.internal.MojoExecutor.execute (MojoExecutor.java:156)
    at org.apache.maven.lifecycle.internal.MojoExecutor.execute (MojoExecutor.java:148)
    at org.apache.maven.lifecycle.internal.LifecycleModuleBuilder.buildProject (LifecycleModuleBuilder.java:117)
    at org.apache.maven.lifecycle.internal.LifecycleModuleBuilder.buildProject (LifecycleModuleBuilder.java:81)
    at org.apache.maven.lifecycle.internal.builder.singlethreaded.SingleThreadedBuilder.build
(SingleThreadedBuilder.java:56)
    at org.apache.maven.lifecycle.internal.LifecycleStarter.execute (LifecycleStarter.java:128)
    at org.apache.maven.DefaultMaven.doExecute (DefaultMaven.java:305)
    at org.apache.maven.DefaultMaven.doExecute (DefaultMaven.java:192)
    at org.apache.maven.DefaultMaven.execute (DefaultMaven.java:105)
    at org.apache.maven.cli.MavenCli.execute (MavenCli.java:956)
    at org.apache.maven.cli.MavenCli.doMain (MavenCli.java:288)
    at org.apache.maven.cli.MavenCli.main (MavenCli.java:192)
    at sun.reflect.NativeMethodAccessorImpl.invoke0 (Native Method)
    at sun.reflect.NativeMethodAccessorImpl.invoke (NativeMethodAccessorImpl.java:62)
    at sun.reflect.DelegatingMethodAccessorImpl.invoke (DelegatingMethodAccessorImpl.java:43)
    at java.lang.reflect.Method.invoke (Method.java:498)
    at org.codehaus.plexus.classworlds.launcher.Launcher.launchEnhanced (Launcher.java:289)
    at org.codehaus.plexus.classworlds.launcher.Launcher.launch (Launcher.java:229)
    at org.codehaus.plexus.classworlds.launcher.Launcher.mainWithExitCode (Launcher.java:415)
    at org.codehaus.plexus.classworlds.launcher.Launcher.main (Launcher.java:356)
Caused by: org.apache.maven.plugin.MojoFailureException: 2 builds failed. See console output
above for details.
    at org.apache.maven.plugins.invoker.InvokerSession.handleFailures (InvokerSession.java:260)
    at org.apache.maven.plugins.invoker.VerifyMojo.execute (VerifyMojo.java:137)
    at org.apache.maven.plugin.DefaultBuildPluginManager.executeMojo (DefaultBuildPluginManager.java:137)
    at org.apache.maven.lifecycle.internal.MojoExecutor.execute (MojoExecutor.java:210)
    at org.apache.maven.lifecycle.internal.MojoExecutor.execute (MojoExecutor.java:156)
    at org.apache.maven.lifecycle.internal.MojoExecutor.execute (MojoExecutor.java:148)
    at org.apache.maven.lifecycle.internal.LifecycleModuleBuilder.buildProject (LifecycleModuleBuilder.java:117)
    at org.apache.maven.lifecycle.internal.LifecycleModuleBuilder.buildProject (LifecycleModuleBuilder.java:81)
    at org.apache.maven.lifecycle.internal.builder.singlethreaded.SingleThreadedBuilder.build
(SingleThreadedBuilder.java:56)
    at org.apache.maven.lifecycle.internal.LifecycleStarter.execute (LifecycleStarter.java:128)
    at org.apache.maven.DefaultMaven.doExecute (DefaultMaven.java:305)
    at org.apache.maven.DefaultMaven.doExecute (DefaultMaven.java:192)
    at org.apache.maven.DefaultMaven.execute (DefaultMaven.java:105)
    at org.apache.maven.cli.MavenCli.execute (MavenCli.java:956)
    at org.apache.maven.cli.MavenCli.doMain (MavenCli.java:288)
    at org.apache.maven.cli.MavenCli.main (MavenCli.java:192)
    at sun.reflect.NativeMethodAccessorImpl.invoke0 (Native Method)
    at sun.reflect.NativeMethodAccessorImpl.invoke (NativeMethodAccessorImpl.java:62)
    at sun.reflect.DelegatingMethodAccessorImpl.invoke (DelegatingMethodAccessorImpl.java:43)
    at java.lang.reflect.Method.invoke (Method.java:498)
    at org.codehaus.plexus.classworlds.launcher.Launcher.launchEnhanced (Launcher.java:289)
    at org.codehaus.plexus.classworlds.launcher.Launcher.launch (Launcher.java:229)
    at org.codehaus.plexus.classworlds.launcher.Launcher.mainWithExitCode (Launcher.java:415)
    at org.codehaus.plexus.classworlds.launcher.Launcher.main (Launcher.java:356)
[ERROR] 
[ERROR] Re-run Maven using the -X switch to enable full debug logging.
[ERROR] 
[ERROR] For more information about the errors and possible solutions, please read the following
articles:
[ERROR] [Help 1] http://cwiki.apache.org/confluence/display/MAVEN/MojoFailureException
Picked up JAVA_TOOL_OPTIONS: -Dmaven.ext.class.path="f:\jenkins\jenkins-slave\workspace\ven-scm-publish-plugin_stabilize@3@tmp\withMaven6530aa1f\pipeline-maven-spy.jar"
-Dorg.jenkinsci.plugins.pipeline.maven.reportsFolder="f:\jenkins\jenkins-slave\workspace\ven-scm-publish-plugin_stabilize@3@tmp\withMaven6530aa1f"

[Pipeline] }
[Pipeline] // dir
[Pipeline] }
[withMaven] junitPublisher - Archive test results for Maven artifact org.apache.maven.plugins:maven-scm-publish-plugin:maven-plugin:3.1.0-SNAPSHOT
generated by maven-surefire-plugin:test (default-test): windows-jdk8-m3.6.x_build\target\surefire-reports\*.xml
Recording test results
None of the test reports contained any result
[withMaven] openTasksPublisher - Scan Tasks for Maven artifact org.apache.maven.plugins:maven-scm-publish-plugin:maven-plugin:3.1.0-SNAPSHOT
in source directory windows-jdk8-m3.6.x_build\src\main\java
[TASKS] Scanning folder 'f:\jenkins\jenkins-slave\workspace\ven-scm-publish-plugin_stabilize@3'
for files matching the pattern 'windows-jdk8-m3.6.x_build\src\main\java\**\*' - excludes:
null
[TASKS] Found 3 files to scan for tasks
[TASKS] Found 4 open tasks.
Skipping warnings blame since pipelines do not have an SCM link.%n
[TASKS] Computing warning deltas based on reference build #1
[withMaven] invokerPublisher - Archive invoker results for Maven artifact MavenArtifact{org.apache.maven.plugins:maven-scm-publish-plugin:maven-plugin:3.1.0-SNAPSHOT(version:
3.1.0-SNAPSHOT, snapshot:false) } generated by PluginInvocation{org.apache.maven.plugins:maven-invoker-plugin:3.1.0@integration-test
 integration-test}: windows-jdk8-m3.6.x_build\target\invoker-reports\*.xml
[withMaven] Publishers: Generated Artifacts Publisher: 31 ms, Junit Publisher: 22 ms, Open
Task Scanner Publisher: 89 ms, Invoker Publisher: 1476 ms
[Pipeline] // withMaven
[Pipeline] cleanWs
[WS-CLEANUP] Deleting project workspace...
[WS-CLEANUP] Deferred wipeout is used...
[WS-CLEANUP] done
[Pipeline] cleanWs
[WS-CLEANUP] Deleting project workspace...
[WS-CLEANUP] Deferred wipeout is used...
[WS-CLEANUP] done
[Pipeline] }
[Pipeline] // stage
[Pipeline] }
[Pipeline] // ws
[Pipeline] }
[Pipeline] // node
[Pipeline] }
Failed in branch windows-jdk8-m3.6.x_build
[Pipeline] // parallel
[Pipeline] stage
[Pipeline] { (Notifications)
[Pipeline] echo
Build result: FAILURE
[Pipeline] jiraIssueSelector
[Pipeline] emailext
Mime
  • Unnamed multipart/mixed (inline, None, 0 bytes)
View raw message