maven-notifications mailing list archives

Site index · List index
Message view « Date » · « Thread »
Top « Date » · « Thread »
From Apache Jenkins Server <jenk...@builds.apache.org>
Subject Build failed in Jenkins: Maven TLP » maven-wagon » master #5
Date Wed, 17 Apr 2019 12:02:13 GMT
See https://builds.apache.org/job/maven-box/job/maven-wagon/job/master/5/

Changes:

* [MNG-6573] Use Maven 3.6.0 as default
* Fix no access to currentBuild.rawBuild

1 tests failed.
FAILED:  org.apache.maven.wagon.providers.webdav.WebDavsWagonTest.windows-jdk7 / Build windows-jdk7
/ testWagonGetIfNewerToStreamIsOlder

Error Message:
File F:\jenkins\jenkins-slave\workspace\maven-box_maven-wagon_master\m\wagon-providers\wagon-webdav-jackrabbit\target\test-output\http-repository\newfolder\folder2\test-resource
unable to be deleted.

Stack Trace:
java.io.IOException: File F:\jenkins\jenkins-slave\workspace\maven-box_maven-wagon_master\m\wagon-providers\wagon-webdav-jackrabbit\target\test-output\http-repository\newfolder\folder2\test-resource
unable to be deleted.




Build log:
[...truncated 17606 lines...]
[INFO] Exclude: src/main/resources/ssh-keys/**
[INFO] Exclude: src/test/ssh-keys/**
[INFO] Exclude: .repository/**
[INFO] Exclude: out/**
[INFO] Exclude: .repository/**
[INFO] Exclude: .maven/spy.log
[INFO] Exclude: dependency-reduced-pom.xml
[INFO] Exclude: .java-version
[INFO] 19 resources included (use -debug for more details)
[INFO] Rat check: Summary over all files. Unapproved: 0, unknown: 0, generated: 0, approved:
19 licenses.
[INFO] 
[INFO] --- maven-remote-resources-plugin:1.5:process (process-resource-bundles) @ wagon-ssh
---
[INFO] 
[INFO] --- maven-resources-plugin:3.1.0:resources (default-resources) @ wagon-ssh ---
[INFO] Using 'UTF-8' encoding to copy filtered resources.
[INFO] skip non existing resourceDirectory F:\jenkins\jenkins-slave\workspace\maven-box_maven-wagon_master@2\m\wagon-providers\wagon-ssh\src\main\resources
[INFO] Copying 3 resources
[INFO] 
[INFO] --- maven-compiler-plugin:3.7.0:compile (default-compile) @ wagon-ssh ---
[INFO] Changes detected - recompiling the module!
[INFO] Compiling 7 source files to F:\jenkins\jenkins-slave\workspace\maven-box_maven-wagon_master@2\m\wagon-providers\wagon-ssh\target\classes
[INFO] 
[INFO] --- plexus-component-metadata:1.7.1:generate-metadata (generate) @ wagon-ssh ---
[INFO] Discovered 4 component descriptors(s)
[INFO] 
[INFO] --- animal-sniffer-maven-plugin:1.15:check (check-java-1.7-compat) @ wagon-ssh ---
[INFO] Checking unresolved references to org.codehaus.mojo.signature:java17:1.0
[INFO] 
[INFO] --- maven-resources-plugin:3.1.0:testResources (default-testResources) @ wagon-ssh
---
[INFO] Using 'UTF-8' encoding to copy filtered resources.
[INFO] Copying 6 resources
[INFO] Copying 3 resources
[INFO] 
[INFO] --- maven-compiler-plugin:3.7.0:testCompile (default-testCompile) @ wagon-ssh ---
[INFO] Changes detected - recompiling the module!
[INFO] Compiling 8 source files to F:\jenkins\jenkins-slave\workspace\maven-box_maven-wagon_master@2\m\wagon-providers\wagon-ssh\target\test-classes
[INFO] /F:/jenkins/jenkins-slave/workspace/maven-box_maven-wagon_master@2/m/wagon-providers/wagon-ssh/src/test/java/org/apache/maven/wagon/providers/ssh/jsch/ScpWagonWithSshPrivateKeySearchTest.java:
F:\jenkins\jenkins-slave\workspace\maven-box_maven-wagon_master@2\m\wagon-providers\wagon-ssh\src\test\java\org\apache\maven\wagon\providers\ssh\jsch\ScpWagonWithSshPrivateKeySearchTest.java
uses or overrides a deprecated API.
[INFO] /F:/jenkins/jenkins-slave/workspace/maven-box_maven-wagon_master@2/m/wagon-providers/wagon-ssh/src/test/java/org/apache/maven/wagon/providers/ssh/jsch/ScpWagonWithSshPrivateKeySearchTest.java:
Recompile with -Xlint:deprecation for details.
[INFO] 
[INFO] --- maven-surefire-plugin:2.20:test (default-test) @ wagon-ssh ---
[INFO] 
[INFO] --- maven-jar-plugin:3.1.0:jar (default-jar) @ wagon-ssh ---
[INFO] Building jar: F:\jenkins\jenkins-slave\workspace\maven-box_maven-wagon_master@2\m\wagon-providers\wagon-ssh\target\wagon-ssh-3.3.3-SNAPSHOT.jar
[INFO] 
[INFO] --- maven-site-plugin:3.7.1:attach-descriptor (attach-descriptor) @ wagon-ssh ---
[INFO] Skipping because packaging 'jar' is not pom.
[INFO] 
[INFO] --- maven-checkstyle-plugin:3.0.0:check (checkstyle-check) @ wagon-ssh ---
[INFO] There is 1 error reported by Checkstyle 6.18 with config/maven_checks.xml ruleset.
[INFO] Ignored 1 error, 0 violation remaining.
[INFO] 
[INFO] -----------< org.apache.maven.wagon:wagon-webdav-jackrabbit >-----------
[INFO] Building Apache Maven Wagon :: Providers :: WebDAV Provider 3.3.3-SNAPSHOT [17/17]
[INFO] --------------------------------[ jar ]---------------------------------
[INFO] Downloading from central: https://repo.maven.apache.org/maven2/org/apache/jackrabbit/jackrabbit-webdav/2.14.4/jackrabbit-webdav-2.14.4.pom
[INFO] Downloaded from central: https://repo.maven.apache.org/maven2/org/apache/jackrabbit/jackrabbit-webdav/2.14.4/jackrabbit-webdav-2.14.4.pom
(4.0 kB at 247 kB/s)
[INFO] Downloading from central: https://repo.maven.apache.org/maven2/org/apache/jackrabbit/jackrabbit-parent/2.14.4/jackrabbit-parent-2.14.4.pom
[INFO] Downloaded from central: https://repo.maven.apache.org/maven2/org/apache/jackrabbit/jackrabbit-parent/2.14.4/jackrabbit-parent-2.14.4.pom
(35 kB at 2.5 MB/s)
[INFO] Downloading from central: https://repo.maven.apache.org/maven2/commons-codec/commons-codec/1.10/commons-codec-1.10.pom
[INFO] Downloaded from central: https://repo.maven.apache.org/maven2/commons-codec/commons-codec/1.10/commons-codec-1.10.pom
(12 kB at 726 kB/s)
[INFO] Downloading from central: https://repo.maven.apache.org/maven2/org/apache/commons/commons-parent/35/commons-parent-35.pom
[INFO] Downloaded from central: https://repo.maven.apache.org/maven2/org/apache/commons/commons-parent/35/commons-parent-35.pom
(58 kB at 3.0 MB/s)
[INFO] Downloading from central: https://repo.maven.apache.org/maven2/it/could/webdav/0.4/webdav-0.4.pom
[INFO] Downloaded from central: https://repo.maven.apache.org/maven2/it/could/webdav/0.4/webdav-0.4.pom
(1.1 kB at 71 kB/s)
[INFO] Downloading from central: https://repo.maven.apache.org/maven2/biz/aQute/bnd/1.50.0/bnd-1.50.0.pom
[INFO] Downloaded from central: https://repo.maven.apache.org/maven2/biz/aQute/bnd/1.50.0/bnd-1.50.0.pom
(1.3 kB at 75 kB/s)
[INFO] Downloading from central: https://repo.maven.apache.org/maven2/org/apache/jackrabbit/jackrabbit-webdav/2.14.4/jackrabbit-webdav-2.14.4.jar
[INFO] Downloading from central: https://repo.maven.apache.org/maven2/commons-codec/commons-codec/1.10/commons-codec-1.10.jar
[INFO] Downloading from central: https://repo.maven.apache.org/maven2/javax/servlet/servlet-api/2.3/servlet-api-2.3.jar
[INFO] Downloading from central: https://repo.maven.apache.org/maven2/it/could/webdav/0.4/webdav-0.4.jar
[INFO] Downloading from central: https://repo.maven.apache.org/maven2/biz/aQute/bnd/1.50.0/bnd-1.50.0.jar
[INFO] Downloaded from central: https://repo.maven.apache.org/maven2/commons-codec/commons-codec/1.10/commons-codec-1.10.jar
(284 kB at 8.4 MB/s)
[INFO] Downloaded from central: https://repo.maven.apache.org/maven2/org/apache/jackrabbit/jackrabbit-webdav/2.14.4/jackrabbit-webdav-2.14.4.jar
(365 kB at 9.9 MB/s)
[INFO] Downloaded from central: https://repo.maven.apache.org/maven2/biz/aQute/bnd/1.50.0/bnd-1.50.0.jar
(828 kB at 13 MB/s)
[INFO] Downloaded from central: https://repo.maven.apache.org/maven2/javax/servlet/servlet-api/2.3/servlet-api-2.3.jar
(78 kB at 780 kB/s)
[INFO] Downloaded from central: https://repo.maven.apache.org/maven2/it/could/webdav/0.4/webdav-0.4.jar
(103 kB at 561 kB/s)
[INFO] 
[INFO] --- maven-clean-plugin:3.1.0:clean (default-clean) @ wagon-webdav-jackrabbit ---
[INFO] 
[INFO] --- maven-enforcer-plugin:1.4.1:enforce (enforce-maven-version) @ wagon-webdav-jackrabbit
---
[INFO] 
[INFO] --- maven-enforcer-plugin:1.4.1:enforce (enforce-bytecode-version) @ wagon-webdav-jackrabbit
---
[INFO] 
[INFO] --- maven-enforcer-plugin:1.4.1:enforce (ban-known-bad-maven-versions) @ wagon-webdav-jackrabbit
---
[INFO] 
[INFO] --- maven-enforcer-plugin:1.4.1:enforce (default) @ wagon-webdav-jackrabbit ---
[INFO] 
[INFO] --- apache-rat-plugin:0.12:check (rat-check) @ wagon-webdav-jackrabbit ---
[INFO] Enabled default license matchers.
[INFO] Will parse SCM ignores for exclusions...
[INFO] Finished adding exclusions from SCM ignore files.
[INFO] 61 implicit excludes (use -debug for more details).
[INFO] Exclude: .checkstyle
[INFO] Exclude: **/*.odg
[INFO] Exclude: src/test/resources/**
[INFO] Exclude: src/main/resources/default-server-root/**
[INFO] Exclude: src/main/resources/ssh-keys/**
[INFO] Exclude: src/test/ssh-keys/**
[INFO] Exclude: .repository/**
[INFO] Exclude: out/**
[INFO] Exclude: .repository/**
[INFO] Exclude: .maven/spy.log
[INFO] Exclude: dependency-reduced-pom.xml
[INFO] Exclude: .java-version
[INFO] 12 resources included (use -debug for more details)
[INFO] Rat check: Summary over all files. Unapproved: 0, unknown: 0, generated: 0, approved:
12 licenses.
[INFO] 
[INFO] --- maven-remote-resources-plugin:1.5:process (process-resource-bundles) @ wagon-webdav-jackrabbit
---
[INFO] 
[INFO] --- maven-resources-plugin:3.1.0:resources (default-resources) @ wagon-webdav-jackrabbit
---
[INFO] Using 'UTF-8' encoding to copy filtered resources.
[INFO] Copying 1 resource
[INFO] Copying 3 resources
[INFO] 
[INFO] --- maven-compiler-plugin:3.7.0:compile (default-compile) @ wagon-webdav-jackrabbit
---
[INFO] Changes detected - recompiling the module!
[INFO] Compiling 4 source files to F:\jenkins\jenkins-slave\workspace\maven-box_maven-wagon_master@2\m\wagon-providers\wagon-webdav-jackrabbit\target\classes
[INFO] /F:/jenkins/jenkins-slave/workspace/maven-box_maven-wagon_master@2/m/wagon-providers/wagon-webdav-jackrabbit/src/main/java/org/apache/maven/wagon/providers/webdav/WebDavWagon.java:
F:\jenkins\jenkins-slave\workspace\maven-box_maven-wagon_master@2\m\wagon-providers\wagon-webdav-jackrabbit\src\main\java\org\apache\maven\wagon\providers\webdav\WebDavWagon.java
uses or overrides a deprecated API.
[INFO] /F:/jenkins/jenkins-slave/workspace/maven-box_maven-wagon_master@2/m/wagon-providers/wagon-webdav-jackrabbit/src/main/java/org/apache/maven/wagon/providers/webdav/WebDavWagon.java:
Recompile with -Xlint:deprecation for details.
[INFO] 
[INFO] --- plexus-component-metadata:1.7.1:generate-metadata (generate) @ wagon-webdav-jackrabbit
---
[INFO] Discovered 1 component descriptors(s)
[INFO] 
[INFO] --- animal-sniffer-maven-plugin:1.15:check (check-java-1.7-compat) @ wagon-webdav-jackrabbit
---
[INFO] Checking unresolved references to org.codehaus.mojo.signature:java17:1.0
[INFO] 
[INFO] --- maven-resources-plugin:3.1.0:testResources (default-testResources) @ wagon-webdav-jackrabbit
---
[INFO] Using 'UTF-8' encoding to copy filtered resources.
[INFO] Copying 2 resources
[INFO] Copying 3 resources
[INFO] 
[INFO] --- maven-compiler-plugin:3.7.0:testCompile (default-testCompile) @ wagon-webdav-jackrabbit
---
[INFO] Changes detected - recompiling the module!
[INFO] Compiling 4 source files to F:\jenkins\jenkins-slave\workspace\maven-box_maven-wagon_master@2\m\wagon-providers\wagon-webdav-jackrabbit\target\test-classes
[INFO] /F:/jenkins/jenkins-slave/workspace/maven-box_maven-wagon_master@2/m/wagon-providers/wagon-webdav-jackrabbit/src/test/java/org/apache/maven/wagon/providers/webdav/HttpClientWagonTest.java:
F:\jenkins\jenkins-slave\workspace\maven-box_maven-wagon_master@2\m\wagon-providers\wagon-webdav-jackrabbit\src\test\java\org\apache\maven\wagon\providers\webdav\HttpClientWagonTest.java
uses or overrides a deprecated API.
[INFO] /F:/jenkins/jenkins-slave/workspace/maven-box_maven-wagon_master@2/m/wagon-providers/wagon-webdav-jackrabbit/src/test/java/org/apache/maven/wagon/providers/webdav/HttpClientWagonTest.java:
Recompile with -Xlint:deprecation for details.
[INFO] 
[INFO] --- maven-surefire-plugin:2.20:test (default-test) @ wagon-webdav-jackrabbit ---
[INFO] 
[INFO] -------------------------------------------------------
[INFO]  T E S T S
[INFO] -------------------------------------------------------
[INFO] Running org.apache.maven.wagon.providers.webdav.HttpClientWagonTest
[INFO] Tests run: 6, Failures: 0, Errors: 0, Skipped: 0, Time elapsed: 0.468 s - in org.apache.maven.wagon.providers.webdav.HttpClientWagonTest
[INFO] Running org.apache.maven.wagon.providers.webdav.PathNavigatorTest
[INFO] Tests run: 1, Failures: 0, Errors: 0, Skipped: 0, Time elapsed: 0 s - in org.apache.maven.wagon.providers.webdav.PathNavigatorTest
[INFO] Running org.apache.maven.wagon.providers.webdav.WebDavsWagonTest
[INFO] Tests run: 69, Failures: 0, Errors: 0, Skipped: 0, Time elapsed: 28.035 s - in org.apache.maven.wagon.providers.webdav.WebDavsWagonTest
[INFO] Running org.apache.maven.wagon.providers.webdav.WebDavWagonTest
[INFO] Tests run: 69, Failures: 0, Errors: 0, Skipped: 0, Time elapsed: 25.656 s - in org.apache.maven.wagon.providers.webdav.WebDavWagonTest
[INFO] 
[INFO] Results:
[INFO] 
[INFO] Tests run: 145, Failures: 0, Errors: 0, Skipped: 0
[INFO] 
[INFO] 
[INFO] --- maven-jar-plugin:3.1.0:jar (default-jar) @ wagon-webdav-jackrabbit ---
[INFO] Building jar: F:\jenkins\jenkins-slave\workspace\maven-box_maven-wagon_master@2\m\wagon-providers\wagon-webdav-jackrabbit\target\wagon-webdav-jackrabbit-3.3.3-SNAPSHOT.jar
[INFO] 
[INFO] --- maven-site-plugin:3.7.1:attach-descriptor (attach-descriptor) @ wagon-webdav-jackrabbit
---
[INFO] Skipping because packaging 'jar' is not pom.
[INFO] 
[INFO] --- maven-checkstyle-plugin:3.0.0:check (checkstyle-check) @ wagon-webdav-jackrabbit
---
[INFO] ------------------------------------------------------------------------
[INFO] Reactor Summary for Apache Maven Wagon 3.3.3-SNAPSHOT:
[INFO] 
[INFO] Apache Maven Wagon ................................. SUCCESS [ 40.510 s]
[INFO] Apache Maven Wagon :: API .......................... SUCCESS [  9.240 s]
[INFO] Apache Maven Wagon :: Provider Test ................ SUCCESS [  2.636 s]
[INFO] Apache Maven Wagon :: Providers .................... SUCCESS [  0.743 s]
[INFO] Apache Maven Wagon :: Providers :: File Provider ... SUCCESS [  2.384 s]
[INFO] Apache Maven Wagon :: Providers :: FTP Provider .... SUCCESS [  5.267 s]
[INFO] Apache Maven Wagon :: Providers :: HTTP Shared Library SUCCESS [  3.430 s]
[INFO] Apache Maven Wagon :: Test Compatibility Kits ...... SUCCESS [  0.585 s]
[INFO] Apache Maven Wagon :: HTTP Test Compatibility Kit .. SUCCESS [  1.839 s]
[INFO] Apache Maven Wagon :: Providers :: HTTP Provider ... SUCCESS [06:44 min]
[INFO] Apache Maven Wagon :: Providers :: Lightweight HTTP Provider SUCCESS [03:31 min]
[INFO] Apache Maven Wagon :: Providers :: SCM Provider .... SUCCESS [04:15 min]
[INFO] Apache Maven Wagon :: Providers :: SSH Common Library SUCCESS [  2.240 s]
[INFO] Apache Maven Wagon :: Providers :: SSH Common Tests  SUCCESS [  1.782 s]
[INFO] Apache Maven Wagon :: Providers :: SSH External Provider SUCCESS [  1.173 s]
[INFO] Apache Maven Wagon :: Providers :: SSH Provider .... SUCCESS [  2.631 s]
[INFO] Apache Maven Wagon :: Providers :: WebDAV Provider . SUCCESS [ 56.711 s]
[INFO] ------------------------------------------------------------------------
[INFO] BUILD SUCCESS
[INFO] ------------------------------------------------------------------------
[INFO] Total time:  16:49 min
[INFO] Finished at: 2019-04-17T12:01:43Z
[INFO] ------------------------------------------------------------------------
[WARNING] The requested profile "run-its" could not be activated because it does not exist.
[INFO] [jenkins-event-spy] Generated F:\jenkins\jenkins-slave\workspace\maven-box_maven-wagon_master@2@tmp\withMaven219d32fc\maven-spy-20190417-114453-1795902721332270667923.log
Picked up JAVA_TOOL_OPTIONS: -Dmaven.ext.class.path="f:\jenkins\jenkins-slave\workspace\maven-box_maven-wagon_master@2@tmp\withMaven219d32fc\pipeline-maven-spy.jar"
-Dorg.jenkinsci.plugins.pipeline.maven.reportsFolder="f:\jenkins\jenkins-slave\workspace\maven-box_maven-wagon_master@2@tmp\withMaven219d32fc"

[Pipeline] }
[Pipeline] // dir
[Pipeline] }
[withMaven] junitPublisher - Archive test results for Maven artifact org.apache.maven.wagon:wagon-provider-api:jar:3.3.3-SNAPSHOT
generated by maven-surefire-plugin:test (default-test): m\wagon-provider-api\target\surefire-reports\*.xml
Recording test results
[withMaven] junitPublisher - Archive test results for Maven artifact org.apache.maven.wagon:wagon-provider-test:jar:3.3.3-SNAPSHOT
generated by maven-surefire-plugin:test (default-test): m\wagon-provider-test\target\surefire-reports\*.xml
Recording test results
None of the test reports contained any result
[withMaven] junitPublisher - Archive test results for Maven artifact org.apache.maven.wagon:wagon-file:jar:3.3.3-SNAPSHOT
generated by maven-surefire-plugin:test (default-test): m\wagon-providers\wagon-file\target\surefire-reports\*.xml
Recording test results
[withMaven] junitPublisher - Archive test results for Maven artifact org.apache.maven.wagon:wagon-ftp:jar:3.3.3-SNAPSHOT
generated by maven-surefire-plugin:test (default-test): m\wagon-providers\wagon-ftp\target\surefire-reports\*.xml
Recording test results
[withMaven] junitPublisher - Archive test results for Maven artifact org.apache.maven.wagon:wagon-http-shared:jar:3.3.3-SNAPSHOT
generated by maven-surefire-plugin:test (default-test): m\wagon-providers\wagon-http-shared\target\surefire-reports\*.xml
Recording test results
[withMaven] junitPublisher - Archive test results for Maven artifact org.apache.maven.wagon:wagon-tck-http:jar:3.3.3-SNAPSHOT
generated by maven-surefire-plugin:test (default-test): m\wagon-tcks\wagon-tck-http\target\surefire-reports\*.xml
Recording test results
None of the test reports contained any result
[withMaven] junitPublisher - Archive test results for Maven artifact org.apache.maven.wagon:wagon-http:jar:3.3.3-SNAPSHOT
generated by maven-surefire-plugin:test (default-test): m\wagon-providers\wagon-http\target\surefire-reports\*.xml
Recording test results
[withMaven] junitPublisher - Archive test results for Maven artifact org.apache.maven.wagon:wagon-http-lightweight:jar:3.3.3-SNAPSHOT
generated by maven-surefire-plugin:test (default-test): m\wagon-providers\wagon-http-lightweight\target\surefire-reports\*.xml
Recording test results
[withMaven] junitPublisher - Archive test results for Maven artifact org.apache.maven.wagon:wagon-scm:jar:3.3.3-SNAPSHOT
generated by maven-surefire-plugin:test (default-test): m\wagon-providers\wagon-scm\target\surefire-reports\*.xml
Recording test results
[withMaven] junitPublisher - Archive test results for Maven artifact org.apache.maven.wagon:wagon-ssh-common:jar:3.3.3-SNAPSHOT
generated by maven-surefire-plugin:test (default-test): m\wagon-providers\wagon-ssh-common\target\surefire-reports\*.xml
Recording test results
[withMaven] junitPublisher - Archive test results for Maven artifact org.apache.maven.wagon:wagon-ssh-common-test:jar:3.3.3-SNAPSHOT
generated by maven-surefire-plugin:test (default-test): m\wagon-providers\wagon-ssh-common-test\target\surefire-reports\*.xml
Recording test results
None of the test reports contained any result
[withMaven] junitPublisher - Archive test results for Maven artifact org.apache.maven.wagon:wagon-ssh-external:jar:3.3.3-SNAPSHOT
generated by maven-surefire-plugin:test (default-test): m\wagon-providers\wagon-ssh-external\target\surefire-reports\*.xml
Recording test results
None of the test reports contained any result
[withMaven] junitPublisher - Archive test results for Maven artifact org.apache.maven.wagon:wagon-ssh:jar:3.3.3-SNAPSHOT
generated by maven-surefire-plugin:test (default-test): m\wagon-providers\wagon-ssh\target\surefire-reports\*.xml
Recording test results
None of the test reports contained any result
[withMaven] junitPublisher - Archive test results for Maven artifact org.apache.maven.wagon:wagon-webdav-jackrabbit:jar:3.3.3-SNAPSHOT
generated by maven-surefire-plugin:test (default-test): m\wagon-providers\wagon-webdav-jackrabbit\target\surefire-reports\*.xml
Recording test results
[withMaven] Publishers: Pipeline Graph Publisher: 12 ms, Invoker Publisher: 1 ms, Junit Publisher:
20359 ms, Concordion Publisher: 2 ms, Dependencies Fingerprint Publisher: 4421 ms, JGiven
Publisher: 1 ms, Jacoco Publisher: 1 ms, SpotBugs Publisher: 1 ms
[Pipeline] // withMaven
[Pipeline] cleanWs
[WS-CLEANUP] Deleting project workspace...
[WS-CLEANUP] Deferred wipeout is used...
[WS-CLEANUP] done
[Pipeline] }
[Pipeline] // stage
[Pipeline] }
[Pipeline] // node
[Pipeline] }
[Pipeline] // parallel
[Pipeline] echo
[FAILURE-003] AbortException hudson.AbortException: script returned exit code 1
[Pipeline] stage
[Pipeline] { (Notifications)
[Pipeline] echo
Build result: FAILURE
[Pipeline] jiraIssueSelector
[Pipeline] jiraComment
[Pipeline] emailext
Mime
  • Unnamed multipart/mixed (inline, None, 0 bytes)
View raw message