maven-notifications mailing list archives

Site index · List index
Message view « Date » · « Thread »
Top « Date » · « Thread »
From Apache Jenkins Server <jenk...@builds.apache.org>
Subject Build failed in Jenkins: Maven TLP » maven-surefire » 1546-1222 #2
Date Tue, 02 Apr 2019 11:26:50 GMT
See https://builds.apache.org/job/maven-box/job/maven-surefire/job/1546-1222/2/

Changes:

* enabled IT for display name
* added two getters in ReportEntry for display name
* enabled IT for display name
* added two getters in ReportEntry for display name
* enabled IT for display name
* added two getters in ReportEntry for display name
* enabled IT for display name
* added two getters in ReportEntry for display name
* enabled IT for display name
* added two getters in ReportEntry for display name
* enabled IT for display name
* added two getters in ReportEntry for display name
* enabled IT for display name
* added two getters in ReportEntry for display name
* enabled IT for display name
* added two getters in ReportEntry for display name

All tests passed

Build log:
[...truncated 29200 lines...]
[Pipeline] }
[2019-04-02T11:26:28.847Z] [WS-CLEANUP] done
[Pipeline] // timestamps
[Pipeline] }
[Pipeline] }
[Pipeline] // ws
[Pipeline] // node
[Pipeline] }
[Pipeline] }
[Pipeline] // timestamps
[Pipeline] }
[Pipeline] // node
[Pipeline] }
[2019-04-02T11:26:46.347Z] [INFO] 
[2019-04-02T11:26:46.347Z] [INFO] Results:
[2019-04-02T11:26:46.347Z] [INFO] 
[2019-04-02T11:26:46.347Z] [INFO] Tests run: 2, Failures: 0, Errors: 0, Skipped: 0
[2019-04-02T11:26:46.347Z] [INFO] 
[2019-04-02T11:26:46.347Z] [INFO] 
[2019-04-02T11:26:46.347Z] [INFO] --- maven-jar-plugin:3.1.0:jar (default-jar) @ surefire-junit4
---
[2019-04-02T11:26:46.347Z] [INFO] Building jar: C:\Users\jenkins\AppData\Local\Temp\2\jenkins-maven-box-maven-surefire-1546-1222-2\surefire-providers\surefire-junit4\target\surefire-junit4-3.0.0-SNAPSHOT.jar
[2019-04-02T11:26:46.347Z] [INFO] 
[2019-04-02T11:26:46.347Z] [INFO] --- maven-site-plugin:3.7.1:attach-descriptor (attach-descriptor)
@ surefire-junit4 ---
[2019-04-02T11:26:46.347Z] [INFO] Skipping because packaging 'jar' is not pom.
[2019-04-02T11:26:46.347Z] [INFO] 
[2019-04-02T11:26:46.347Z] [INFO] --- maven-checkstyle-plugin:3.0.0:check (checkstyle-check)
@ surefire-junit4 ---
[2019-04-02T11:26:46.347Z] [INFO] 
[2019-04-02T11:26:46.347Z] [INFO] --- maven-install-plugin:2.5.2:install (default-install)
@ surefire-junit4 ---
[2019-04-02T11:26:46.347Z] [INFO] Installing C:\Users\jenkins\AppData\Local\Temp\2\jenkins-maven-box-maven-surefire-1546-1222-2\surefire-providers\surefire-junit4\target\surefire-junit4-3.0.0-SNAPSHOT.jar
to C:\Users\jenkins\AppData\Local\Temp\2\jenkins-maven-box-maven-surefire-1546-1222-2\.m2\org\apache\maven\surefire\surefire-junit4\3.0.0-SNAPSHOT\surefire-junit4-3.0.0-SNAPSHOT.jar
[2019-04-02T11:26:46.347Z] [INFO] Installing C:\Users\jenkins\AppData\Local\Temp\2\jenkins-maven-box-maven-surefire-1546-1222-2\surefire-providers\surefire-junit4\pom.xml
to C:\Users\jenkins\AppData\Local\Temp\2\jenkins-maven-box-maven-surefire-1546-1222-2\.m2\org\apache\maven\surefire\surefire-junit4\3.0.0-SNAPSHOT\surefire-junit4-3.0.0-SNAPSHOT.pom
[2019-04-02T11:26:46.348Z] [INFO] 
[2019-04-02T11:26:46.348Z] [INFO] ----------< org.apache.maven.surefire:maven-surefire-common
>-----------
[2019-04-02T11:26:46.348Z] [INFO] Building Maven Surefire Common 3.0.0-SNAPSHOT          
         [13/23]
[2019-04-02T11:26:46.348Z] [INFO] --------------------------------[ jar ]---------------------------------
[2019-04-02T11:26:46.348Z] [INFO] Downloading from central: https://repo.maven.apache.org/maven2/org/apache/maven/shared/maven-common-artifact-filters/3.1.0/maven-common-artifact-filters-3.1.0.pom
[2019-04-02T11:26:46.348Z] [INFO] Downloaded from central: https://repo.maven.apache.org/maven2/org/apache/maven/shared/maven-common-artifact-filters/3.1.0/maven-common-artifact-filters-3.1.0.pom
(5.3 kB at 165 kB/s)
[2019-04-02T11:26:46.348Z] [INFO] Downloading from central: https://repo.maven.apache.org/maven2/org/apache/maven/shared/maven-shared-components/33/maven-shared-components-33.pom
[2019-04-02T11:26:46.348Z] [INFO] Downloaded from central: https://repo.maven.apache.org/maven2/org/apache/maven/shared/maven-shared-components/33/maven-shared-components-33.pom
(5.1 kB at 159 kB/s)
[2019-04-02T11:26:46.348Z] [INFO] Downloading from central: https://repo.maven.apache.org/maven2/org/apache/maven/shared/maven-artifact-transfer/0.11.0/maven-artifact-transfer-0.11.0.pom
[2019-04-02T11:26:46.348Z] [INFO] Downloaded from central: https://repo.maven.apache.org/maven2/org/apache/maven/shared/maven-artifact-transfer/0.11.0/maven-artifact-transfer-0.11.0.pom
(11 kB at 369 kB/s)
[2019-04-02T11:26:46.348Z] [INFO] Downloading from central: https://repo.maven.apache.org/maven2/org/codehaus/plexus/plexus-java/1.0.3/plexus-java-1.0.3.pom
[2019-04-02T11:26:46.348Z] [INFO] Downloaded from central: https://repo.maven.apache.org/maven2/org/codehaus/plexus/plexus-java/1.0.3/plexus-java-1.0.3.pom
(4.8 kB at 154 kB/s)
[2019-04-02T11:26:46.348Z] [INFO] Downloading from central: https://repo.maven.apache.org/maven2/org/codehaus/plexus/plexus-languages/1.0.3/plexus-languages-1.0.3.pom
[2019-04-02T11:26:46.348Z] [INFO] Downloaded from central: https://repo.maven.apache.org/maven2/org/codehaus/plexus/plexus-languages/1.0.3/plexus-languages-1.0.3.pom
(4.2 kB at 136 kB/s)
[2019-04-02T11:26:46.348Z] [INFO] Downloading from central: https://repo.maven.apache.org/maven2/org/fusesource/jansi/jansi/1.13/jansi-1.13.pom
[2019-04-02T11:26:46.348Z] [INFO] Downloaded from central: https://repo.maven.apache.org/maven2/org/fusesource/jansi/jansi/1.13/jansi-1.13.pom
(3.7 kB at 232 kB/s)
[2019-04-02T11:26:46.348Z] [INFO] Downloading from central: https://repo.maven.apache.org/maven2/org/fusesource/jansi/jansi-project/1.13/jansi-project-1.13.pom
[2019-04-02T11:26:46.348Z] [INFO] Downloaded from central: https://repo.maven.apache.org/maven2/org/fusesource/jansi/jansi-project/1.13/jansi-project-1.13.pom
(12 kB at 257 kB/s)
[2019-04-02T11:26:46.348Z] [INFO] Downloading from central: https://repo.maven.apache.org/maven2/org/fusesource/fusesource-pom/1.11/fusesource-pom-1.11.pom
[2019-04-02T11:26:46.348Z] [INFO] Downloaded from central: https://repo.maven.apache.org/maven2/org/fusesource/fusesource-pom/1.11/fusesource-pom-1.11.pom
(15 kB at 911 kB/s)
[2019-04-02T11:26:46.348Z] [INFO] Downloading from central: https://repo.maven.apache.org/maven2/org/apache/maven/shared/maven-common-artifact-filters/3.1.0/maven-common-artifact-filters-3.1.0.jar
[2019-04-02T11:26:46.348Z] [INFO] Downloading from central: https://repo.maven.apache.org/maven2/org/codehaus/plexus/plexus-java/1.0.3/plexus-java-1.0.3.jar
[2019-04-02T11:26:46.348Z] [INFO] Downloading from central: https://repo.maven.apache.org/maven2/org/fusesource/jansi/jansi/1.13/jansi-1.13.jar
[2019-04-02T11:26:46.348Z] [INFO] Downloading from central: https://repo.maven.apache.org/maven2/org/apache/maven/shared/maven-artifact-transfer/0.11.0/maven-artifact-transfer-0.11.0.jar
[2019-04-02T11:26:46.348Z] [INFO] Downloaded from central: https://repo.maven.apache.org/maven2/org/codehaus/plexus/plexus-java/1.0.3/plexus-java-1.0.3.jar
(51 kB at 132 kB/s)
[2019-04-02T11:26:46.348Z] [INFO] Downloaded from central: https://repo.maven.apache.org/maven2/org/apache/maven/shared/maven-common-artifact-filters/3.1.0/maven-common-artifact-filters-3.1.0.jar
(61 kB at 122 kB/s)
[2019-04-02T11:26:46.348Z] [INFO] Downloaded from central: https://repo.maven.apache.org/maven2/org/apache/maven/shared/maven-artifact-transfer/0.11.0/maven-artifact-transfer-0.11.0.jar
(128 kB at 210 kB/s)
[2019-04-02T11:26:46.348Z] [INFO] Downloaded from central: https://repo.maven.apache.org/maven2/org/fusesource/jansi/jansi/1.13/jansi-1.13.jar
(152 kB at 159 kB/s)
[2019-04-02T11:26:46.348Z] [INFO] 
[2019-04-02T11:26:46.348Z] [INFO] --- maven-clean-plugin:3.1.0:clean (default-clean) @ maven-surefire-common
---
[2019-04-02T11:26:46.348Z] [INFO] 
[2019-04-02T11:26:46.348Z] [INFO] --- maven-enforcer-plugin:3.0.0-M2:enforce (enforce-maven-version)
@ maven-surefire-common ---
[2019-04-02T11:26:46.348Z] [INFO] Skipping Rule Enforcement.
[2019-04-02T11:26:46.348Z] [INFO] 
[2019-04-02T11:26:46.348Z] [INFO] --- maven-enforcer-plugin:3.0.0-M2:enforce (enforce-bytecode-version)
@ maven-surefire-common ---
[2019-04-02T11:26:46.348Z] [INFO] Skipping Rule Enforcement.
[2019-04-02T11:26:46.348Z] [INFO] 
[2019-04-02T11:26:46.348Z] [INFO] --- maven-enforcer-plugin:3.0.0-M2:enforce (ban-known-bad-maven-versions)
@ maven-surefire-common ---
[2019-04-02T11:26:46.348Z] [INFO] Skipping Rule Enforcement.
[2019-04-02T11:26:46.348Z] [INFO] 
[2019-04-02T11:26:46.348Z] [INFO] --- maven-enforcer-plugin:3.0.0-M2:enforce (enforce-java)
@ maven-surefire-common ---
[2019-04-02T11:26:46.348Z] [INFO] Skipping Rule Enforcement.
[2019-04-02T11:26:46.348Z] [INFO] 
[2019-04-02T11:26:46.348Z] [INFO] --- maven-enforcer-plugin:3.0.0-M2:enforce (enforce-maven)
@ maven-surefire-common ---
[2019-04-02T11:26:46.348Z] [INFO] Skipping Rule Enforcement.
[2019-04-02T11:26:46.348Z] [INFO] 
[2019-04-02T11:26:46.348Z] [INFO] --- apache-rat-plugin:0.12:check (rat-check) @ maven-surefire-common
---
[2019-04-02T11:26:46.348Z] [INFO] Enabled default license matchers.
[2019-04-02T11:26:46.348Z] [INFO] Will parse SCM ignores for exclusions...
[2019-04-02T11:26:46.348Z] [INFO] Finished adding exclusions from SCM ignore files.
[2019-04-02T11:26:46.348Z] [INFO] 61 implicit excludes (use -debug for more details).
[2019-04-02T11:26:46.348Z] [INFO] Exclude: .repository/**
[2019-04-02T11:26:46.348Z] [INFO] Exclude: .maven/spy.log
[2019-04-02T11:26:46.348Z] [INFO] Exclude: dependency-reduced-pom.xml
[2019-04-02T11:26:46.348Z] [INFO] Exclude: .java-version
[2019-04-02T11:26:46.348Z] [INFO] Exclude: Jenkinsfile
[2019-04-02T11:26:46.348Z] [INFO] Exclude: README.md
[2019-04-02T11:26:46.348Z] [INFO] Exclude: .gitignore
[2019-04-02T11:26:46.348Z] [INFO] Exclude: .git/**/*
[2019-04-02T11:26:46.348Z] [INFO] Exclude: **/.idea
[2019-04-02T11:26:46.348Z] [INFO] Exclude: **/.svn/**/*
[2019-04-02T11:26:46.348Z] [INFO] Exclude: **/*.iml
[2019-04-02T11:26:46.348Z] [INFO] Exclude: **/*.ipr
[2019-04-02T11:26:46.348Z] [INFO] Exclude: **/*.iws
[2019-04-02T11:26:46.348Z] [INFO] Exclude: **/*.versionsBackup
[2019-04-02T11:26:46.348Z] [INFO] Exclude: **/dependency-reduced-pom.xml
[2019-04-02T11:26:46.348Z] [INFO] Exclude: .repository/**
[2019-04-02T11:26:46.348Z] [INFO] Exclude: src/test/resources/**/*
[2019-04-02T11:26:46.348Z] [INFO] Exclude: src/test/resources/**/*.css
[2019-04-02T11:26:46.348Z] [INFO] Exclude: **/*.jj
[2019-04-02T11:26:46.348Z] [INFO] Exclude: src/main/resources/META-INF/services/org.apache.maven.surefire.providerapi.SurefireProvider
[2019-04-02T11:26:46.348Z] [INFO] Exclude: DEPENDENCIES
[2019-04-02T11:26:46.348Z] [INFO] Exclude: .m2/**
[2019-04-02T11:26:46.348Z] [INFO] Exclude: .m2
[2019-04-02T11:26:46.348Z] [INFO] Exclude: .travis.yml
[2019-04-02T11:26:46.348Z] [INFO] 125 resources included (use -debug for more details)
[2019-04-02T11:26:46.348Z] [INFO] Rat check: Summary over all files. Unapproved: 0, unknown:
0, generated: 0, approved: 125 licenses.
[2019-04-02T11:26:46.348Z] [INFO] 
[2019-04-02T11:26:46.348Z] [INFO] --- jacoco-maven-plugin:0.8.3:prepare-agent (jacoco-agent)
@ maven-surefire-common ---
[2019-04-02T11:26:46.349Z] [INFO] Skipping JaCoCo execution because property jacoco.skip is
set.
[2019-04-02T11:26:46.349Z] [INFO] jacoco.agent set to empty
[2019-04-02T11:26:46.349Z] [INFO] 
[2019-04-02T11:26:46.349Z] [INFO] --- maven-compiler-plugin:3.7.0:compile (compile-generated)
@ maven-surefire-common ---
[2019-04-02T11:26:46.349Z] [INFO] Nothing to compile - all classes are up to date
[2019-04-02T11:26:46.349Z] [INFO] 
[2019-04-02T11:26:46.349Z] [INFO] --- maven-remote-resources-plugin:1.5:process (process-resource-bundles)
@ maven-surefire-common ---
[2019-04-02T11:26:46.349Z] [INFO] 
[2019-04-02T11:26:46.349Z] [INFO] --- maven-resources-plugin:3.1.0:resources (default-resources)
@ maven-surefire-common ---
[2019-04-02T11:26:46.349Z] [INFO] Using 'UTF-8' encoding to copy filtered resources.
[2019-04-02T11:26:46.349Z] [INFO] skip non existing resourceDirectory C:\Users\jenkins\AppData\Local\Temp\2\jenkins-maven-box-maven-surefire-1546-1222-2\maven-surefire-common\src\main\resources
[2019-04-02T11:26:46.349Z] [INFO] Copying 3 resources
[2019-04-02T11:26:46.349Z] [INFO] 
[2019-04-02T11:26:46.349Z] [INFO] --- maven-compiler-plugin:3.7.0:compile (default-compile)
@ maven-surefire-common ---
[2019-04-02T11:26:46.349Z] [INFO] Changes detected - recompiling the module!
[2019-04-02T11:26:46.349Z] [INFO] Compiling 78 source files to C:\Users\jenkins\AppData\Local\Temp\2\jenkins-maven-box-maven-surefire-1546-1222-2\maven-surefire-common\target\classes
[2019-04-02T11:26:49.978Z] [INFO] -------------------------------------------------------------
[2019-04-02T11:26:49.978Z] [ERROR] COMPILATION ERROR : 
[2019-04-02T11:26:49.978Z] [INFO] -------------------------------------------------------------
[2019-04-02T11:26:49.978Z] [ERROR] C:\Users\jenkins\AppData\Local\Temp\2\jenkins-maven-box-maven-surefire-1546-1222-2\maven-surefire-common\src\main\java\org\apache\maven\plugin\surefire\report\WrappedReportEntry.java:[37,7]
error: WrappedReportEntry is not abstract and does not override abstract method getNameText()
in ReportEntry
[2019-04-02T11:26:49.978Z] [INFO] 1 error
[2019-04-02T11:26:49.978Z] [INFO] -------------------------------------------------------------
[2019-04-02T11:26:49.978Z] [INFO] ------------------------------------------------------------------------
[2019-04-02T11:26:49.978Z] [INFO] Reactor Summary for Apache Maven Surefire 3.0.0-SNAPSHOT:
[2019-04-02T11:26:49.978Z] [INFO] 
[2019-04-02T11:26:49.978Z] [INFO] Apache Maven Surefire .............................. SUCCESS
[01:13 min]
[2019-04-02T11:26:49.978Z] [INFO] SureFire Logger API ................................ SUCCESS
[ 14.133 s]
[2019-04-02T11:26:49.978Z] [INFO] SureFire API ....................................... SUCCESS
[ 22.078 s]
[2019-04-02T11:26:49.978Z] [INFO] SureFire Booter .................................... SUCCESS
[ 23.647 s]
[2019-04-02T11:26:49.978Z] [INFO] Maven Surefire Test-Grouping Support ............... SUCCESS
[ 12.828 s]
[2019-04-02T11:26:49.978Z] [INFO] SureFire Providers ................................. SUCCESS
[  1.536 s]
[2019-04-02T11:26:49.978Z] [INFO] Shared JUnit3 Provider Code ........................ SUCCESS
[  7.270 s]
[2019-04-02T11:26:49.978Z] [INFO] Shared Java 5 Provider Base ........................ SUCCESS
[  8.786 s]
[2019-04-02T11:26:49.978Z] [INFO] Shared JUnit4 Provider Code ........................ SUCCESS
[  9.562 s]
[2019-04-02T11:26:49.978Z] [INFO] Shared JUnit48 Provider Code ....................... SUCCESS
[ 10.972 s]
[2019-04-02T11:26:49.978Z] [INFO] SureFire JUnit Runner .............................. SUCCESS
[  7.898 s]
[2019-04-02T11:26:49.978Z] [INFO] SureFire JUnit4 Runner ............................. SUCCESS
[ 37.737 s]
[2019-04-02T11:26:49.978Z] [INFO] Maven Surefire Common .............................. FAILURE
[  6.667 s]
[2019-04-02T11:26:49.978Z] [INFO] SureFire JUnitCore Runner .......................... SKIPPED
[2019-04-02T11:26:49.978Z] [INFO] SureFire JUnit Platform Runner ..................... SKIPPED
[2019-04-02T11:26:49.978Z] [INFO] SureFire TestNG Utils .............................. SKIPPED
[2019-04-02T11:26:49.979Z] [INFO] SureFire TestNG Runner ............................. SKIPPED
[2019-04-02T11:26:49.979Z] [INFO] ShadeFire JUnit3 Provider .......................... SKIPPED
[2019-04-02T11:26:49.979Z] [INFO] Surefire Report Parser ............................. SKIPPED
[2019-04-02T11:26:49.979Z] [INFO] Maven Surefire Plugin .............................. SKIPPED
[2019-04-02T11:26:49.979Z] [INFO] Maven Failsafe Plugin .............................. SKIPPED
[2019-04-02T11:26:49.979Z] [INFO] Maven Surefire Report Plugin ....................... SKIPPED
[2019-04-02T11:26:49.979Z] [INFO] Maven Surefire Integration Tests ................... SKIPPED
[2019-04-02T11:26:49.979Z] [INFO] ------------------------------------------------------------------------
[2019-04-02T11:26:49.979Z] [INFO] BUILD FAILURE
[2019-04-02T11:26:49.979Z] [INFO] ------------------------------------------------------------------------
[2019-04-02T11:26:49.979Z] [INFO] Total time:  03:58 min
[2019-04-02T11:26:49.979Z] [INFO] Finished at: 2019-04-02T04:26:49-07:00
[2019-04-02T11:26:49.979Z] [INFO] ------------------------------------------------------------------------
[2019-04-02T11:26:49.979Z] [ERROR] Failed to execute goal org.apache.maven.plugins:maven-compiler-plugin:3.7.0:compile
(default-compile) on project maven-surefire-common: Compilation failure
[2019-04-02T11:26:49.979Z] [ERROR] C:\Users\jenkins\AppData\Local\Temp\2\jenkins-maven-box-maven-surefire-1546-1222-2\maven-surefire-common\src\main\java\org\apache\maven\plugin\surefire\report\WrappedReportEntry.java:[37,7]
error: WrappedReportEntry is not abstract and does not override abstract method getNameText()
in ReportEntry
[2019-04-02T11:26:49.979Z] [ERROR] -> [Help 1]
[2019-04-02T11:26:49.979Z] org.apache.maven.lifecycle.LifecycleExecutionException: Failed
to execute goal org.apache.maven.plugins:maven-compiler-plugin:3.7.0:compile (default-compile)
on project maven-surefire-common: Compilation failure
[2019-04-02T11:26:49.979Z] C:\Users\jenkins\AppData\Local\Temp\2\jenkins-maven-box-maven-surefire-1546-1222-2\maven-surefire-common\src\main\java\org\apache\maven\plugin\surefire\report\WrappedReportEntry.java:[37,7]
error: WrappedReportEntry is not abstract and does not override abstract method getNameText()
in ReportEntry
[2019-04-02T11:26:49.979Z] 
[2019-04-02T11:26:49.979Z]     at org.apache.maven.lifecycle.internal.MojoExecutor.execute
(MojoExecutor.java:215)
[2019-04-02T11:26:49.979Z]     at org.apache.maven.lifecycle.internal.MojoExecutor.execute
(MojoExecutor.java:156)
[2019-04-02T11:26:49.979Z]     at org.apache.maven.lifecycle.internal.MojoExecutor.execute
(MojoExecutor.java:148)
[2019-04-02T11:26:49.979Z]     at org.apache.maven.lifecycle.internal.LifecycleModuleBuilder.buildProject
(LifecycleModuleBuilder.java:117)
[2019-04-02T11:26:49.979Z]     at org.apache.maven.lifecycle.internal.LifecycleModuleBuilder.buildProject
(LifecycleModuleBuilder.java:81)
[2019-04-02T11:26:49.979Z]     at org.apache.maven.lifecycle.internal.builder.singlethreaded.SingleThreadedBuilder.build
(SingleThreadedBuilder.java:56)
[2019-04-02T11:26:49.979Z]     at org.apache.maven.lifecycle.internal.LifecycleStarter.execute
(LifecycleStarter.java:128)
[2019-04-02T11:26:49.979Z]     at org.apache.maven.DefaultMaven.doExecute (DefaultMaven.java:305)
[2019-04-02T11:26:49.979Z]     at org.apache.maven.DefaultMaven.doExecute (DefaultMaven.java:192)
[2019-04-02T11:26:49.979Z]     at org.apache.maven.DefaultMaven.execute (DefaultMaven.java:105)
[2019-04-02T11:26:49.979Z]     at org.apache.maven.cli.MavenCli.execute (MavenCli.java:956)
[2019-04-02T11:26:49.979Z]     at org.apache.maven.cli.MavenCli.doMain (MavenCli.java:288)
[2019-04-02T11:26:49.979Z]     at org.apache.maven.cli.MavenCli.main (MavenCli.java:192)
[2019-04-02T11:26:49.979Z]     at sun.reflect.NativeMethodAccessorImpl.invoke0 (Native Method)
[2019-04-02T11:26:49.979Z]     at sun.reflect.NativeMethodAccessorImpl.invoke (NativeMethodAccessorImpl.java:62)
[2019-04-02T11:26:49.979Z]     at sun.reflect.DelegatingMethodAccessorImpl.invoke (DelegatingMethodAccessorImpl.java:43)
[2019-04-02T11:26:49.979Z]     at java.lang.reflect.Method.invoke (Method.java:498)
[2019-04-02T11:26:49.979Z]     at org.codehaus.plexus.classworlds.launcher.Launcher.launchEnhanced
(Launcher.java:289)
[2019-04-02T11:26:49.979Z]     at org.codehaus.plexus.classworlds.launcher.Launcher.launch
(Launcher.java:229)
[2019-04-02T11:26:49.979Z]     at org.codehaus.plexus.classworlds.launcher.Launcher.mainWithExitCode
(Launcher.java:415)
[2019-04-02T11:26:49.979Z]     at org.codehaus.plexus.classworlds.launcher.Launcher.main (Launcher.java:356)
[2019-04-02T11:26:49.979Z] Caused by: org.apache.maven.plugin.compiler.CompilationFailureException:
Compilation failure
[2019-04-02T11:26:49.979Z] C:\Users\jenkins\AppData\Local\Temp\2\jenkins-maven-box-maven-surefire-1546-1222-2\maven-surefire-common\src\main\java\org\apache\maven\plugin\surefire\report\WrappedReportEntry.java:[37,7]
error: WrappedReportEntry is not abstract and does not override abstract method getNameText()
in ReportEntry
[2019-04-02T11:26:49.979Z] 
[2019-04-02T11:26:49.979Z]     at org.apache.maven.plugin.compiler.AbstractCompilerMojo.execute
(AbstractCompilerMojo.java:1161)
[2019-04-02T11:26:49.979Z]     at org.apache.maven.plugin.compiler.CompilerMojo.execute (CompilerMojo.java:168)
[2019-04-02T11:26:49.979Z]     at org.apache.maven.plugin.DefaultBuildPluginManager.executeMojo
(DefaultBuildPluginManager.java:137)
[2019-04-02T11:26:49.979Z]     at org.apache.maven.lifecycle.internal.MojoExecutor.execute
(MojoExecutor.java:210)
[2019-04-02T11:26:49.979Z]     at org.apache.maven.lifecycle.internal.MojoExecutor.execute
(MojoExecutor.java:156)
[2019-04-02T11:26:49.979Z]     at org.apache.maven.lifecycle.internal.MojoExecutor.execute
(MojoExecutor.java:148)
[2019-04-02T11:26:49.979Z]     at org.apache.maven.lifecycle.internal.LifecycleModuleBuilder.buildProject
(LifecycleModuleBuilder.java:117)
[2019-04-02T11:26:49.979Z]     at org.apache.maven.lifecycle.internal.LifecycleModuleBuilder.buildProject
(LifecycleModuleBuilder.java:81)
[2019-04-02T11:26:49.979Z]     at org.apache.maven.lifecycle.internal.builder.singlethreaded.SingleThreadedBuilder.build
(SingleThreadedBuilder.java:56)
[2019-04-02T11:26:49.979Z]     at org.apache.maven.lifecycle.internal.LifecycleStarter.execute
(LifecycleStarter.java:128)
[2019-04-02T11:26:49.979Z]     at org.apache.maven.DefaultMaven.doExecute (DefaultMaven.java:305)
[2019-04-02T11:26:49.979Z]     at org.apache.maven.DefaultMaven.doExecute (DefaultMaven.java:192)
[2019-04-02T11:26:49.979Z]     at org.apache.maven.DefaultMaven.execute (DefaultMaven.java:105)
[2019-04-02T11:26:49.979Z]     at org.apache.maven.cli.MavenCli.execute (MavenCli.java:956)
[2019-04-02T11:26:49.979Z]     at org.apache.maven.cli.MavenCli.doMain (MavenCli.java:288)
[2019-04-02T11:26:49.979Z]     at org.apache.maven.cli.MavenCli.main (MavenCli.java:192)
[2019-04-02T11:26:49.979Z]     at sun.reflect.NativeMethodAccessorImpl.invoke0 (Native Method)
[2019-04-02T11:26:49.979Z]     at sun.reflect.NativeMethodAccessorImpl.invoke (NativeMethodAccessorImpl.java:62)
[2019-04-02T11:26:49.979Z]     at sun.reflect.DelegatingMethodAccessorImpl.invoke (DelegatingMethodAccessorImpl.java:43)
[2019-04-02T11:26:49.979Z]     at java.lang.reflect.Method.invoke (Method.java:498)
[2019-04-02T11:26:49.979Z]     at org.codehaus.plexus.classworlds.launcher.Launcher.launchEnhanced
(Launcher.java:289)
[2019-04-02T11:26:49.979Z]     at org.codehaus.plexus.classworlds.launcher.Launcher.launch
(Launcher.java:229)
[2019-04-02T11:26:49.979Z]     at org.codehaus.plexus.classworlds.launcher.Launcher.mainWithExitCode
(Launcher.java:415)
[2019-04-02T11:26:49.979Z]     at org.codehaus.plexus.classworlds.launcher.Launcher.main (Launcher.java:356)
[2019-04-02T11:26:49.979Z] [ERROR] 
[2019-04-02T11:26:49.979Z] [ERROR] Re-run Maven using the -X switch to enable full debug logging.
[2019-04-02T11:26:49.979Z] [ERROR] 
[2019-04-02T11:26:49.980Z] [ERROR] For more information about the errors and possible solutions,
please read the following articles:
[2019-04-02T11:26:49.980Z] [ERROR] [Help 1] http://cwiki.apache.org/confluence/display/MAVEN/MojoFailureException
[2019-04-02T11:26:49.980Z] [ERROR] 
[2019-04-02T11:26:49.980Z] [ERROR] After correcting the problems, you can resume the build
with the command
[2019-04-02T11:26:49.980Z] [ERROR]   mvn <goals> -rf :maven-surefire-common
[Pipeline] }
[Pipeline] // withEnv
[Pipeline] }
[Pipeline] // stage
[Pipeline] fileExists
[Pipeline] fileExists
[Pipeline] archiveArtifacts
[2019-04-02T11:26:50.190Z] Archiving artifacts
[Pipeline] cleanWs
[2019-04-02T11:26:50.264Z] [WS-CLEANUP] Deleting project workspace...
[2019-04-02T11:26:50.264Z] [WS-CLEANUP] Deferred wipeout is used...
[2019-04-02T11:26:50.322Z] [WS-CLEANUP] done
[Pipeline] }
[Pipeline] // ws
[Pipeline] }
[Pipeline] // timestamps
[Pipeline] }
[Pipeline] // node
[Pipeline] }
[Pipeline] // parallel
[Pipeline] echo
Build result: FAILURE
[Pipeline] jiraIssueSelector
[Pipeline] emailext
Mime
  • Unnamed multipart/mixed (inline, None, 0 bytes)
View raw message