maven-notifications mailing list archives

Site index · List index
Message view « Date » · « Thread »
Top « Date » · « Thread »
From Apache Jenkins Server <jenk...@builds.apache.org>
Subject Build failed in Jenkins: Maven TLP » maven-gpg-plugin » MGPG-69 #15
Date Thu, 04 Apr 2019 17:45:44 GMT
See https://builds.apache.org/job/maven-box/job/maven-gpg-plugin/job/MGPG-69/15/

Changes:

* rewrite groovy statement

No tests ran.

Build log:
[...truncated 1858 lines...]
[INFO] 
[INFO] --- maven-checkstyle-plugin:3.0.0:check (checkstyle-check) @ maven-gpg-plugin ---
[INFO] There is 1 error reported by Checkstyle 6.18 with config/maven_checks.xml ruleset.
[INFO] Ignored 1 error, 0 violation remaining.
[INFO] 
[INFO] --- maven-invoker-plugin:3.1.0:verify (integration-test) @ maven-gpg-plugin ---
[INFO] -------------------------------------------------
[INFO] Build Summary:
[INFO]   Passed: 9, Failed: 0, Errors: 0, Skipped: 0
[INFO] -------------------------------------------------
[INFO] ------------------------------------------------------------------------
[INFO] BUILD SUCCESS
[INFO] ------------------------------------------------------------------------
[INFO] Total time: 46.779 s
[INFO] Finished at: 2019-04-04T17:45:20Z
[INFO] ------------------------------------------------------------------------
[INFO] [jenkins-event-spy] Generated /home/jenkins/jenkins-slave/workspace/ven-box_maven-gpg-plugin_MGPG-69@2@tmp/withMaven7db1694f/maven-spy-20190404-174433-1379438688509626839392.log
Checking out Revision 0fc77252cfce691a188577f160359c0d3a4f88d8 (MGPG-69)
[withMaven] openTasksPublisher - Scan Tasks for Maven artifact org.apache.maven.plugins:maven-gpg-plugin:maven-plugin:1.7-SNAPSHOT
in source directory linux-jdk7-m3.5.x_build/src/main/java
[TASKS] Scanning folder '/home/jenkins/jenkins-slave/workspace/ven-box_maven-gpg-plugin_MGPG-69@2'
for files matching the pattern 'linux-jdk7-m3.5.x_build/src/main/java/**/*' - excludes: null
[TASKS] Found 8 files to scan for tasks
[TASKS] Found 1 open tasks.
Skipping warnings blame since pipelines do not have an SCM link.%n
[Pipeline] }
[Pipeline] // dir
[Pipeline] }
Commit message: "Log execution"
Cleaning workspace
 > git config core.sparsecheckout # timeout=10
 > git checkout -f 0fc77252cfce691a188577f160359c0d3a4f88d8
[withMaven] invokerPublisher - Archive invoker results for Maven artifact MavenArtifact{org.apache.maven.plugins:maven-gpg-plugin:maven-plugin:1.7-SNAPSHOT(version:
1.7-SNAPSHOT, snapshot:false) } generated by PluginInvocation{org.apache.maven.plugins:maven-invoker-plugin:3.1.0@integration-test
 integration-test}: linux-jdk7-m3.5.x_build/target/invoker-reports/*.xml
[Pipeline] }
[Pipeline] // dir
[Pipeline] }
[Pipeline] // stage
[Pipeline] stage
[Pipeline] { (Build linux-jdk12-m3.5.x_build)
[Pipeline] withMaven
 > git rev-parse --verify HEAD # timeout=10
Resetting working tree
 > git reset --hard # timeout=10
 > git clean -fdx # timeout=10
[withMaven] artifactsPublisher - Archive artifact linux-jdk11-m3.5.x_build/pom.xml under org/apache/maven/plugins/maven-gpg-plugin/1.7-SNAPSHOT/maven-gpg-plugin-1.7-SNAPSHOT.pom
[withMaven] Options: [org.jenkinsci.plugins.pipeline.maven.publishers.GeneratedArtifactsPublisher[disabled=false],
JunitTestsPublisher[disabled=false,healthScaleFactor=,keepLongStdio=false,ignoreAttachments=false],
org.jenkinsci.plugins.pipeline.maven.publishers.FindbugsAnalysisPublisher[disabled='false',
healthy='', unHealthy='', thresholdLimit='low'], org.jenkinsci.plugins.pipeline.maven.publishers.TasksScannerPublisher[disabled='false',
healthy='', unHealthy='', thresholdLimit='low'], org.jenkinsci.plugins.pipeline.maven.publishers.DependenciesFingerprintPublisher[disabled=false,
scopes=[compile, provided, runtime], versions={snapshot:true, release:false}], org.jenkinsci.plugins.pipeline.maven.publishers.InvokerRunsPublisher[disabled=false],
org.jenkinsci.plugins.pipeline.maven.publishers.PipelineGraphPublisher[disabled=false, scopes=[compile,
provided, runtime], versions={snapshot:true, release:false}, skipDownstreamTriggers=false,
lifecycleThreshold=deploy, ignoreUpstreamTriggers=false], org.jenkinsci.plugins.pipeline.maven.publishers.MavenLinkerPublisher2[disabled=false]]
[withMaven] Available options: 
[withMaven] using JDK installation JDK 12 (latest)
[withMaven] artifactsPublisher - Archive artifact linux-jdk11-m3.5.x_build/target/maven-gpg-plugin-1.7-SNAPSHOT.jar
under org/apache/maven/plugins/maven-gpg-plugin/1.7-SNAPSHOT/maven-gpg-plugin-1.7-SNAPSHOT.jar
[Fast Archiver] No prior successful build to compare, so performing full copy of artifacts
[withMaven] using Maven installation 'Maven 3.5.4'
[withMaven] junitPublisher - Archive test results for Maven artifact org.apache.maven.plugins:maven-gpg-plugin:maven-plugin:1.7-SNAPSHOT
generated by maven-surefire-plugin:test (default-test): linux-jdk11-m3.5.x_build/target/surefire-reports/*.xml
Recording test results
None of the test reports contained any result
[Pipeline] {
[Pipeline] dir
Running in /home/jenkins/jenkins-slave/workspace/ven-box_maven-gpg-plugin_MGPG-69@3@2/linux-jdk12-m3.5.x_build
[Pipeline] {
[Pipeline] isUnix
[Pipeline] sh
[withMaven] openTasksPublisher - Scan Tasks for Maven artifact org.apache.maven.plugins:maven-gpg-plugin:maven-plugin:1.7-SNAPSHOT
in source directory linux-jdk11-m3.5.x_build/src/main/java
[TASKS] Scanning folder '/home/jenkins/jenkins-slave/workspace/ven-box_maven-gpg-plugin_MGPG-69@2'
for files matching the pattern 'linux-jdk11-m3.5.x_build/src/main/java/**/*' - excludes: null
[TASKS] Found 8 files to scan for tasks
[TASKS] Found 1 open tasks.
Skipping warnings blame since pipelines do not have an SCM link.%n
[withMaven] invokerPublisher - Archive invoker results for Maven artifact MavenArtifact{org.apache.maven.plugins:maven-gpg-plugin:maven-plugin:1.7-SNAPSHOT(version:
1.7-SNAPSHOT, snapshot:false) } generated by PluginInvocation{org.apache.maven.plugins:maven-invoker-plugin:3.1.0@integration-test
 integration-test}: linux-jdk11-m3.5.x_build/target/invoker-reports/*.xml
+ mvn -P+run-its -Dmaven.test.failure.ignore=true -Dfindbugs.failOnError=false -e clean verify
----- withMaven Wrapper script -----
Picked up JAVA_TOOL_OPTIONS: -Dmaven.ext.class.path="/home/jenkins/jenkins-slave/workspace/ven-box_maven-gpg-plugin_MGPG-69@3@2@tmp/withMaven5433c32a/pipeline-maven-spy.jar"
-Dorg.jenkinsci.plugins.pipeline.maven.reportsFolder="/home/jenkins/jenkins-slave/workspace/ven-box_maven-gpg-plugin_MGPG-69@3@2@tmp/withMaven5433c32a"

Apache Maven 3.5.4 (1edded0938998edf8bf061f1ceb3cfdeccf443fe; 2018-06-17T18:33:14Z)
Maven home: /home/jenkins/tools/maven/apache-maven-3.5.4
Java version: 12, vendor: Oracle Corporation, runtime: /usr/local/asfpackages/java/openjdk-12-ea+33
Default locale: en_US, platform encoding: ISO-8859-1
OS name: "linux", version: "4.4.0-138-generic", arch: "amd64", family: "unix"
[INFO] [jenkins-event-spy] Generate /home/jenkins/jenkins-slave/workspace/ven-box_maven-gpg-plugin_MGPG-69@3@2@tmp/withMaven5433c32a/maven-spy-20190404-174532-10415585107782330700876.log.tmp
...
[INFO] Error stacktraces are turned on.
[INFO] Scanning for projects...
[INFO] 
[INFO] -------------< org.apache.maven.plugins:maven-gpg-plugin >--------------
[INFO] Building Apache Maven GPG Plugin 1.7-SNAPSHOT
[INFO] ----------------------------[ maven-plugin ]----------------------------
[INFO] 
[INFO] --- maven-clean-plugin:3.1.0:clean (default-clean) @ maven-gpg-plugin ---
[INFO] 
[INFO] --- maven-enforcer-plugin:1.4.1:enforce (enforce-maven-version) @ maven-gpg-plugin
---
[INFO] 
[INFO] --- maven-enforcer-plugin:1.4.1:enforce (enforce-bytecode-version) @ maven-gpg-plugin
---
[INFO] 
[INFO] --- maven-enforcer-plugin:1.4.1:enforce (ban-known-bad-maven-versions) @ maven-gpg-plugin
---
[INFO] 
[INFO] --- maven-enforcer-plugin:1.4.1:enforce (ensure-no-container-api) @ maven-gpg-plugin
---
[INFO] 
[INFO] --- apache-rat-plugin:0.12:check (rat-check) @ maven-gpg-plugin ---
[INFO] Enabled default license matchers.
[INFO] Will parse SCM ignores for exclusions...
[INFO] Parsing exclusions from /home/jenkins/jenkins-slave/workspace/ven-box_maven-gpg-plugin_MGPG-69@3@2/linux-jdk12-m3.5.x_build/.gitignore
[INFO] Finished adding exclusions from SCM ignore files.
[INFO] 72 implicit excludes (use -debug for more details).
[INFO] Exclude: src/test/resources/gnupg/*
[INFO] Exclude: .repository/**
[INFO] Exclude: .maven/spy.log
[INFO] Exclude: dependency-reduced-pom.xml
[INFO] Exclude: .java-version
[INFO] 69 resources included (use -debug for more details)
[INFO] Rat check: Summary over all files. Unapproved: 0, unknown: 0, generated: 0, approved:
57 licenses.
[INFO] 
[INFO] --- maven-plugin-plugin:3.5.2:helpmojo (generate-helpmojo) @ maven-gpg-plugin ---
[withMaven] Publishers: Generated Artifacts Publisher: 1393 ms, Junit Publisher: 163 ms, Open
Task Scanner Publisher: 502 ms, Invoker Publisher: 9390 ms, Pipeline Graph Publisher: 1 ms
[Pipeline] // withMaven
[Pipeline] cleanWs
[INFO] Using 'UTF-8' encoding to read mojo source files.
[INFO] java-javadoc mojo extractor found 0 mojo descriptor.
[INFO] java-annotations mojo extractor found 0 mojo descriptor.
[INFO] 
[INFO] --- maven-remote-resources-plugin:1.5:process (process-resource-bundles) @ maven-gpg-plugin
---
[WS-CLEANUP] Deleting project workspace...
[WS-CLEANUP] Deferred wipeout is used...
[WS-CLEANUP] done
[Pipeline] }
[Pipeline] // stage
[Pipeline] }
[Pipeline] // ws
[Pipeline] }
[Pipeline] // node
[Pipeline] }
[INFO] 
[INFO] --- maven-resources-plugin:3.1.0:resources (default-resources) @ maven-gpg-plugin ---
[INFO] Using 'UTF-8' encoding to copy filtered resources.
[INFO] Copying 1 resource
[INFO] Copying 3 resources
[INFO] 
[INFO] --- maven-compiler-plugin:3.7.0:compile (default-compile) @ maven-gpg-plugin ---
[withMaven] Publishers: Generated Artifacts Publisher: 948 ms, Junit Publisher: 164 ms, Open
Task Scanner Publisher: 494 ms, Invoker Publisher: 7494 ms, Pipeline Graph Publisher: 1 ms
[INFO] Changes detected - recompiling the module!
[INFO] Compiling 9 source files to /home/jenkins/jenkins-slave/workspace/ven-box_maven-gpg-plugin_MGPG-69@3@2/linux-jdk12-m3.5.x_build/target/classes
[INFO] -------------------------------------------------------------
[ERROR] COMPILATION ERROR : 
[INFO] -------------------------------------------------------------
[ERROR] Source option 6 is no longer supported. Use 7 or later.
[ERROR] Target option 6 is no longer supported. Use 7 or later.
[INFO] 2 errors 
[INFO] -------------------------------------------------------------
[INFO] ------------------------------------------------------------------------
[INFO] BUILD FAILURE
[INFO] ------------------------------------------------------------------------
[INFO] Total time: 5.698 s
[INFO] Finished at: 2019-04-04T17:45:38Z
[INFO] ------------------------------------------------------------------------
[Pipeline] // withMaven
[Pipeline] cleanWs
[WS-CLEANUP] Deleting project workspace...
[WS-CLEANUP] Deferred wipeout is used...
[INFO] [jenkins-event-spy] Generated /home/jenkins/jenkins-slave/workspace/ven-box_maven-gpg-plugin_MGPG-69@3@2@tmp/withMaven5433c32a/maven-spy-20190404-174532-10415585107782330700876.log
[ERROR] Failed to execute goal org.apache.maven.plugins:maven-compiler-plugin:3.7.0:compile
(default-compile) on project maven-gpg-plugin: Compilation failure: Compilation failure: 
[ERROR] Source option 6 is no longer supported. Use 7 or later.
[ERROR] Target option 6 is no longer supported. Use 7 or later.
[ERROR] -> [Help 1]
org.apache.maven.lifecycle.LifecycleExecutionException: Failed to execute goal org.apache.maven.plugins:maven-compiler-plugin:3.7.0:compile
(default-compile) on project maven-gpg-plugin: Compilation failure
    at org.apache.maven.lifecycle.internal.MojoExecutor.execute (MojoExecutor.java:213)
    at org.apache.maven.lifecycle.internal.MojoExecutor.execute (MojoExecutor.java:154)
    at org.apache.maven.lifecycle.internal.MojoExecutor.execute (MojoExecutor.java:146)
    at org.apache.maven.lifecycle.internal.LifecycleModuleBuilder.buildProject (LifecycleModuleBuilder.java:117)
    at org.apache.maven.lifecycle.internal.LifecycleModuleBuilder.buildProject (LifecycleModuleBuilder.java:81)
    at org.apache.maven.lifecycle.internal.builder.singlethreaded.SingleThreadedBuilder.build
(SingleThreadedBuilder.java:56)
    at org.apache.maven.lifecycle.internal.LifecycleStarter.execute (LifecycleStarter.java:128)
    at org.apache.maven.DefaultMaven.doExecute (DefaultMaven.java:305)
    at org.apache.maven.DefaultMaven.doExecute (DefaultMaven.java:192)
    at org.apache.maven.DefaultMaven.execute (DefaultMaven.java:105)
    at org.apache.maven.cli.MavenCli.execute (MavenCli.java:954)
    at org.apache.maven.cli.MavenCli.doMain (MavenCli.java:288)
    at org.apache.maven.cli.MavenCli.main (MavenCli.java:192)
    at jdk.internal.reflect.NativeMethodAccessorImpl.invoke0 (Native Method)
    at jdk.internal.reflect.NativeMethodAccessorImpl.invoke (NativeMethodAccessorImpl.java:62)
    at jdk.internal.reflect.DelegatingMethodAccessorImpl.invoke (DelegatingMethodAccessorImpl.java:43)
    at java.lang.reflect.Method.invoke (Method.java:567)
    at org.codehaus.plexus.classworlds.launcher.Launcher.launchEnhanced (Launcher.java:289)
    at org.codehaus.plexus.classworlds.launcher.Launcher.launch (Launcher.java:229)
    at org.codehaus.plexus.classworlds.launcher.Launcher.mainWithExitCode (Launcher.java:415)
    at org.codehaus.plexus.classworlds.launcher.Launcher.main (Launcher.java:356)
Caused by: org.apache.maven.plugin.compiler.CompilationFailureException: Compilation failure
    at org.apache.maven.plugin.compiler.AbstractCompilerMojo.execute (AbstractCompilerMojo.java:1161)
    at org.apache.maven.plugin.compiler.CompilerMojo.execute (CompilerMojo.java:168)
    at org.apache.maven.plugin.DefaultBuildPluginManager.executeMojo (DefaultBuildPluginManager.java:137)
    at org.apache.maven.lifecycle.internal.MojoExecutor.execute (MojoExecutor.java:208)
    at org.apache.maven.lifecycle.internal.MojoExecutor.execute (MojoExecutor.java:154)
    at org.apache.maven.lifecycle.internal.MojoExecutor.execute (MojoExecutor.java:146)
    at org.apache.maven.lifecycle.internal.LifecycleModuleBuilder.buildProject (LifecycleModuleBuilder.java:117)
    at org.apache.maven.lifecycle.internal.LifecycleModuleBuilder.buildProject (LifecycleModuleBuilder.java:81)
    at org.apache.maven.lifecycle.internal.builder.singlethreaded.SingleThreadedBuilder.build
(SingleThreadedBuilder.java:56)
    at org.apache.maven.lifecycle.internal.LifecycleStarter.execute (LifecycleStarter.java:128)
    at org.apache.maven.DefaultMaven.doExecute (DefaultMaven.java:305)
    at org.apache.maven.DefaultMaven.doExecute (DefaultMaven.java:192)
    at org.apache.maven.DefaultMaven.execute (DefaultMaven.java:105)
    at org.apache.maven.cli.MavenCli.execute (MavenCli.java:954)
    at org.apache.maven.cli.MavenCli.doMain (MavenCli.java:288)
    at org.apache.maven.cli.MavenCli.main (MavenCli.java:192)
    at jdk.internal.reflect.NativeMethodAccessorImpl.invoke0 (Native Method)
    at jdk.internal.reflect.NativeMethodAccessorImpl.invoke (NativeMethodAccessorImpl.java:62)
    at jdk.internal.reflect.DelegatingMethodAccessorImpl.invoke (DelegatingMethodAccessorImpl.java:43)
    at java.lang.reflect.Method.invoke (Method.java:567)
    at org.codehaus.plexus.classworlds.launcher.Launcher.launchEnhanced (Launcher.java:289)
    at org.codehaus.plexus.classworlds.launcher.Launcher.launch (Launcher.java:229)
    at org.codehaus.plexus.classworlds.launcher.Launcher.mainWithExitCode (Launcher.java:415)
    at org.codehaus.plexus.classworlds.launcher.Launcher.main (Launcher.java:356)
[ERROR] 
[ERROR] Re-run Maven using the -X switch to enable full debug logging.
[ERROR] 
[ERROR] For more information about the errors and possible solutions, please read the following
articles:
[ERROR] [Help 1] http://cwiki.apache.org/confluence/display/MAVEN/MojoFailureException
[WS-CLEANUP] done
[Pipeline] }
[Pipeline] // stage
[Pipeline] }
[Pipeline] // ws
[Pipeline] }
[Pipeline] // node
[Pipeline] }
[Pipeline] }
[Pipeline] // dir
[Pipeline] }
[Fast Archiver] No prior successful build to compare, so performing full copy of artifacts
[withMaven] openTasksPublisher - Scan Tasks for Maven artifact org.apache.maven.plugins:maven-gpg-plugin:maven-plugin:1.7-SNAPSHOT
in source directory linux-jdk12-m3.5.x_build/src/main/java
[TASKS] Scanning folder '/home/jenkins/jenkins-slave/workspace/ven-box_maven-gpg-plugin_MGPG-69@3@2'
for files matching the pattern 'linux-jdk12-m3.5.x_build/src/main/java/**/*' - excludes: null
[TASKS] Found 8 files to scan for tasks
[TASKS] Found 1 open tasks.
Skipping warnings blame since pipelines do not have an SCM link.%n
[withMaven] Publishers: Generated Artifacts Publisher: 156 ms, Open Task Scanner Publisher:
503 ms
[Pipeline] // withMaven
[Pipeline] cleanWs
[WS-CLEANUP] Deleting project workspace...
[WS-CLEANUP] Deferred wipeout is used...
[WS-CLEANUP] done
[Pipeline] cleanWs
[WS-CLEANUP] Deleting project workspace...
[WS-CLEANUP] Deferred wipeout is used...
[WS-CLEANUP] done
[Pipeline] }
[Pipeline] // stage
[Pipeline] }
[Pipeline] // ws
[Pipeline] }
[Pipeline] // node
[Pipeline] }
Failed in branch linux-jdk12-m3.5.x_build
[Pipeline] // parallel
[Pipeline] stage
[Pipeline] { (Notifications)
[Pipeline] echo
Build result: FAILURE
[Pipeline] jiraIssueSelector
[Pipeline] emailext
Mime
  • Unnamed multipart/mixed (inline, None, 0 bytes)
View raw message