maven-notifications mailing list archives

Site index · List index
Message view « Date » · « Thread »
Top « Date » · « Thread »
From Apache Jenkins Server <jenk...@builds.apache.org>
Subject Build unstable in Jenkins: Maven TLP » maven-invoker » stabilize #3
Date Sat, 06 Apr 2019 18:59:17 GMT
See https://builds.apache.org/job/maven-box/job/maven-invoker/job/stabilize/3/

Changes:

* Pass https.protocols
* Pass https.protocols
* Pass https.protocols
* Pass https.protocols

10 tests failed.
FAILED:  org.apache.maven.shared.invoker.DefaultInvokerTest.windows-jdk7 / Build windows-jdk7
/ testSpaceProperties

Error Message:
expected:<0> but was:<1>

Stack Trace:
java.lang.AssertionError: expected:<0> but was:<1>
	at org.apache.maven.shared.invoker.DefaultInvokerTest.testSpaceProperties(DefaultInvokerTest.java:213)


FAILED:  org.apache.maven.shared.invoker.DefaultInvokerTest.linux-jdk7 / Build linux-jdk7
/ testSpaceProperties

Error Message:
expected:<0> but was:<1>

Stack Trace:
java.lang.AssertionError: expected:<0> but was:<1>
	at org.apache.maven.shared.invoker.DefaultInvokerTest.testSpaceProperties(DefaultInvokerTest.java:213)


FAILED:  org.apache.maven.shared.invoker.DefaultInvokerTest.linux-jdk11 / Build linux-jdk11
/ testSpaceProperties

Error Message:
expected:<0> but was:<1>

Stack Trace:
java.lang.AssertionError: expected:<0> but was:<1>
	at org.apache.maven.shared.invoker.DefaultInvokerTest.testSpaceProperties(DefaultInvokerTest.java:213)


FAILED:  org.apache.maven.shared.invoker.DefaultInvokerTest.linux-jdk8 / Build linux-jdk8
/ testSpaceProperties

Error Message:
expected:<0> but was:<1>

Stack Trace:
java.lang.AssertionError: expected:<0> but was:<1>
	at org.apache.maven.shared.invoker.DefaultInvokerTest.testSpaceProperties(DefaultInvokerTest.java:213)


FAILED:  org.apache.maven.shared.invoker.DefaultInvokerTest.windows-jdk11 / Build windows-jdk11
/ testSpaceProperties

Error Message:
expected:<0> but was:<1>

Stack Trace:
java.lang.AssertionError: expected:<0> but was:<1>
	at org.apache.maven.shared.invoker.DefaultInvokerTest.testSpaceProperties(DefaultInvokerTest.java:213)


FAILED:  org.apache.maven.shared.invoker.DefaultInvokerTest.windows-jdk8 / Build windows-jdk8
/ testSpaceProperties

Error Message:
expected:<0> but was:<1>

Stack Trace:
java.lang.AssertionError: expected:<0> but was:<1>
	at org.apache.maven.shared.invoker.DefaultInvokerTest.testSpaceProperties(DefaultInvokerTest.java:213)


FAILED:  org.apache.maven.shared.invoker.MavenCommandLineBuilderTest.windows-jdk11 / Build
windows-jdk11 / testShouldSpecifyCustomGlobalSettingsLocationFromRequest

Error Message:
File C:\Users\jenkins\AppData\Local\Temp\2\invoker-tests\std-basedir-is-pom-file\pom.xml unable
to be deleted.

Stack Trace:
java.io.IOException: File C:\Users\jenkins\AppData\Local\Temp\2\invoker-tests\std-basedir-is-pom-file\pom.xml
unable to be deleted.
	at org.apache.maven.shared.invoker.MavenCommandLineBuilderTest.tearDown(MavenCommandLineBuilderTest.java:1216)


FAILED:  org.apache.maven.shared.invoker.MavenCommandLineBuilderTest.windows-jdk11 / Build
windows-jdk11 / testShouldSetEnvVar_M2_HOME

Error Message:
Maven executable not found at: C:\Users\jenkins\AppData\Local\Temp\2\invoker-tests\maven-home\bin\mvn.bat

Stack Trace:
org.apache.maven.shared.invoker.CommandLineConfigurationException: Maven executable not found
at: C:\Users\jenkins\AppData\Local\Temp\2\invoker-tests\maven-home\bin\mvn.bat
	at org.apache.maven.shared.invoker.MavenCommandLineBuilderTest.testShouldSetEnvVar_M2_HOME(MavenCommandLineBuilderTest.java:1142)


FAILED:  org.apache.maven.shared.invoker.MavenCommandLineBuilderTest.windows-jdk11 / Build
windows-jdk11 / testShouldSpecifyFileOptionUsingNonStandardPomFileLocation

Error Message:
File C:\Users\jenkins\AppData\Local\Temp\2\invoker-tests\custom-toolchains\toolchains.xml
unable to be deleted.

Stack Trace:
java.io.IOException: File C:\Users\jenkins\AppData\Local\Temp\2\invoker-tests\custom-toolchains\toolchains.xml
unable to be deleted.
	at org.apache.maven.shared.invoker.MavenCommandLineBuilderTest.tearDown(MavenCommandLineBuilderTest.java:1216)


FAILED:  org.apache.maven.shared.invoker.MavenCommandLineBuilderTest.windows-jdk8 / Build
windows-jdk8 / testShouldSpecifyFileOptionUsingNonStandardPomInBasedir

Error Message:
Directory C:\Users\jenkins\AppData\Local\Temp\2\invoker-tests unable to be deleted.

Stack Trace:
java.io.IOException: Directory C:\Users\jenkins\AppData\Local\Temp\2\invoker-tests unable
to be deleted.
	at org.apache.maven.shared.invoker.MavenCommandLineBuilderTest.tearDown(MavenCommandLineBuilderTest.java:1216)




Build log:
[...truncated 5565 lines...]
[INFO] Downloading from central: https://repo.maven.apache.org/maven2/org/apache/maven/doxia/doxia-decoration-model/1.4/doxia-decoration-model-1.4.jar
[INFO] Downloading from central: https://repo.maven.apache.org/maven2/org/apache/maven/doxia/doxia-logging-api/1.4/doxia-logging-api-1.4.jar
[INFO] Downloading from central: https://repo.maven.apache.org/maven2/org/apache/maven/doxia/doxia-module-xhtml/1.4/doxia-module-xhtml-1.4.jar
[INFO] Downloaded from central: https://repo.maven.apache.org/maven2/org/apache/maven/doxia/doxia-site-renderer/1.4/doxia-site-renderer-1.4.jar
(53 kB at 698 kB/s)
[INFO] Downloading from central: https://repo.maven.apache.org/maven2/org/apache/maven/doxia/doxia-integration-tools/1.6/doxia-integration-tools-1.6.jar
[INFO] Downloaded from central: https://repo.maven.apache.org/maven2/org/apache/maven/doxia/doxia-module-fml/1.4/doxia-module-fml-1.4.jar
(38 kB at 491 kB/s)
[INFO] Downloading from central: https://repo.maven.apache.org/maven2/commons-io/commons-io/1.4/commons-io-1.4.jar
[INFO] Downloaded from central: https://repo.maven.apache.org/maven2/org/apache/maven/doxia/doxia-logging-api/1.4/doxia-logging-api-1.4.jar
(11 kB at 145 kB/s)
[INFO] Downloaded from central: https://repo.maven.apache.org/maven2/org/apache/maven/doxia/doxia-decoration-model/1.4/doxia-decoration-model-1.4.jar
(61 kB at 785 kB/s)
[INFO] Downloading from central: https://repo.maven.apache.org/maven2/org/codehaus/plexus/plexus-velocity/1.1.8/plexus-velocity-1.1.8.jar
[INFO] Downloading from central: https://repo.maven.apache.org/maven2/org/codehaus/plexus/plexus-resources/1.1.0/plexus-resources-1.1.0.jar
[INFO] Downloaded from central: https://repo.maven.apache.org/maven2/org/apache/maven/doxia/doxia-module-xhtml/1.4/doxia-module-xhtml-1.4.jar
(15 kB at 185 kB/s)
[INFO] Downloading from central: https://repo.maven.apache.org/maven2/com/puppycrawl/tools/checkstyle/6.18/checkstyle-6.18.jar
[INFO] Downloaded from central: https://repo.maven.apache.org/maven2/org/apache/maven/doxia/doxia-integration-tools/1.6/doxia-integration-tools-1.6.jar
(45 kB at 496 kB/s)
[INFO] Downloading from central: https://repo.maven.apache.org/maven2/antlr/antlr/2.7.7/antlr-2.7.7.jar
[INFO] Downloaded from central: https://repo.maven.apache.org/maven2/org/codehaus/plexus/plexus-velocity/1.1.8/plexus-velocity-1.1.8.jar
(7.9 kB at 87 kB/s)
[INFO] Downloading from central: https://repo.maven.apache.org/maven2/org/antlr/antlr4-runtime/4.5.3/antlr4-runtime-4.5.3.jar
[INFO] Downloaded from central: https://repo.maven.apache.org/maven2/commons-io/commons-io/1.4/commons-io-1.4.jar
(109 kB at 1.2 MB/s)
[INFO] Downloading from central: https://repo.maven.apache.org/maven2/commons-beanutils/commons-beanutils/1.9.2/commons-beanutils-1.9.2.jar
[INFO] Downloaded from central: https://repo.maven.apache.org/maven2/org/codehaus/plexus/plexus-resources/1.1.0/plexus-resources-1.1.0.jar
(23 kB at 250 kB/s)
[INFO] Downloading from central: https://repo.maven.apache.org/maven2/commons-cli/commons-cli/1.3.1/commons-cli-1.3.1.jar
[INFO] Downloaded from central: https://repo.maven.apache.org/maven2/commons-cli/commons-cli/1.3.1/commons-cli-1.3.1.jar
(53 kB at 473 kB/s)
[INFO] Downloading from central: https://repo.maven.apache.org/maven2/com/google/guava/guava/19.0/guava-19.0.jar
[INFO] Downloaded from central: https://repo.maven.apache.org/maven2/org/antlr/antlr4-runtime/4.5.3/antlr4-runtime-4.5.3.jar
(302 kB at 2.7 MB/s)
[INFO] Downloading from central: https://repo.maven.apache.org/maven2/javax/xml/bind/jaxb-api/2.3.0/jaxb-api-2.3.0.jar
[INFO] Downloaded from central: https://repo.maven.apache.org/maven2/commons-beanutils/commons-beanutils/1.9.2/commons-beanutils-1.9.2.jar
(234 kB at 2.1 MB/s)
[INFO] Downloaded from central: https://repo.maven.apache.org/maven2/antlr/antlr/2.7.7/antlr-2.7.7.jar
(445 kB at 3.8 MB/s)
[INFO] Downloaded from central: https://repo.maven.apache.org/maven2/com/puppycrawl/tools/checkstyle/6.18/checkstyle-6.18.jar
(1.2 MB at 9.3 MB/s)
[INFO] Downloaded from central: https://repo.maven.apache.org/maven2/javax/xml/bind/jaxb-api/2.3.0/jaxb-api-2.3.0.jar
(126 kB at 959 kB/s)
[INFO] Downloaded from central: https://repo.maven.apache.org/maven2/com/google/guava/guava/19.0/guava-19.0.jar
(2.3 MB at 14 MB/s)
[INFO] ------------------------------------------------------------------------
[INFO] BUILD SUCCESS
[INFO] ------------------------------------------------------------------------
[INFO] Total time: 46.251 s
[INFO] Finished at: 2019-04-06T18:58:38Z
[INFO] ------------------------------------------------------------------------
[WARNING] The requested profile "run-its" could not be activated because it does not exist.
[INFO] [jenkins-event-spy] Generated /home/jenkins/jenkins-slave/workspace/aven-box_maven-invoker_stabilize@tmp/withMaven2ff6c71e/maven-spy-20190406-185752-10613645244795420662301.log
[Pipeline] }
[Pipeline] // dir
[Pipeline] }
[withMaven] openTasksPublisher - Scan Tasks for Maven artifact org.apache.maven.shared:maven-invoker:jar:3.0.2-SNAPSHOT
in source directory m/src/main/java
[TASKS] Scanning folder '/home/jenkins/jenkins-slave/workspace/aven-box_maven-invoker_stabilize'
for files matching the pattern 'm/src/main/java/**/*' - excludes: null
[TASKS] Found 15 files to scan for tasks
[TASKS] Found 1 open tasks.
Skipping warnings blame since pipelines do not have an SCM link.%n
[TASKS] Computing warning deltas based on reference build #2
[INFO] ------------------------------------------------------------------------
[INFO] BUILD SUCCESS
[INFO] ------------------------------------------------------------------------
[INFO] Total time: 44.996 s
[INFO] Finished at: 2019-04-06T18:58:38Z
[INFO] ------------------------------------------------------------------------
[WARNING] The requested profile "run-its" could not be activated because it does not exist.
[INFO] [jenkins-event-spy] Generated /home/jenkins/jenkins-slave/workspace/aven-box_maven-invoker_stabilize@tmp/withMavene3ba1054/maven-spy-20190406-185753-425348883457541743165.log
[withMaven] Publishers: Pipeline Graph Publisher: 1 ms, Generated Artifacts Publisher: 1157
ms, Junit Publisher: 3212 ms, Open Task Scanner Publisher: 8668 ms
[withMaven] junitPublisher - Archive test results for Maven artifact org.apache.maven.shared:maven-invoker:jar:3.0.2-SNAPSHOT
generated by maven-surefire-plugin:test (default-test): m/target/surefire-reports/*.xml
Recording test results
[Pipeline] // withMaven
[Pipeline] cleanWs
[Pipeline] }
[Pipeline] // dir
[Pipeline] }
[WS-CLEANUP] Deleting project workspace...
[WS-CLEANUP] Deferred wipeout is used...
[WS-CLEANUP] done
[Pipeline] }
[withMaven] junitPublisher - Archive test results for Maven artifact org.apache.maven.shared:maven-invoker:jar:3.0.2-SNAPSHOT
generated by maven-surefire-plugin:test (default-test): m/target/surefire-reports/*.xml
Recording test results
[withMaven] Publishers: Pipeline Graph Publisher: 1 ms, Junit Publisher: 3721 ms
[Pipeline] // stage
[Pipeline] // withMaven
[Pipeline] }
[Pipeline] cleanWs
[Pipeline] // node
[Pipeline] }
[WS-CLEANUP] Deleting project workspace...
[WS-CLEANUP] Deferred wipeout is used...
[WS-CLEANUP] done
[Pipeline] }
[Pipeline] // stage
[Pipeline] }
[Pipeline] // node
[Pipeline] }
[withMaven] Publishers: Pipeline Graph Publisher: 1 ms, Junit Publisher: 5491 ms
[Pipeline] // withMaven
[Pipeline] cleanWs
[WS-CLEANUP] Deleting project workspace...
[WS-CLEANUP] Deferred wipeout is used...
[WS-CLEANUP] done
[Pipeline] }
[Pipeline] // stage
[Pipeline] }
[Pipeline] // node
[Pipeline] }
[ERROR] Tests run: 8, Failures: 1, Errors: 0, Skipped: 0, Time elapsed: 47.219 s <<<
FAILURE! - in org.apache.maven.shared.invoker.DefaultInvokerTest
[ERROR] testSpaceProperties(org.apache.maven.shared.invoker.DefaultInvokerTest)  Time elapsed:
6.606 s  <<< FAILURE!
java.lang.AssertionError: expected:<0> but was:<1>
	at org.apache.maven.shared.invoker.DefaultInvokerTest.testSpaceProperties(DefaultInvokerTest.java:213)

[INFO] Running org.apache.maven.shared.invoker.MavenCommandLineBuilderTest
[ERROR] Tests run: 49, Failures: 0, Errors: 3, Skipped: 0, Time elapsed: 0.356 s <<<
FAILURE! - in org.apache.maven.shared.invoker.MavenCommandLineBuilderTest
[ERROR] testShouldSpecifyCustomGlobalSettingsLocationFromRequest(org.apache.maven.shared.invoker.MavenCommandLineBuilderTest)
 Time elapsed: 0.043 s  <<< ERROR!
java.io.IOException: File C:\Users\jenkins\AppData\Local\Temp\2\invoker-tests\std-basedir-is-pom-file\pom.xml
unable to be deleted.
	at org.apache.maven.shared.invoker.MavenCommandLineBuilderTest.tearDown(MavenCommandLineBuilderTest.java:1216)

[ERROR] testShouldSetEnvVar_M2_HOME(org.apache.maven.shared.invoker.MavenCommandLineBuilderTest)
 Time elapsed: 0.027 s  <<< ERROR!
org.apache.maven.shared.invoker.CommandLineConfigurationException: Maven executable not found
at: C:\Users\jenkins\AppData\Local\Temp\2\invoker-tests\maven-home\bin\mvn.bat
	at org.apache.maven.shared.invoker.MavenCommandLineBuilderTest.testShouldSetEnvVar_M2_HOME(MavenCommandLineBuilderTest.java:1142)

[ERROR] testShouldSpecifyFileOptionUsingNonStandardPomFileLocation(org.apache.maven.shared.invoker.MavenCommandLineBuilderTest)
 Time elapsed: 0.031 s  <<< ERROR!
java.io.IOException: File C:\Users\jenkins\AppData\Local\Temp\2\invoker-tests\custom-toolchains\toolchains.xml
unable to be deleted.
	at org.apache.maven.shared.invoker.MavenCommandLineBuilderTest.tearDown(MavenCommandLineBuilderTest.java:1216)

[INFO] Running org.apache.maven.shared.invoker.SystemOutHandlerTest
[INFO] Tests run: 3, Failures: 0, Errors: 0, Skipped: 0, Time elapsed: 0.033 s - in org.apache.maven.shared.invoker.SystemOutHandlerTest
[INFO] Running org.apache.maven.shared.invoker.SystemOutLoggerTest
[INFO] Tests run: 31, Failures: 0, Errors: 0, Skipped: 0, Time elapsed: 0.023 s - in org.apache.maven.shared.invoker.SystemOutLoggerTest
[INFO] 
[INFO] Results:
[INFO] 
[ERROR] Failures: 
[ERROR]   DefaultInvokerTest.testSpaceProperties:213 expected:<0> but was:<1>
[ERROR] Errors: 
[ERROR]   MavenCommandLineBuilderTest.testShouldSetEnvVar_M2_HOME:1142 ¯ CommandLineConfiguration
[ERROR]   MavenCommandLineBuilderTest.tearDown:1216 ¯ IO File C:\Users\jenkins\AppData\L...
[ERROR]   MavenCommandLineBuilderTest.tearDown:1216 ¯ IO File C:\Users\jenkins\AppData\L...
[INFO] 
[ERROR] Tests run: 91, Failures: 1, Errors: 3, Skipped: 0
[INFO] 
[ERROR] There are test failures.

Please refer to f:\jenkins\jenkins-slave\workspace\aven-box_maven-invoker_stabilize@2\m\target\surefire-reports
for the individual test results.
Please refer to dump files (if any exist) [date]-jvmRun[N].dump, [date].dumpstream and [date]-jvmRun[N].dumpstream.
[INFO] 
[INFO] --- maven-jar-plugin:3.0.2:jar (default-jar) @ maven-invoker ---
[INFO] Building jar: f:\jenkins\jenkins-slave\workspace\aven-box_maven-invoker_stabilize@2\m\target\maven-invoker-3.0.2-SNAPSHOT.jar
[INFO] 
[INFO] --- maven-site-plugin:3.7:attach-descriptor (attach-descriptor) @ maven-invoker ---
[INFO] Skipping because packaging 'jar' is not pom.
[INFO] 
[INFO] --- maven-checkstyle-plugin:3.0.0:check (checkstyle-check) @ maven-invoker ---
[INFO] Downloading from central: https://repo.maven.apache.org/maven2/antlr/antlr/2.7.7/antlr-2.7.7.pom
[INFO] Downloaded from central: https://repo.maven.apache.org/maven2/antlr/antlr/2.7.7/antlr-2.7.7.pom
(632 B at 18 kB/s)
[INFO] Downloading from central: https://repo.maven.apache.org/maven2/antlr/antlr/2.7.7/antlr-2.7.7.jar
[INFO] Downloaded from central: https://repo.maven.apache.org/maven2/antlr/antlr/2.7.7/antlr-2.7.7.jar
(445 kB at 4.5 MB/s)
[ERROR] Tests run: 8, Failures: 1, Errors: 0, Skipped: 0, Time elapsed: 50.552 s <<<
FAILURE! - in org.apache.maven.shared.invoker.DefaultInvokerTest
[ERROR] testSpaceProperties(org.apache.maven.shared.invoker.DefaultInvokerTest)  Time elapsed:
7.872 s  <<< FAILURE!
java.lang.AssertionError: expected:<0> but was:<1>
	at org.apache.maven.shared.invoker.DefaultInvokerTest.testSpaceProperties(DefaultInvokerTest.java:213)

[INFO] Running org.apache.maven.shared.invoker.MavenCommandLineBuilderTest
[ERROR] Tests run: 49, Failures: 0, Errors: 1, Skipped: 0, Time elapsed: 0.247 s <<<
FAILURE! - in org.apache.maven.shared.invoker.MavenCommandLineBuilderTest
[ERROR] testShouldSpecifyFileOptionUsingNonStandardPomInBasedir(org.apache.maven.shared.invoker.MavenCommandLineBuilderTest)
 Time elapsed: 0.016 s  <<< ERROR!
java.io.IOException: Directory C:\Users\jenkins\AppData\Local\Temp\2\invoker-tests unable
to be deleted.
	at org.apache.maven.shared.invoker.MavenCommandLineBuilderTest.tearDown(MavenCommandLineBuilderTest.java:1216)

[INFO] Running org.apache.maven.shared.invoker.SystemOutHandlerTest
[INFO] Tests run: 3, Failures: 0, Errors: 0, Skipped: 0, Time elapsed: 0.001 s - in org.apache.maven.shared.invoker.SystemOutHandlerTest
[INFO] Running org.apache.maven.shared.invoker.SystemOutLoggerTest
[INFO] Tests run: 31, Failures: 0, Errors: 0, Skipped: 0, Time elapsed: 0.022 s - in org.apache.maven.shared.invoker.SystemOutLoggerTest
[INFO] 
[INFO] Results:
[INFO] 
[ERROR] Failures: 
[ERROR]   DefaultInvokerTest.testSpaceProperties:213 expected:<0> but was:<1>
[ERROR] Errors: 
[ERROR]   MavenCommandLineBuilderTest.tearDown:1216 ¯ IO Directory C:\Users\jenkins\AppD...
[INFO] 
[ERROR] Tests run: 91, Failures: 1, Errors: 1, Skipped: 0
[INFO] 
[ERROR] There are test failures.

Please refer to f:\jenkins\jenkins-slave\workspace\aven-box_maven-invoker_stabilize\m\target\surefire-reports
for the individual test results.
Please refer to dump files (if any exist) [date]-jvmRun[N].dump, [date].dumpstream and [date]-jvmRun[N].dumpstream.
[INFO] 
[INFO] --- maven-jar-plugin:3.0.2:jar (default-jar) @ maven-invoker ---
[INFO] Building jar: f:\jenkins\jenkins-slave\workspace\aven-box_maven-invoker_stabilize\m\target\maven-invoker-3.0.2-SNAPSHOT.jar
[INFO] 
[INFO] --- maven-site-plugin:3.7:attach-descriptor (attach-descriptor) @ maven-invoker ---
[INFO] Skipping because packaging 'jar' is not pom.
[INFO] 
[INFO] --- maven-checkstyle-plugin:3.0.0:check (checkstyle-check) @ maven-invoker ---
[INFO] Downloading from central: https://repo.maven.apache.org/maven2/antlr/antlr/2.7.7/antlr-2.7.7.pom
[INFO] Downloaded from central: https://repo.maven.apache.org/maven2/antlr/antlr/2.7.7/antlr-2.7.7.pom
(632 B at 10 kB/s)
[INFO] Downloading from central: https://repo.maven.apache.org/maven2/antlr/antlr/2.7.7/antlr-2.7.7.jar
[INFO] Downloaded from central: https://repo.maven.apache.org/maven2/antlr/antlr/2.7.7/antlr-2.7.7.jar
(445 kB at 4.6 MB/s)
[INFO] ------------------------------------------------------------------------
[INFO] BUILD SUCCESS
[INFO] ------------------------------------------------------------------------
[INFO] Total time: 01:08 min
[INFO] Finished at: 2019-04-06T11:59:13-07:00
[INFO] Final Memory: 33M/117M
[INFO] ------------------------------------------------------------------------
[WARNING] The requested profile "run-its" could not be activated because it does not exist.
[INFO] [jenkins-event-spy] Generated F:\jenkins\jenkins-slave\workspace\aven-box_maven-invoker_stabilize@2@tmp\withMaven76fdec33\maven-spy-20190406-115804-7037551961637474846024.log
[Pipeline] }
[Pipeline] // dir
[Pipeline] }
[withMaven] junitPublisher - Archive test results for Maven artifact org.apache.maven.shared:maven-invoker:jar:3.0.2-SNAPSHOT
generated by maven-surefire-plugin:test (default-test): m\target\surefire-reports\*.xml
Recording test results
[withMaven] Publishers: Pipeline Graph Publisher: 1 ms, Junit Publisher: 382 ms
[Pipeline] // withMaven
[Pipeline] cleanWs
[WS-CLEANUP] Deleting project workspace...
[WS-CLEANUP] Deferred wipeout is used...
[INFO] ------------------------------------------------------------------------
[INFO] BUILD SUCCESS
[INFO] ------------------------------------------------------------------------
[INFO] Total time: 01:11 min
[INFO] Finished at: 2019-04-06T11:59:14-07:00
[INFO] Final Memory: 42M/395M
[INFO] ------------------------------------------------------------------------
[WARNING] The requested profile "run-its" could not be activated because it does not exist.
[INFO] [jenkins-event-spy] Generated F:\jenkins\jenkins-slave\workspace\aven-box_maven-invoker_stabilize@tmp\withMaven1740128f\maven-spy-20190406-115803-313387193019534502524.log
Picked up JAVA_TOOL_OPTIONS: -Dmaven.ext.class.path="f:\jenkins\jenkins-slave\workspace\aven-box_maven-invoker_stabilize@tmp\withMaven1740128f\pipeline-maven-spy.jar"
-Dorg.jenkinsci.plugins.pipeline.maven.reportsFolder="f:\jenkins\jenkins-slave\workspace\aven-box_maven-invoker_stabilize@tmp\withMaven1740128f"

[Pipeline] }
[Pipeline] // dir
[Pipeline] }
[withMaven] junitPublisher - Archive test results for Maven artifact org.apache.maven.shared:maven-invoker:jar:3.0.2-SNAPSHOT
generated by maven-surefire-plugin:test (default-test): m\target\surefire-reports\*.xml
Recording test results
ERROR: Cannot delete workspace :Unable to delete 'f:\jenkins\jenkins-slave\workspace\aven-box_maven-invoker_stabilize@2\.repository\backport-util-concurrent\backport-util-concurrent\3.1\backport-util-concurrent-3.1.jar'.
Tried 3 times (of a maximum of 3) waiting 0.1 sec between attempts.
[Pipeline] echo
Failed to clean up workspace: hudson.AbortException: Cannot delete workspace: Unable to delete
'f:\jenkins\jenkins-slave\workspace\aven-box_maven-invoker_stabilize@2\.repository\backport-util-concurrent\backport-util-concurrent\3.1\backport-util-concurrent-3.1.jar'.
Tried 3 times (of a maximum of 3) waiting 0.1 sec between attempts.
[Pipeline] }
[Pipeline] // stage
[Pipeline] }
[Pipeline] // node
[withMaven] Publishers: Junit Publisher: 352 ms
[Pipeline] }
[Pipeline] // withMaven
[Pipeline] cleanWs
[WS-CLEANUP] Deleting project workspace...
[WS-CLEANUP] Deferred wipeout is used...
ERROR: Cannot delete workspace :Unable to delete 'f:\jenkins\jenkins-slave\workspace\aven-box_maven-invoker_stabilize\.repository\backport-util-concurrent\backport-util-concurrent\3.1\backport-util-concurrent-3.1.jar'.
Tried 3 times (of a maximum of 3) waiting 0.1 sec between attempts.
[Pipeline] echo
Failed to clean up workspace: hudson.AbortException: Cannot delete workspace: Unable to delete
'f:\jenkins\jenkins-slave\workspace\aven-box_maven-invoker_stabilize\.repository\backport-util-concurrent\backport-util-concurrent\3.1\backport-util-concurrent-3.1.jar'.
Tried 3 times (of a maximum of 3) waiting 0.1 sec between attempts.
[Pipeline] }
[Pipeline] // stage
[Pipeline] }
[Pipeline] // node
[Pipeline] }
[Pipeline] // parallel
[Pipeline] stage
[Pipeline] { (Notifications)
[Pipeline] echo
Build result: UNSTABLE
[Pipeline] jiraIssueSelector
[Pipeline] emailext
Mime
  • Unnamed multipart/mixed (inline, None, 0 bytes)
View raw message