maven-notifications mailing list archives

Site index · List index
Message view « Date » · « Thread »
Top « Date » · « Thread »
From Apache Jenkins Server <jenk...@builds.apache.org>
Subject Build failed in Jenkins: Maven TLP » maven-surefire » SUREFIRE-1617 #5
Date Mon, 08 Apr 2019 16:24:33 GMT
See https://builds.apache.org/job/maven-box/job/maven-surefire/job/SUREFIRE-1617/5/

No changes.

All tests passed

Build log:
[...truncated 53404 lines...]
[2019-04-08T16:04:02.981Z] [INFO] Tests run: 2, Failures: 0, Errors: 0, Skipped: 0, Time elapsed:
22.46 s - in org.apache.maven.surefire.its.jiras.Surefire377TestNgAndJUnitTogetherIT
[2019-04-08T16:04:02.981Z] [INFO] Running org.apache.maven.surefire.its.jiras.Surefire408ManualProviderSelectionIT
[2019-04-08T16:04:15.764Z] [INFO] Tests run: 1, Failures: 0, Errors: 0, Skipped: 0, Time elapsed:
11.979 s - in org.apache.maven.surefire.its.jiras.Surefire408ManualProviderSelectionIT
[2019-04-08T16:04:15.764Z] [INFO] Running org.apache.maven.surefire.its.jiras.Surefire42NotExtendingTestCaseIT
[2019-04-08T16:04:26.205Z] [INFO] Tests run: 1, Failures: 0, Errors: 0, Skipped: 0, Time elapsed:
11.067 s - in org.apache.maven.surefire.its.jiras.Surefire42NotExtendingTestCaseIT
[2019-04-08T16:04:26.205Z] [INFO] Running org.apache.maven.surefire.its.jiras.Surefire44InnerClassTestIT
[2019-04-08T16:04:38.915Z] [INFO] Tests run: 1, Failures: 0, Errors: 0, Skipped: 0, Time elapsed:
11.366 s - in org.apache.maven.surefire.its.jiras.Surefire44InnerClassTestIT
[2019-04-08T16:04:38.915Z] [INFO] Running org.apache.maven.surefire.its.jiras.Surefire500PuzzlingErrorIT
[2019-04-08T16:04:49.397Z] [INFO] Tests run: 1, Failures: 0, Errors: 0, Skipped: 0, Time elapsed:
11.419 s - in org.apache.maven.surefire.its.jiras.Surefire500PuzzlingErrorIT
[2019-04-08T16:04:49.397Z] [INFO] Running org.apache.maven.surefire.its.jiras.Surefire510TestClassPathForkModesIT
[2019-04-08T16:05:12.800Z] [INFO] Tests run: 2, Failures: 0, Errors: 0, Skipped: 0, Time elapsed:
23.134 s - in org.apache.maven.surefire.its.jiras.Surefire510TestClassPathForkModesIT
[2019-04-08T16:05:12.800Z] [INFO] Running org.apache.maven.surefire.its.jiras.Surefire569RunTestFromDependencyJarsIT
[2019-04-08T16:05:23.421Z] [INFO] Tests run: 1, Failures: 0, Errors: 0, Skipped: 0, Time elapsed:
10.256 s - in org.apache.maven.surefire.its.jiras.Surefire569RunTestFromDependencyJarsIT
[2019-04-08T16:05:23.421Z] [INFO] Running org.apache.maven.surefire.its.jiras.Surefire570MultipleReportDirectoriesIT
[2019-04-08T16:06:23.388Z] [INFO] Tests run: 2, Failures: 0, Errors: 0, Skipped: 0, Time elapsed:
59.423 s - in org.apache.maven.surefire.its.jiras.Surefire570MultipleReportDirectoriesIT
[2019-04-08T16:06:23.388Z] [INFO] Running org.apache.maven.surefire.its.jiras.Surefire613TestCountInParallelIT
[2019-04-08T16:06:33.896Z] [INFO] Tests run: 1, Failures: 0, Errors: 0, Skipped: 0, Time elapsed:
12.591 s - in org.apache.maven.surefire.its.jiras.Surefire613TestCountInParallelIT
[2019-04-08T16:06:33.896Z] [INFO] Running org.apache.maven.surefire.its.jiras.Surefire621TestCountingJunit3InParallelIT
[2019-04-08T16:07:46.160Z] [INFO] Tests run: 5, Failures: 0, Errors: 0, Skipped: 0, Time elapsed:
63.36 s - in org.apache.maven.surefire.its.jiras.Surefire621TestCountingJunit3InParallelIT
[2019-04-08T16:07:46.160Z] [INFO] Running org.apache.maven.surefire.its.jiras.Surefire628ConsoleOutputBeforeAndAfterClassIT
[2019-04-08T16:07:49.708Z] [INFO] Tests run: 1, Failures: 0, Errors: 0, Skipped: 0, Time elapsed:
12.182 s - in org.apache.maven.surefire.its.jiras.Surefire628ConsoleOutputBeforeAndAfterClassIT
[2019-04-08T16:07:49.708Z] [INFO] Running org.apache.maven.surefire.its.jiras.Surefire634UnsettableSystemPropertiesWarningIT
[2019-04-08T16:08:07.082Z] [INFO] Tests run: 1, Failures: 0, Errors: 0, Skipped: 0, Time elapsed:
11.274 s - in org.apache.maven.surefire.its.jiras.Surefire634UnsettableSystemPropertiesWarningIT
[2019-04-08T16:08:07.082Z] [INFO] Running org.apache.maven.surefire.its.jiras.Surefire649EmptyStringSystemPropertiesIT
[2019-04-08T16:08:20.322Z] [INFO] Tests run: 2, Failures: 0, Errors: 0, Skipped: 0, Time elapsed:
19.603 s - in org.apache.maven.surefire.its.jiras.Surefire649EmptyStringSystemPropertiesIT
[2019-04-08T16:08:20.322Z] [INFO] Running org.apache.maven.surefire.its.jiras.Surefire673MockitoIT
[2019-04-08T16:08:35.740Z] [INFO] Tests run: 1, Failures: 0, Errors: 0, Skipped: 0, Time elapsed:
14.386 s - in org.apache.maven.surefire.its.jiras.Surefire673MockitoIT
[2019-04-08T16:08:35.740Z] [INFO] Running org.apache.maven.surefire.its.jiras.Surefire674BuildFailingWhenErrorsIT
[2019-04-08T16:08:46.205Z] [INFO] Tests run: 1, Failures: 0, Errors: 0, Skipped: 0, Time elapsed:
10.893 s - in org.apache.maven.surefire.its.jiras.Surefire674BuildFailingWhenErrorsIT
[2019-04-08T16:08:46.205Z] [INFO] Running org.apache.maven.surefire.its.jiras.Surefire674BuildFailingWhenFailsafeErrorsIT
[2019-04-08T16:09:06.103Z] [INFO] Tests run: 1, Failures: 0, Errors: 0, Skipped: 0, Time elapsed:
15.668 s - in org.apache.maven.surefire.its.jiras.Surefire674BuildFailingWhenFailsafeErrorsIT
[2019-04-08T16:09:06.103Z] [INFO] Running org.apache.maven.surefire.its.jiras.Surefire685CommaSeparatedIncludesIT
[2019-04-08T16:09:13.039Z] [INFO] Tests run: 1, Failures: 0, Errors: 0, Skipped: 0, Time elapsed:
11.783 s - in org.apache.maven.surefire.its.jiras.Surefire685CommaSeparatedIncludesIT
[2019-04-08T16:09:13.039Z] [INFO] Running org.apache.maven.surefire.its.jiras.Surefire697NiceSummaryIT
[2019-04-08T16:09:25.759Z] [INFO] Tests run: 1, Failures: 0, Errors: 0, Skipped: 0, Time elapsed:
11.041 s - in org.apache.maven.surefire.its.jiras.Surefire697NiceSummaryIT
[2019-04-08T16:09:25.760Z] [INFO] Running org.apache.maven.surefire.its.jiras.Surefire705ParallelForkTimeoutIT
[2019-04-08T16:09:38.469Z] [INFO] Tests run: 1, Failures: 0, Errors: 0, Skipped: 0, Time elapsed:
13.833 s - in org.apache.maven.surefire.its.jiras.Surefire705ParallelForkTimeoutIT
[2019-04-08T16:09:38.469Z] [INFO] Running org.apache.maven.surefire.its.jiras.Surefire733AllOverrridesCapturedIT
[2019-04-08T16:09:49.276Z] [INFO] Tests run: 1, Failures: 0, Errors: 0, Skipped: 0, Time elapsed:
11.304 s - in org.apache.maven.surefire.its.jiras.Surefire733AllOverrridesCapturedIT
[2019-04-08T16:09:49.276Z] [INFO] Running org.apache.maven.surefire.its.jiras.Surefire735ForkFailWithRedirectConsoleOutputIT
[2019-04-08T16:10:10.856Z] [INFO] Tests run: 2, Failures: 0, Errors: 0, Skipped: 0, Time elapsed:
20.424 s - in org.apache.maven.surefire.its.jiras.Surefire735ForkFailWithRedirectConsoleOutputIT
[2019-04-08T16:10:10.856Z] [INFO] Running org.apache.maven.surefire.its.jiras.Surefire740TruncatedCommaIT
[2019-04-08T16:10:19.990Z] [INFO] Tests run: 1, Failures: 0, Errors: 0, Skipped: 0, Time elapsed:
9.981 s - in org.apache.maven.surefire.its.jiras.Surefire740TruncatedCommaIT
[2019-04-08T16:10:19.990Z] [INFO] Running org.apache.maven.surefire.its.jiras.Surefire747MethodParallelWithSuiteCountIT
[2019-04-08T16:11:00.798Z] [INFO] Tests run: 2, Failures: 0, Errors: 0, Skipped: 0, Time elapsed:
34.019 s - in org.apache.maven.surefire.its.jiras.Surefire747MethodParallelWithSuiteCountIT
[2019-04-08T16:11:00.798Z] [INFO] Running org.apache.maven.surefire.its.jiras.Surefire772BothReportsIT
[2019-04-08T16:11:19.580Z] [INFO] Tests run: 3, Failures: 0, Errors: 0, Skipped: 0, Time elapsed:
22.9 s - in org.apache.maven.surefire.its.jiras.Surefire772BothReportsIT
[2019-04-08T16:11:19.580Z] [INFO] Running org.apache.maven.surefire.its.jiras.Surefire772NoFailsafeReportsIT
[2019-04-08T16:11:46.954Z] [INFO] Tests run: 4, Failures: 0, Errors: 0, Skipped: 0, Time elapsed:
30.218 s - in org.apache.maven.surefire.its.jiras.Surefire772NoFailsafeReportsIT
[2019-04-08T16:11:46.954Z] [INFO] Running org.apache.maven.surefire.its.jiras.Surefire772NoSurefireReportsIT
[2019-04-08T16:12:19.243Z] [INFO] Tests run: 4, Failures: 0, Errors: 0, Skipped: 0, Time elapsed:
31.093 s - in org.apache.maven.surefire.its.jiras.Surefire772NoSurefireReportsIT
[2019-04-08T16:12:19.243Z] [INFO] Running org.apache.maven.surefire.its.jiras.Surefire772SpecifiedReportsIT
[2019-04-08T16:12:42.335Z] [INFO] Tests run: 3, Failures: 0, Errors: 0, Skipped: 0, Time elapsed:
24.028 s - in org.apache.maven.surefire.its.jiras.Surefire772SpecifiedReportsIT
[2019-04-08T16:12:42.335Z] [INFO] Running org.apache.maven.surefire.its.jiras.Surefire801ForkModeNoneClassLoaderIT
[2019-04-08T16:13:00.749Z] [INFO] Tests run: 1, Failures: 0, Errors: 0, Skipped: 0, Time elapsed:
9.756 s - in org.apache.maven.surefire.its.jiras.Surefire801ForkModeNoneClassLoaderIT
[2019-04-08T16:13:00.749Z] [INFO] Running org.apache.maven.surefire.its.jiras.Surefire803MultiFailsafeExecsIT
[2019-04-08T16:13:33.558Z] [INFO] Tests run: 2, Failures: 0, Errors: 0, Skipped: 0, Time elapsed:
40.558 s - in org.apache.maven.surefire.its.jiras.Surefire803MultiFailsafeExecsIT
[2019-04-08T16:13:33.558Z] [INFO] Running org.apache.maven.surefire.its.jiras.Surefire806SpecifiedTestControlsIT
[2019-04-08T16:13:46.278Z] [WARNING] Tests run: 3, Failures: 0, Errors: 0, Skipped: 2, Time
elapsed: 11.797 s - in org.apache.maven.surefire.its.jiras.Surefire806SpecifiedTestControlsIT
[2019-04-08T16:13:46.278Z] [INFO] Running org.apache.maven.surefire.its.jiras.Surefire809GroupExpressionsIT
[2019-04-08T16:15:02.443Z] [INFO] Tests run: 6, Failures: 0, Errors: 0, Skipped: 0, Time elapsed:
71.695 s - in org.apache.maven.surefire.its.jiras.Surefire809GroupExpressionsIT
[2019-04-08T16:15:02.443Z] [INFO] Running org.apache.maven.surefire.its.jiras.Surefire812Log4JClassLoaderIT
[2019-04-08T16:15:11.026Z] [INFO] Tests run: 1, Failures: 0, Errors: 0, Skipped: 0, Time elapsed:
14.546 s - in org.apache.maven.surefire.its.jiras.Surefire812Log4JClassLoaderIT
[2019-04-08T16:15:11.026Z] [INFO] Running org.apache.maven.surefire.its.jiras.Surefire817SystemExitIT
[2019-04-08T16:15:23.709Z] [INFO] Tests run: 1, Failures: 0, Errors: 0, Skipped: 0, Time elapsed:
12.35 s - in org.apache.maven.surefire.its.jiras.Surefire817SystemExitIT
[2019-04-08T16:15:23.709Z] [INFO] Running org.apache.maven.surefire.its.jiras.Surefire818NpeIgnoresTestsIT
[2019-04-08T16:15:39.129Z] [INFO] Tests run: 1, Failures: 0, Errors: 0, Skipped: 0, Time elapsed:
14.293 s - in org.apache.maven.surefire.its.jiras.Surefire818NpeIgnoresTestsIT
[2019-04-08T16:15:39.129Z] [INFO] Running org.apache.maven.surefire.its.jiras.Surefire828EmptyGroupExprIT
[2019-04-08T16:16:32.803Z] [INFO] Tests run: 4, Failures: 0, Errors: 0, Skipped: 0, Time elapsed:
51.396 s - in org.apache.maven.surefire.its.jiras.Surefire828EmptyGroupExprIT
[2019-04-08T16:16:32.804Z] [INFO] Running org.apache.maven.surefire.its.jiras.Surefire832ProviderSelectionIT
[2019-04-08T16:16:43.303Z] [INFO] Tests run: 1, Failures: 0, Errors: 0, Skipped: 0, Time elapsed:
13.079 s - in org.apache.maven.surefire.its.jiras.Surefire832ProviderSelectionIT
[2019-04-08T16:16:43.303Z] [INFO] Running org.apache.maven.surefire.its.jiras.Surefire839TestWithoutCategoriesIT
[2019-04-08T16:17:09.176Z] [INFO] Tests run: 2, Failures: 0, Errors: 0, Skipped: 0, Time elapsed:
26.11 s - in org.apache.maven.surefire.its.jiras.Surefire839TestWithoutCategoriesIT
[2019-04-08T16:17:09.176Z] [INFO] Running org.apache.maven.surefire.its.jiras.Surefire847AdditionalFailureIT
[2019-04-08T16:17:28.062Z] [INFO] Tests run: 1, Failures: 0, Errors: 0, Skipped: 0, Time elapsed:
17.3 s - in org.apache.maven.surefire.its.jiras.Surefire847AdditionalFailureIT
[2019-04-08T16:17:28.062Z] [INFO] Running org.apache.maven.surefire.its.jiras.Surefire855AllowFailsafeUseArtifactFileIT
[2019-04-08T16:19:16.807Z] [INFO] Tests run: 4, Failures: 0, Errors: 0, Skipped: 0, Time elapsed:
105.705 s - in org.apache.maven.surefire.its.jiras.Surefire855AllowFailsafeUseArtifactFileIT
[2019-04-08T16:19:16.807Z] [INFO] Running org.apache.maven.surefire.its.jiras.Surefire901MIssingResultfileWhenNoTestsIT
[2019-04-08T16:19:24.904Z] [INFO] Tests run: 1, Failures: 0, Errors: 0, Skipped: 0, Time elapsed:
13.748 s - in org.apache.maven.surefire.its.jiras.Surefire901MIssingResultfileWhenNoTestsIT
[2019-04-08T16:19:24.904Z] [INFO] Running org.apache.maven.surefire.its.jiras.Surefire907PerThreadWithoutThreadCountIT
[2019-04-08T16:19:36.211Z] [INFO] Tests run: 1, Failures: 0, Errors: 0, Skipped: 0, Time elapsed:
10.452 s - in org.apache.maven.surefire.its.jiras.Surefire907PerThreadWithoutThreadCountIT
[2019-04-08T16:19:36.211Z] [INFO] Running org.apache.maven.surefire.its.jiras.Surefire920TestFailureIgnoreWithTimeoutIT
[2019-04-08T16:20:05.518Z] [INFO] Tests run: 2, Failures: 0, Errors: 0, Skipped: 0, Time elapsed:
27.147 s - in org.apache.maven.surefire.its.jiras.Surefire920TestFailureIgnoreWithTimeoutIT
[2019-04-08T16:20:05.518Z] [INFO] Running org.apache.maven.surefire.its.jiras.Surefire926FailureWith2ProvidersIT
[2019-04-08T16:20:21.788Z] [INFO] Tests run: 1, Failures: 0, Errors: 0, Skipped: 0, Time elapsed:
17.949 s - in org.apache.maven.surefire.its.jiras.Surefire926FailureWith2ProvidersIT
[2019-04-08T16:20:21.788Z] [INFO] Running org.apache.maven.surefire.its.jiras.Surefire930TestNgSuiteXmlIT
[2019-04-08T16:20:34.958Z] [INFO] Tests run: 1, Failures: 0, Errors: 0, Skipped: 0, Time elapsed:
14.808 s - in org.apache.maven.surefire.its.jiras.Surefire930TestNgSuiteXmlIT
[2019-04-08T16:20:34.959Z] [INFO] Running org.apache.maven.surefire.its.jiras.Surefire943ReportContentIT
[2019-04-08T16:21:32.903Z] [INFO] Tests run: 2, Failures: 0, Errors: 0, Skipped: 0, Time elapsed:
53.619 s - in org.apache.maven.surefire.its.jiras.Surefire943ReportContentIT
[2019-04-08T16:21:32.903Z] [INFO] Running org.apache.maven.surefire.its.jiras.Surefire946KillMainProcessInReusableForkIT
[2019-04-08T16:22:05.394Z] [INFO] Tests run: 3, Failures: 0, Errors: 0, Skipped: 0, Time elapsed:
35.67 s - in org.apache.maven.surefire.its.jiras.Surefire946KillMainProcessInReusableForkIT
[2019-04-08T16:22:05.394Z] [INFO] Running org.apache.maven.surefire.its.jiras.Surefire972BizarreNoClassDefIT
[2019-04-08T16:22:24.958Z] [INFO] Tests run: 1, Failures: 0, Errors: 0, Skipped: 0, Time elapsed:
17.857 s - in org.apache.maven.surefire.its.jiras.Surefire972BizarreNoClassDefIT
[2019-04-08T16:22:24.958Z] [INFO] Running org.apache.maven.surefire.its.jiras.Surefire975DefaultVMEncodingIT
[2019-04-08T16:22:35.819Z] [INFO] Tests run: 1, Failures: 0, Errors: 0, Skipped: 0, Time elapsed:
12.544 s - in org.apache.maven.surefire.its.jiras.Surefire975DefaultVMEncodingIT
[2019-04-08T16:22:35.819Z] [INFO] Running org.apache.maven.surefire.its.jiras.Surefire979WrongClassLoaderIT
[2019-04-08T16:22:48.920Z] [INFO] Tests run: 1, Failures: 0, Errors: 0, Skipped: 0, Time elapsed:
13.034 s - in org.apache.maven.surefire.its.jiras.Surefire979WrongClassLoaderIT
[2019-04-08T16:22:48.921Z] [INFO] Running org.apache.maven.surefire.its.jiras.Surefire985ParameterizedRunnerAndCategoriesIT
[2019-04-08T16:23:01.115Z] [INFO] Tests run: 1, Failures: 0, Errors: 0, Skipped: 0, Time elapsed:
10.618 s - in org.apache.maven.surefire.its.jiras.Surefire985ParameterizedRunnerAndCategoriesIT
[2019-04-08T16:23:01.115Z] [INFO] Running org.apache.maven.surefire.its.jiras.Surefire995CategoryInheritanceIT
[2019-04-08T16:24:01.035Z] [INFO] Tests run: 5, Failures: 0, Errors: 0, Skipped: 0, Time elapsed:
53.302 s - in org.apache.maven.surefire.its.jiras.Surefire995CategoryInheritanceIT
[2019-04-08T16:24:01.035Z] [INFO] 
[2019-04-08T16:24:01.035Z] [INFO] Results:
[2019-04-08T16:24:01.035Z] [INFO] 
[2019-04-08T16:24:01.035Z] [ERROR] Errors: 
[2019-04-08T16:24:01.035Z] [ERROR]   UmlautDirIT.testUmlaut:44 » SurefireVerifier Exit code
was non-zero: 1; comman...
[2019-04-08T16:24:01.035Z] [ERROR]   UmlautDirIT.testUmlautIsolatedClassLoader:55 » SurefireVerifier
Exit code was ...
[2019-04-08T16:24:01.035Z] [INFO] 
[2019-04-08T16:24:01.035Z] [ERROR] Tests run: 792, Failures: 0, Errors: 2, Skipped: 151
[2019-04-08T16:24:01.035Z] [INFO] 
[2019-04-08T16:24:01.035Z] [INFO] 
[2019-04-08T16:24:01.035Z] [INFO] --- maven-checkstyle-plugin:3.0.0:check (checkstyle-check)
@ surefire-its ---
[2019-04-08T16:24:01.035Z] [INFO] 
[2019-04-08T16:24:01.035Z] [INFO] --- maven-failsafe-plugin:3.0.0-M3:verify (default) @ surefire-its
---
[2019-04-08T16:24:01.035Z] [INFO] Failsafe report directory: C:\Users\jenkins\AppData\Local\Temp\2\jenkins-maven-box-maven-surefire-SUREFIRE-1617-5\surefire-its\target\failsafe-reports
[2019-04-08T16:24:01.035Z] [INFO] ------------------------------------------------------------------------
[2019-04-08T16:24:01.035Z] [INFO] Reactor Summary for Apache Maven Surefire 3.0.0-SNAPSHOT:
[2019-04-08T16:24:01.035Z] [INFO] 
[2019-04-08T16:24:01.035Z] [INFO] Apache Maven Surefire .............................. SUCCESS
[ 38.192 s]
[2019-04-08T16:24:01.035Z] [INFO] SureFire Logger API ................................ SUCCESS
[  9.169 s]
[2019-04-08T16:24:01.035Z] [INFO] SureFire API ....................................... SUCCESS
[ 21.482 s]
[2019-04-08T16:24:01.035Z] [INFO] SureFire Booter .................................... SUCCESS
[ 23.218 s]
[2019-04-08T16:24:01.035Z] [INFO] Maven Surefire Test-Grouping Support ............... SUCCESS
[ 11.944 s]
[2019-04-08T16:24:01.035Z] [INFO] SureFire Providers ................................. SUCCESS
[  2.472 s]
[2019-04-08T16:24:01.035Z] [INFO] Shared JUnit3 Provider Code ........................ SUCCESS
[  8.867 s]
[2019-04-08T16:24:01.035Z] [INFO] Shared Java 5 Provider Base ........................ SUCCESS
[ 10.724 s]
[2019-04-08T16:24:01.035Z] [INFO] Shared JUnit4 Provider Code ........................ SUCCESS
[ 10.085 s]
[2019-04-08T16:24:01.035Z] [INFO] Shared JUnit48 Provider Code ....................... SUCCESS
[ 11.878 s]
[2019-04-08T16:24:01.035Z] [INFO] SureFire JUnit Runner .............................. SUCCESS
[  9.824 s]
[2019-04-08T16:24:01.035Z] [INFO] SureFire JUnit4 Runner ............................. SUCCESS
[  9.817 s]
[2019-04-08T16:24:01.035Z] [INFO] Maven Surefire Common .............................. SUCCESS
[ 51.097 s]
[2019-04-08T16:24:01.035Z] [INFO] SureFire JUnitCore Runner .......................... SUCCESS
[02:28 min]
[2019-04-08T16:24:01.035Z] [INFO] SureFire JUnit Platform Runner ..................... SUCCESS
[ 18.578 s]
[2019-04-08T16:24:01.035Z] [INFO] SureFire TestNG Utils .............................. SUCCESS
[  9.663 s]
[2019-04-08T16:24:01.035Z] [INFO] SureFire TestNG Runner ............................. SUCCESS
[ 10.536 s]
[2019-04-08T16:24:01.035Z] [INFO] ShadeFire JUnit3 Provider .......................... SUCCESS
[  3.193 s]
[2019-04-08T16:24:01.035Z] [INFO] Surefire Report Parser ............................. SUCCESS
[ 12.319 s]
[2019-04-08T16:24:01.035Z] [INFO] Maven Surefire Plugin .............................. SUCCESS
[ 20.332 s]
[2019-04-08T16:24:01.035Z] [INFO] Maven Failsafe Plugin .............................. SUCCESS
[02:05 min]
[2019-04-08T16:24:01.035Z] [INFO] Maven Surefire Report Plugin ....................... SUCCESS
[ 26.149 s]
[2019-04-08T16:24:01.035Z] [INFO] Maven Surefire Integration Tests ................... FAILURE
[  02:22 h]
[2019-04-08T16:24:01.035Z] [INFO] ------------------------------------------------------------------------
[2019-04-08T16:24:01.035Z] [INFO] BUILD FAILURE
[2019-04-08T16:24:01.035Z] [INFO] ------------------------------------------------------------------------
[2019-04-08T16:24:01.035Z] [INFO] Total time:  02:31 h
[2019-04-08T16:24:01.035Z] [INFO] Finished at: 2019-04-08T16:23:53Z
[2019-04-08T16:24:01.035Z] [INFO] ------------------------------------------------------------------------
[2019-04-08T16:24:01.035Z] [ERROR] Failed to execute goal org.apache.maven.plugins:maven-failsafe-plugin:3.0.0-M3:verify
(default) on project surefire-its: There are test failures.
[2019-04-08T16:24:01.035Z] [ERROR] 
[2019-04-08T16:24:01.035Z] [ERROR] Please refer to C:\Users\jenkins\AppData\Local\Temp\2\jenkins-maven-box-maven-surefire-SUREFIRE-1617-5\surefire-its\target\failsafe-reports
for the individual test results.
[2019-04-08T16:24:01.035Z] [ERROR] Please refer to dump files (if any exist) [date].dump,
[date]-jvmRun[N].dump and [date].dumpstream.
[2019-04-08T16:24:01.035Z] [ERROR] -> [Help 1]
[2019-04-08T16:24:01.035Z] org.apache.maven.lifecycle.LifecycleExecutionException: Failed
to execute goal org.apache.maven.plugins:maven-failsafe-plugin:3.0.0-M3:verify (default) on
project surefire-its: There are test failures.
[2019-04-08T16:24:01.035Z] 
[2019-04-08T16:24:01.035Z] Please refer to C:\Users\jenkins\AppData\Local\Temp\2\jenkins-maven-box-maven-surefire-SUREFIRE-1617-5\surefire-its\target\failsafe-reports
for the individual test results.
[2019-04-08T16:24:01.035Z] Please refer to dump files (if any exist) [date].dump, [date]-jvmRun[N].dump
and [date].dumpstream.
[2019-04-08T16:24:01.035Z]     at org.apache.maven.lifecycle.internal.MojoExecutor.execute
(MojoExecutor.java:215)
[2019-04-08T16:24:01.035Z]     at org.apache.maven.lifecycle.internal.MojoExecutor.execute
(MojoExecutor.java:156)
[2019-04-08T16:24:01.035Z]     at org.apache.maven.lifecycle.internal.MojoExecutor.execute
(MojoExecutor.java:148)
[2019-04-08T16:24:01.036Z]     at org.apache.maven.lifecycle.internal.LifecycleModuleBuilder.buildProject
(LifecycleModuleBuilder.java:117)
[2019-04-08T16:24:01.036Z]     at org.apache.maven.lifecycle.internal.LifecycleModuleBuilder.buildProject
(LifecycleModuleBuilder.java:81)
[2019-04-08T16:24:01.036Z]     at org.apache.maven.lifecycle.internal.builder.singlethreaded.SingleThreadedBuilder.build
(SingleThreadedBuilder.java:56)
[2019-04-08T16:24:01.036Z]     at org.apache.maven.lifecycle.internal.LifecycleStarter.execute
(LifecycleStarter.java:128)
[2019-04-08T16:24:01.036Z]     at org.apache.maven.DefaultMaven.doExecute (DefaultMaven.java:305)
[2019-04-08T16:24:01.036Z]     at org.apache.maven.DefaultMaven.doExecute (DefaultMaven.java:192)
[2019-04-08T16:24:01.036Z]     at org.apache.maven.DefaultMaven.execute (DefaultMaven.java:105)
[2019-04-08T16:24:01.036Z]     at org.apache.maven.cli.MavenCli.execute (MavenCli.java:956)
[2019-04-08T16:24:01.036Z]     at org.apache.maven.cli.MavenCli.doMain (MavenCli.java:288)
[2019-04-08T16:24:01.036Z]     at org.apache.maven.cli.MavenCli.main (MavenCli.java:192)
[2019-04-08T16:24:01.036Z]     at sun.reflect.NativeMethodAccessorImpl.invoke0 (Native Method)
[2019-04-08T16:24:01.036Z]     at sun.reflect.NativeMethodAccessorImpl.invoke (NativeMethodAccessorImpl.java:62)
[2019-04-08T16:24:01.036Z]     at sun.reflect.DelegatingMethodAccessorImpl.invoke (DelegatingMethodAccessorImpl.java:43)
[2019-04-08T16:24:01.036Z]     at java.lang.reflect.Method.invoke (Method.java:498)
[2019-04-08T16:24:01.036Z]     at org.codehaus.plexus.classworlds.launcher.Launcher.launchEnhanced
(Launcher.java:289)
[2019-04-08T16:24:01.036Z]     at org.codehaus.plexus.classworlds.launcher.Launcher.launch
(Launcher.java:229)
[2019-04-08T16:24:01.036Z]     at org.codehaus.plexus.classworlds.launcher.Launcher.mainWithExitCode
(Launcher.java:415)
[2019-04-08T16:24:01.036Z]     at org.codehaus.plexus.classworlds.launcher.Launcher.main (Launcher.java:356)
[2019-04-08T16:24:01.036Z] Caused by: org.apache.maven.plugin.MojoFailureException: There
are test failures.
[2019-04-08T16:24:01.036Z] 
[2019-04-08T16:24:01.036Z] Please refer to C:\Users\jenkins\AppData\Local\Temp\2\jenkins-maven-box-maven-surefire-SUREFIRE-1617-5\surefire-its\target\failsafe-reports
for the individual test results.
[2019-04-08T16:24:01.036Z] Please refer to dump files (if any exist) [date].dump, [date]-jvmRun[N].dump
and [date].dumpstream.
[2019-04-08T16:24:01.036Z]     at org.apache.maven.plugin.surefire.SurefireHelper.throwException
(SurefireHelper.java:271)
[2019-04-08T16:24:01.036Z]     at org.apache.maven.plugin.surefire.SurefireHelper.reportExecution
(SurefireHelper.java:159)
[2019-04-08T16:24:01.036Z]     at org.apache.maven.plugin.failsafe.VerifyMojo.execute (VerifyMojo.java:192)
[2019-04-08T16:24:01.036Z]     at org.apache.maven.plugin.DefaultBuildPluginManager.executeMojo
(DefaultBuildPluginManager.java:137)
[2019-04-08T16:24:01.036Z]     at org.apache.maven.lifecycle.internal.MojoExecutor.execute
(MojoExecutor.java:210)
[2019-04-08T16:24:01.036Z]     at org.apache.maven.lifecycle.internal.MojoExecutor.execute
(MojoExecutor.java:156)
[2019-04-08T16:24:01.036Z]     at org.apache.maven.lifecycle.internal.MojoExecutor.execute
(MojoExecutor.java:148)
[2019-04-08T16:24:01.036Z]     at org.apache.maven.lifecycle.internal.LifecycleModuleBuilder.buildProject
(LifecycleModuleBuilder.java:117)
[2019-04-08T16:24:01.036Z]     at org.apache.maven.lifecycle.internal.LifecycleModuleBuilder.buildProject
(LifecycleModuleBuilder.java:81)
[2019-04-08T16:24:01.036Z]     at org.apache.maven.lifecycle.internal.builder.singlethreaded.SingleThreadedBuilder.build
(SingleThreadedBuilder.java:56)
[2019-04-08T16:24:01.036Z]     at org.apache.maven.lifecycle.internal.LifecycleStarter.execute
(LifecycleStarter.java:128)
[2019-04-08T16:24:01.036Z]     at org.apache.maven.DefaultMaven.doExecute (DefaultMaven.java:305)
[2019-04-08T16:24:01.036Z]     at org.apache.maven.DefaultMaven.doExecute (DefaultMaven.java:192)
[2019-04-08T16:24:01.036Z]     at org.apache.maven.DefaultMaven.execute (DefaultMaven.java:105)
[2019-04-08T16:24:01.036Z]     at org.apache.maven.cli.MavenCli.execute (MavenCli.java:956)
[2019-04-08T16:24:01.036Z]     at org.apache.maven.cli.MavenCli.doMain (MavenCli.java:288)
[2019-04-08T16:24:01.036Z]     at org.apache.maven.cli.MavenCli.main (MavenCli.java:192)
[2019-04-08T16:24:01.036Z]     at sun.reflect.NativeMethodAccessorImpl.invoke0 (Native Method)
[2019-04-08T16:24:01.036Z]     at sun.reflect.NativeMethodAccessorImpl.invoke (NativeMethodAccessorImpl.java:62)
[2019-04-08T16:24:01.036Z]     at sun.reflect.DelegatingMethodAccessorImpl.invoke (DelegatingMethodAccessorImpl.java:43)
[2019-04-08T16:24:01.036Z]     at java.lang.reflect.Method.invoke (Method.java:498)
[2019-04-08T16:24:01.036Z]     at org.codehaus.plexus.classworlds.launcher.Launcher.launchEnhanced
(Launcher.java:289)
[2019-04-08T16:24:01.036Z]     at org.codehaus.plexus.classworlds.launcher.Launcher.launch
(Launcher.java:229)
[2019-04-08T16:24:01.036Z]     at org.codehaus.plexus.classworlds.launcher.Launcher.mainWithExitCode
(Launcher.java:415)
[2019-04-08T16:24:01.036Z]     at org.codehaus.plexus.classworlds.launcher.Launcher.main (Launcher.java:356)
[2019-04-08T16:24:01.036Z] [ERROR] 
[2019-04-08T16:24:01.037Z] [ERROR] Re-run Maven using the -X switch to enable full debug logging.
[2019-04-08T16:24:01.037Z] [ERROR] 
[2019-04-08T16:24:01.037Z] [ERROR] For more information about the errors and possible solutions,
please read the following articles:
[2019-04-08T16:24:01.037Z] [ERROR] [Help 1] http://cwiki.apache.org/confluence/display/MAVEN/MojoFailureException
[2019-04-08T16:24:01.037Z] [ERROR] 
[2019-04-08T16:24:01.037Z] [ERROR] After correcting the problems, you can resume the build
with the command
[2019-04-08T16:24:01.037Z] [ERROR]   mvn <goals> -rf :surefire-its
[Pipeline] }
[Pipeline] // withEnv
[Pipeline] }
[Pipeline] // stage
[Pipeline] fileExists
[Pipeline] zip
[2019-04-08T16:24:11.319Z] Writing zip file of C:\Users\jenkins\AppData\Local\Temp\2\jenkins-maven-box-maven-surefire-SUREFIRE-1617-5\maven-failsafe-plugin\target\it
to C:\Users\jenkins\AppData\Local\Temp\2\jenkins-maven-box-maven-surefire-SUREFIRE-1617-5\maven-failsafe-plugin--windows-jdk8-maven3.6.x.zip
[2019-04-08T16:24:11.429Z] Zipped 79 entries.
[2019-04-08T16:24:11.429Z] Archiving C:\Users\jenkins\AppData\Local\Temp\2\jenkins-maven-box-maven-surefire-SUREFIRE-1617-5\maven-failsafe-plugin--windows-jdk8-maven3.6.x.zip
[2019-04-08T16:24:11.429Z] [Fast Archiver] No artifacts from Maven TLP » maven-surefire »
SUREFIRE-1617 #4 to compare, so performing full copy of artifacts
[Pipeline] fileExists
[Pipeline] zip
[2019-04-08T16:24:11.620Z] Writing zip file of C:\Users\jenkins\AppData\Local\Temp\2\jenkins-maven-box-maven-surefire-SUREFIRE-1617-5\surefire-its\target
to C:\Users\jenkins\AppData\Local\Temp\2\jenkins-maven-box-maven-surefire-SUREFIRE-1617-5\surefire-its--windows-jdk8-maven3.6.x.zip
[2019-04-08T16:24:28.108Z] Zipped 16028 entries.
[2019-04-08T16:24:28.108Z] Archiving C:\Users\jenkins\AppData\Local\Temp\2\jenkins-maven-box-maven-surefire-SUREFIRE-1617-5\surefire-its--windows-jdk8-maven3.6.x.zip
[2019-04-08T16:24:28.108Z] [Fast Archiver] No artifacts from Maven TLP » maven-surefire »
SUREFIRE-1617 #4 to compare, so performing full copy of artifacts
[Pipeline] archiveArtifacts
[2019-04-08T16:24:30.322Z] Archiving artifacts
[2019-04-08T16:24:30.342Z] [Fast Archiver] No artifacts from Maven TLP » maven-surefire »
SUREFIRE-1617 #4 to compare, so performing full copy of artifacts
[Pipeline] cleanWs
[2019-04-08T16:24:32.453Z] [WS-CLEANUP] Deleting project workspace...
[2019-04-08T16:24:32.453Z] [WS-CLEANUP] Deferred wipeout is used...
[2019-04-08T16:24:32.625Z] [WS-CLEANUP] done
[Pipeline] }
[Pipeline] // ws
[Pipeline] }
[Pipeline] // timestamps
[Pipeline] }
[Pipeline] // node
[Pipeline] }
[Pipeline] // parallel
[Pipeline] echo
Build result: FAILURE
[Pipeline] jiraIssueSelector
[Pipeline] emailext
Mime
  • Unnamed multipart/mixed (inline, None, 0 bytes)
View raw message