maven-notifications mailing list archives

Site index · List index
Message view « Date » · « Thread »
Top « Date » · « Thread »
From Apache Jenkins Server <jenk...@builds.apache.org>
Subject Build failed in Jenkins: Maven TLP » maven-antrun-plugin » master #7
Date Wed, 17 Apr 2019 16:11:00 GMT
See https://builds.apache.org/job/maven-box/job/maven-antrun-plugin/job/master/7/

Changes:

* Remove old CVS tag $Id$
* Remove old CVS tag $Id$
* Remove old CVS tag $Id$
* Remove old CVS tag $Id$
* Remove old CVS tag $Id$
* Remove old CVS tag $Id$
* Remove old CVS tag $Id$
* Remove old CVS tag $Id$
* Remove old CVS tag $Id$
* Remove old CVS tag $Id$
* Remove old CVS tag $Id$
* Remove old CVS tag $Id$

All tests passed

Build log:
[...truncated 2977 lines...]
[INFO] --- maven-invoker-plugin:3.1.0:verify (integration-test) @ maven-antrun-plugin ---
[INFO] -------------------------------------------------
[INFO] Build Summary:
[INFO]   Passed: 25, Failed: 1, Errors: 0, Skipped: 0
[INFO] -------------------------------------------------
[ERROR] The following builds failed:
[ERROR] *  plugin-classpath-test\pom.xml
[INFO] -------------------------------------------------
[INFO] ------------------------------------------------------------------------
[INFO] BUILD FAILURE
[INFO] ------------------------------------------------------------------------
[INFO] Total time: 03:58 min
[INFO] Finished at: 2019-04-16T09:38:01-07:00
[INFO] Final Memory: 45M/546M
[INFO] ------------------------------------------------------------------------
[INFO] [jenkins-event-spy] Generated F:\jenkins\jenkins-slave\workspace\n-box_maven-antrun-plugin_master@2@2@tmp\withMavenef338e82\maven-spy-20190416-093402-5154988901381231243692.log
[ERROR] Failed to execute goal org.apache.maven.plugins:maven-invoker-plugin:3.1.0:verify
(integration-test) on project maven-antrun-plugin: 1 build failed. See console output above
for details. -> [Help 1]
org.apache.maven.lifecycle.LifecycleExecutionException: Failed to execute goal org.apache.maven.plugins:maven-invoker-plugin:3.1.0:verify
(integration-test) on project maven-antrun-plugin: 1 build failed. See console output above
for details.
    at org.apache.maven.lifecycle.internal.MojoExecutor.execute (MojoExecutor.java:213)
    at org.apache.maven.lifecycle.internal.MojoExecutor.execute (MojoExecutor.java:154)
    at org.apache.maven.lifecycle.internal.MojoExecutor.execute (MojoExecutor.java:146)
    at org.apache.maven.lifecycle.internal.LifecycleModuleBuilder.buildProject (LifecycleModuleBuilder.java:117)
    at org.apache.maven.lifecycle.internal.LifecycleModuleBuilder.buildProject (LifecycleModuleBuilder.java:81)
    at org.apache.maven.lifecycle.internal.builder.singlethreaded.SingleThreadedBuilder.build
(SingleThreadedBuilder.java:51)
    at org.apache.maven.lifecycle.internal.LifecycleStarter.execute (LifecycleStarter.java:128)
    at org.apache.maven.DefaultMaven.doExecute (DefaultMaven.java:309)
    at org.apache.maven.DefaultMaven.doExecute (DefaultMaven.java:194)
    at org.apache.maven.DefaultMaven.execute (DefaultMaven.java:107)
    at org.apache.maven.cli.MavenCli.execute (MavenCli.java:955)
    at org.apache.maven.cli.MavenCli.doMain (MavenCli.java:290)
    at org.apache.maven.cli.MavenCli.main (MavenCli.java:194)
    at sun.reflect.NativeMethodAccessorImpl.invoke0 (Native Method)
    at sun.reflect.NativeMethodAccessorImpl.invoke (NativeMethodAccessorImpl.java:62)
    at sun.reflect.DelegatingMethodAccessorImpl.invoke (DelegatingMethodAccessorImpl.java:43)
    at java.lang.reflect.Method.invoke (Method.java:498)
    at org.codehaus.plexus.classworlds.launcher.Launcher.launchEnhanced (Launcher.java:289)
    at org.codehaus.plexus.classworlds.launcher.Launcher.launch (Launcher.java:229)
    at org.codehaus.plexus.classworlds.launcher.Launcher.mainWithExitCode (Launcher.java:415)
    at org.codehaus.plexus.classworlds.launcher.Launcher.main (Launcher.java:356)
Caused by: org.apache.maven.plugin.MojoFailureException: 1 build failed. See console output
above for details.
    at org.apache.maven.plugins.invoker.InvokerSession.handleFailures (InvokerSession.java:260)
    at org.apache.maven.plugins.invoker.VerifyMojo.execute (VerifyMojo.java:137)
    at org.apache.maven.plugin.DefaultBuildPluginManager.executeMojo (DefaultBuildPluginManager.java:134)
    at org.apache.maven.lifecycle.internal.MojoExecutor.execute (MojoExecutor.java:208)
    at org.apache.maven.lifecycle.internal.MojoExecutor.execute (MojoExecutor.java:154)
    at org.apache.maven.lifecycle.internal.MojoExecutor.execute (MojoExecutor.java:146)
    at org.apache.maven.lifecycle.internal.LifecycleModuleBuilder.buildProject (LifecycleModuleBuilder.java:117)
    at org.apache.maven.lifecycle.internal.LifecycleModuleBuilder.buildProject (LifecycleModuleBuilder.java:81)
    at org.apache.maven.lifecycle.internal.builder.singlethreaded.SingleThreadedBuilder.build
(SingleThreadedBuilder.java:51)
    at org.apache.maven.lifecycle.internal.LifecycleStarter.execute (LifecycleStarter.java:128)
    at org.apache.maven.DefaultMaven.doExecute (DefaultMaven.java:309)
    at org.apache.maven.DefaultMaven.doExecute (DefaultMaven.java:194)
    at org.apache.maven.DefaultMaven.execute (DefaultMaven.java:107)
    at org.apache.maven.cli.MavenCli.execute (MavenCli.java:955)
    at org.apache.maven.cli.MavenCli.doMain (MavenCli.java:290)
    at org.apache.maven.cli.MavenCli.main (MavenCli.java:194)
    at sun.reflect.NativeMethodAccessorImpl.invoke0 (Native Method)
    at sun.reflect.NativeMethodAccessorImpl.invoke (NativeMethodAccessorImpl.java:62)
    at sun.reflect.DelegatingMethodAccessorImpl.invoke (DelegatingMethodAccessorImpl.java:43)
    at java.lang.reflect.Method.invoke (Method.java:498)
    at org.codehaus.plexus.classworlds.launcher.Launcher.launchEnhanced (Launcher.java:289)
    at org.codehaus.plexus.classworlds.launcher.Launcher.launch (Launcher.java:229)
    at org.codehaus.plexus.classworlds.launcher.Launcher.mainWithExitCode (Launcher.java:415)
    at org.codehaus.plexus.classworlds.launcher.Launcher.main (Launcher.java:356)
[ERROR] 
[ERROR] Re-run Maven using the -X switch to enable full debug logging.
[ERROR] 
[ERROR] For more information about the errors and possible solutions, please read the following
articles:
[ERROR] [Help 1] http://cwiki.apache.org/confluence/display/MAVEN/MojoFailureException
Picked up JAVA_TOOL_OPTIONS: -Dmaven.ext.class.path="f:\jenkins\jenkins-slave\workspace\n-box_maven-antrun-plugin_master@2@2@tmp\withMavenef338e82\pipeline-maven-spy.jar"
-Dorg.jenkinsci.plugins.pipeline.maven.reportsFolder="f:\jenkins\jenkins-slave\workspace\n-box_maven-antrun-plugin_master@2@2@tmp\withMavenef338e82"

[INFO]           MANTRUN-178\pom.xml .............................. SUCCESS (5.8 s)
[INFO] Building: MANTRUN-179\pom.xml
[INFO] run post-build script verify.bsh
[INFO]           MANTRUN-179\pom.xml .............................. SUCCESS (5.7 s)
[INFO] Building: MANTRUN-192\pom.xml
[INFO]           MANTRUN-192\pom.xml .............................. SUCCESS (6.5 s)
[INFO] Building: multiple-phase-test\pom.xml
[INFO] run post-build script verify.bsh
[INFO]           multiple-phase-test\pom.xml ...................... SUCCESS (6.4 s)
[INFO] Building: never-fail-test\pom.xml
[INFO]           never-fail-test\pom.xml .......................... SUCCESS (6.0 s)
[INFO] Building: plugin-classpath-test\pom.xml
[INFO]           plugin-classpath-test\pom.xml .................... SUCCESS (11.1 s)
[INFO] Building: properties-attributes-test\pom.xml
[INFO]           properties-attributes-test\pom.xml ............... SUCCESS (7.9 s)
[INFO] Building: properties-test\pom.xml
[INFO]           properties-test\pom.xml .......................... SUCCESS (6.0 s)
[INFO] Building: task-encoding-test\pom.xml
[INFO]           task-encoding-test\pom.xml ....................... SUCCESS (6.3 s)
[INFO] Building: tasksattributes-test\pom.xml
[INFO] run post-build script verify.bsh
[INFO]           tasksattributes-test\pom.xml ..................... SUCCESS (7.8 s)
[INFO] 
[INFO] --- maven-checkstyle-plugin:3.0.0:check (checkstyle-check) @ maven-antrun-plugin ---
[INFO] 
[INFO] --- maven-invoker-plugin:3.1.0:verify (integration-test) @ maven-antrun-plugin ---
[INFO] -------------------------------------------------
[INFO] Build Summary:
[INFO]   Passed: 26, Failed: 0, Errors: 0, Skipped: 0
[INFO] -------------------------------------------------
[INFO] ------------------------------------------------------------------------
[INFO] BUILD SUCCESS
[INFO] ------------------------------------------------------------------------
[INFO] Total time: 03:51 min
[INFO] Finished at: 2019-04-16T09:37:55-07:00
[INFO] Final Memory: 58M/760M
[INFO] ------------------------------------------------------------------------
[INFO] [jenkins-event-spy] Generated F:\jenkins\jenkins-slave\workspace\n-box_maven-antrun-plugin_master@3@tmp\withMaven73c79a03\maven-spy-20190416-093402-9541316518223282567504.log
Picked up JAVA_TOOL_OPTIONS: -Dmaven.ext.class.path="f:\jenkins\jenkins-slave\workspace\n-box_maven-antrun-plugin_master@3@tmp\withMaven73c79a03\pipeline-maven-spy.jar"
-Dorg.jenkinsci.plugins.pipeline.maven.reportsFolder="f:\jenkins\jenkins-slave\workspace\n-box_maven-antrun-plugin_master@3@tmp\withMaven73c79a03"

[Pipeline] }
[Pipeline] // dir
[Pipeline] }
[Pipeline] }
[Pipeline] // dir
[Pipeline] }
[withMaven] junitPublisher - Archive test results for Maven artifact org.apache.maven.plugins:maven-antrun-plugin:maven-plugin:3.0.0-SNAPSHOT
generated by maven-surefire-plugin:test (default-test): windows-jdk8-m3.5.x_build\target\surefire-reports\*.xml
Recording test results
[withMaven] artifactsPublisher - Archive artifact windows-jdk7-m3.5.x_build\pom.xml under
org\apache\maven\plugins\maven-antrun-plugin\3.0.0-SNAPSHOT\maven-antrun-plugin-3.0.0-SNAPSHOT.pom
[withMaven] artifactsPublisher - Archive artifact windows-jdk7-m3.5.x_build\target\maven-antrun-plugin-3.0.0-SNAPSHOT.jar
under org\apache\maven\plugins\maven-antrun-plugin\3.0.0-SNAPSHOT\maven-antrun-plugin-3.0.0-SNAPSHOT.jar
[withMaven] junitPublisher - Archive test results for Maven artifact org.apache.maven.plugins:maven-antrun-plugin:maven-plugin:3.0.0-SNAPSHOT
generated by maven-surefire-plugin:test (default-test): windows-jdk7-m3.5.x_build\target\surefire-reports\*.xml
Recording test results
[withMaven] openTasksPublisher - Scan Tasks for Maven artifact org.apache.maven.plugins:maven-antrun-plugin:maven-plugin:3.0.0-SNAPSHOT
in source directory windows-jdk8-m3.5.x_build\src\main\java
[TASKS] Scanning folder 'f:\jenkins\jenkins-slave\workspace\n-box_maven-antrun-plugin_master@2@2'
for files matching the pattern 'windows-jdk8-m3.5.x_build\src\main\java\**\*' - excludes:
null
[TASKS] Found 9 files to scan for tasks
[TASKS] Found 0 open tasks.
Skipping warnings blame since pipelines do not have an SCM link.%n
[TASKS] Computing warning deltas based on reference build #6
[withMaven] invokerPublisher - Archive invoker results for Maven artifact MavenArtifact{org.apache.maven.plugins:maven-antrun-plugin:maven-plugin:3.0.0-SNAPSHOT(version:
3.0.0-SNAPSHOT, snapshot:false) } generated by PluginInvocation{org.apache.maven.plugins:maven-invoker-plugin:3.1.0@integration-test
 integration-test}: windows-jdk8-m3.5.x_build\target\invoker-reports\*.xml
[withMaven] openTasksPublisher - Scan Tasks for Maven artifact org.apache.maven.plugins:maven-antrun-plugin:maven-plugin:3.0.0-SNAPSHOT
in source directory windows-jdk7-m3.5.x_build\src\main\java
[TASKS] Scanning folder 'f:\jenkins\jenkins-slave\workspace\n-box_maven-antrun-plugin_master@3'
for files matching the pattern 'windows-jdk7-m3.5.x_build\src\main\java\**\*' - excludes:
null
[TASKS] Found 9 files to scan for tasks
[TASKS] Found 0 open tasks.
Skipping warnings blame since pipelines do not have an SCM link.%n
[TASKS] Computing warning deltas based on reference build #6
[withMaven] invokerPublisher - Archive invoker results for Maven artifact MavenArtifact{org.apache.maven.plugins:maven-antrun-plugin:maven-plugin:3.0.0-SNAPSHOT(version:
3.0.0-SNAPSHOT, snapshot:false) } generated by PluginInvocation{org.apache.maven.plugins:maven-invoker-plugin:3.1.0@integration-test
 integration-test}: windows-jdk7-m3.5.x_build\target\invoker-reports\*.xml
[withMaven] Publishers: Generated Artifacts Publisher: 62 ms, Junit Publisher: 88 ms, Open
Task Scanner Publisher: 68 ms, Invoker Publisher: 6388 ms
[Pipeline] // withMaven
[Pipeline] cleanWs
[WS-CLEANUP] Deleting project workspace...
[WS-CLEANUP] Deferred wipeout is used...
[WS-CLEANUP] done
[Pipeline] cleanWs
[WS-CLEANUP] Deleting project workspace...
[WS-CLEANUP] Deferred wipeout is used...
[withMaven] Publishers: Generated Artifacts Publisher: 129 ms, Junit Publisher: 85 ms, Open
Task Scanner Publisher: 64 ms, Invoker Publisher: 6485 ms, Pipeline Graph Publisher: 18 ms
[WS-CLEANUP] done
[Pipeline] }
[Pipeline] // withMaven
[Pipeline] // stage
[Pipeline] }
[Pipeline] cleanWs
[WS-CLEANUP] Deleting project workspace...
[WS-CLEANUP] Deferred wipeout is used...
[Pipeline] // ws
[Pipeline] }
[WS-CLEANUP] done
[Pipeline] // node
[Pipeline] }
Failed in branch windows-jdk8-m3.5.x_build
[Pipeline] }
[Pipeline] // stage
[Pipeline] }
[Pipeline] // ws
[Pipeline] }
[Pipeline] // node
[Pipeline] }
[INFO]           properties-attributes-test\pom.xml ............... SUCCESS (7.5 s)
[INFO]           properties-attributes-test\pom.xml ............... SUCCESS (7.5 s)
[INFO] Building: properties-test\pom.xml
[INFO] Building: properties-test\pom.xml
[INFO]           properties-test\pom.xml .......................... SUCCESS (4.5 s)
[INFO]           properties-test\pom.xml .......................... SUCCESS (4.6 s)
[INFO] Building: task-encoding-test\pom.xml
[INFO] Building: task-encoding-test\pom.xml
[INFO]           task-encoding-test\pom.xml ....................... SUCCESS (4.9 s)
[INFO]           task-encoding-test\pom.xml ....................... SUCCESS (4.9 s)
[INFO] Building: tasksattributes-test\pom.xml
[INFO] Building: tasksattributes-test\pom.xml
[INFO] run post-build script verify.bsh
[INFO] run post-build script verify.bsh
[INFO]           tasksattributes-test\pom.xml ..................... SUCCESS (7.2 s)
[INFO] 
[INFO]           tasksattributes-test\pom.xml ..................... SUCCESS (7.1 s)
[INFO] 
[INFO] --- maven-checkstyle-plugin:3.0.0:check (checkstyle-check) @ maven-antrun-plugin ---
[INFO] 
[INFO] --- maven-checkstyle-plugin:3.0.0:check (checkstyle-check) @ maven-antrun-plugin ---
[INFO] 
[INFO] --- maven-invoker-plugin:3.1.0:verify (integration-test) @ maven-antrun-plugin ---
[INFO] --- maven-invoker-plugin:3.1.0:verify (integration-test) @ maven-antrun-plugin ---
[INFO] -------------------------------------------------
[INFO] -------------------------------------------------
[INFO] Build Summary:
[INFO] Build Summary:
[INFO]   Passed: 26, Failed: 0, Errors: 0, Skipped: 0
[INFO]   Passed: 26, Failed: 0, Errors: 0, Skipped: 0
[INFO] -------------------------------------------------
[INFO] -------------------------------------------------
[INFO] ------------------------------------------------------------------------
[INFO] ------------------------------------------------------------------------
[INFO] BUILD SUCCESS
[INFO] BUILD SUCCESS
[INFO] ------------------------------------------------------------------------
[INFO] ------------------------------------------------------------------------
[INFO] Total time: 03:03 min
[INFO] Total time: 03:04 min
[INFO] Finished at: 2019-04-16T16:37:03Z
[INFO] Finished at: 2019-04-16T16:37:04Z
[INFO] Final Memory: 40M/137M
[INFO] Final Memory: 41M/144M
[INFO] ------------------------------------------------------------------------
[INFO] ------------------------------------------------------------------------
[INFO] [jenkins-event-spy] Generated F:\jenkins\jenkins-slave\workspace\n-box_maven-antrun-plugin_master@2@2@tmp\withMaven133c4895\maven-spy-20190416-163359-74516803808087924318042.log
[INFO] [jenkins-event-spy] Generated F:\jenkins\jenkins-slave\workspace\n-box_maven-antrun-plugin_master@3@tmp\withMaven5c01c44d\maven-spy-20190416-163359-68611313050565157790458.log
[Pipeline] }
[Pipeline] // dir
[Pipeline] }
[Pipeline] }
[Pipeline] // dir
[Pipeline] // withMaven
[Pipeline] cleanWs
[Pipeline] }
[Pipeline] // withMaven
[Pipeline] cleanWs
[Pipeline] cleanWs
[Pipeline] cleanWs
[Pipeline] }
[Pipeline] }
[Pipeline] // stage
[Pipeline] // stage
[Pipeline] }
[Pipeline] }
[Pipeline] // ws
[Pipeline] // ws
[Pipeline] }
[Pipeline] }
[Pipeline] // node
[Pipeline] // node
[Pipeline] }
Failed in branch windows-jdk11-m3.5.x_build
[Pipeline] }
Failed in branch windows-jdk12-m3.5.x_build
[Pipeline] // parallel
[Pipeline] stage
[Pipeline] { (Notifications)
[Pipeline] echo
Build result: FAILURE
[Pipeline] jiraIssueSelector
[Pipeline] emailext
Mime
  • Unnamed multipart/mixed (inline, None, 0 bytes)
View raw message