maven-notifications mailing list archives

Site index · List index
Message view « Date » · « Thread »
Top « Date » · « Thread »
From Apache Jenkins Server <jenk...@builds.apache.org>
Subject Build failed in Jenkins: Maven TLP » maven-dist-tool » master #58
Date Tue, 16 Apr 2019 21:50:41 GMT
See https://builds.apache.org/job/maven-box/job/maven-dist-tool/job/master/58/

No changes.

All tests passed

Build log:
[...truncated 4881 lines...]
[2019-04-16T21:50:36.126Z] IOException try 3 while reading http://www.apache.org/dist/maven/maven-3/3.6.1/source:
class org.jsoup.HttpStatusException HTTP error fetching URL
[2019-04-16T21:50:36.126Z] [INFO] ------------------------------------------------------------------------
[2019-04-16T21:50:36.126Z] [INFO] BUILD FAILURE
[2019-04-16T21:50:36.126Z] [INFO] ------------------------------------------------------------------------
[2019-04-16T21:50:36.126Z] [INFO] Total time:  02:20 min
[2019-04-16T21:50:36.126Z] [INFO] Finished at: 2019-04-16T21:50:35Z
[2019-04-16T21:50:36.126Z] [INFO] ------------------------------------------------------------------------
[2019-04-16T21:50:36.126Z] [WARNING] The requested profile "apache.snapshots" could not be
activated because it does not exist.
[2019-04-16T21:50:36.126Z] [INFO] [jenkins-event-spy] Generated /home/jenkins/jenkins-slave/workspace/maven-box_maven-dist-tool_master@tmp/withMavenf890385f/maven-spy-20190416-214814-661578875528560946093.log
[2019-04-16T21:50:36.126Z] [ERROR] Failed to execute goal org.apache.maven.plugins:maven-site-plugin:3.7.1:site
(default-site) on project dist-tool-plugin: Error generating dist-tool-plugin:1.0-SNAPSHOT:check-source-release
report: IOException while reading http://www.apache.org/dist/maven/maven-3/3.6.1/source: HTTP
error fetching URL -> [Help 1]
[2019-04-16T21:50:36.126Z] org.apache.maven.lifecycle.LifecycleExecutionException: Failed
to execute goal org.apache.maven.plugins:maven-site-plugin:3.7.1:site (default-site) on project
dist-tool-plugin: Error generating dist-tool-plugin:1.0-SNAPSHOT:check-source-release report
[2019-04-16T21:50:36.126Z]     at org.apache.maven.lifecycle.internal.MojoExecutor.execute
(MojoExecutor.java:215)
[2019-04-16T21:50:36.126Z]     at org.apache.maven.lifecycle.internal.MojoExecutor.execute
(MojoExecutor.java:156)
[2019-04-16T21:50:36.126Z]     at org.apache.maven.lifecycle.internal.MojoExecutor.execute
(MojoExecutor.java:148)
[2019-04-16T21:50:36.126Z]     at org.apache.maven.lifecycle.internal.LifecycleModuleBuilder.buildProject
(LifecycleModuleBuilder.java:117)
[2019-04-16T21:50:36.126Z]     at org.apache.maven.lifecycle.internal.LifecycleModuleBuilder.buildProject
(LifecycleModuleBuilder.java:81)
[2019-04-16T21:50:36.126Z]     at org.apache.maven.lifecycle.internal.builder.singlethreaded.SingleThreadedBuilder.build
(SingleThreadedBuilder.java:56)
[2019-04-16T21:50:36.126Z]     at org.apache.maven.lifecycle.internal.LifecycleStarter.execute
(LifecycleStarter.java:128)
[2019-04-16T21:50:36.126Z]     at org.apache.maven.DefaultMaven.doExecute (DefaultMaven.java:305)
[2019-04-16T21:50:36.126Z]     at org.apache.maven.DefaultMaven.doExecute (DefaultMaven.java:192)
[2019-04-16T21:50:36.126Z]     at org.apache.maven.DefaultMaven.execute (DefaultMaven.java:105)
[2019-04-16T21:50:36.126Z]     at org.apache.maven.cli.MavenCli.execute (MavenCli.java:956)
[2019-04-16T21:50:36.126Z]     at org.apache.maven.cli.MavenCli.doMain (MavenCli.java:288)
[2019-04-16T21:50:36.126Z]     at org.apache.maven.cli.MavenCli.main (MavenCli.java:192)
[2019-04-16T21:50:36.126Z]     at sun.reflect.NativeMethodAccessorImpl.invoke0 (Native Method)
[2019-04-16T21:50:36.126Z]     at sun.reflect.NativeMethodAccessorImpl.invoke (NativeMethodAccessorImpl.java:62)
[2019-04-16T21:50:36.126Z]     at sun.reflect.DelegatingMethodAccessorImpl.invoke (DelegatingMethodAccessorImpl.java:43)
[2019-04-16T21:50:36.127Z]     at java.lang.reflect.Method.invoke (Method.java:498)
[2019-04-16T21:50:36.127Z]     at org.codehaus.plexus.classworlds.launcher.Launcher.launchEnhanced
(Launcher.java:289)
[2019-04-16T21:50:36.127Z]     at org.codehaus.plexus.classworlds.launcher.Launcher.launch
(Launcher.java:229)
[2019-04-16T21:50:36.127Z]     at org.codehaus.plexus.classworlds.launcher.Launcher.mainWithExitCode
(Launcher.java:415)
[2019-04-16T21:50:36.127Z]     at org.codehaus.plexus.classworlds.launcher.Launcher.main (Launcher.java:356)
[2019-04-16T21:50:36.127Z] Caused by: org.apache.maven.plugin.MojoExecutionException: Error
generating dist-tool-plugin:1.0-SNAPSHOT:check-source-release report
[2019-04-16T21:50:36.127Z]     at org.apache.maven.plugins.site.render.SiteMojo.execute (SiteMojo.java:155)
[2019-04-16T21:50:36.127Z]     at org.apache.maven.plugin.DefaultBuildPluginManager.executeMojo
(DefaultBuildPluginManager.java:137)
[2019-04-16T21:50:36.127Z]     at org.apache.maven.lifecycle.internal.MojoExecutor.execute
(MojoExecutor.java:210)
[2019-04-16T21:50:36.127Z]     at org.apache.maven.lifecycle.internal.MojoExecutor.execute
(MojoExecutor.java:156)
[2019-04-16T21:50:36.127Z]     at org.apache.maven.lifecycle.internal.MojoExecutor.execute
(MojoExecutor.java:148)
[2019-04-16T21:50:36.127Z]     at org.apache.maven.lifecycle.internal.LifecycleModuleBuilder.buildProject
(LifecycleModuleBuilder.java:117)
[2019-04-16T21:50:36.127Z]     at org.apache.maven.lifecycle.internal.LifecycleModuleBuilder.buildProject
(LifecycleModuleBuilder.java:81)
[2019-04-16T21:50:36.127Z]     at org.apache.maven.lifecycle.internal.builder.singlethreaded.SingleThreadedBuilder.build
(SingleThreadedBuilder.java:56)
[2019-04-16T21:50:36.127Z]     at org.apache.maven.lifecycle.internal.LifecycleStarter.execute
(LifecycleStarter.java:128)
[2019-04-16T21:50:36.127Z]     at org.apache.maven.DefaultMaven.doExecute (DefaultMaven.java:305)
[2019-04-16T21:50:36.127Z]     at org.apache.maven.DefaultMaven.doExecute (DefaultMaven.java:192)
[2019-04-16T21:50:36.127Z]     at org.apache.maven.DefaultMaven.execute (DefaultMaven.java:105)
[2019-04-16T21:50:36.127Z]     at org.apache.maven.cli.MavenCli.execute (MavenCli.java:956)
[2019-04-16T21:50:36.127Z]     at org.apache.maven.cli.MavenCli.doMain (MavenCli.java:288)
[2019-04-16T21:50:36.127Z]     at org.apache.maven.cli.MavenCli.main (MavenCli.java:192)
[2019-04-16T21:50:36.127Z]     at sun.reflect.NativeMethodAccessorImpl.invoke0 (Native Method)
[2019-04-16T21:50:36.127Z]     at sun.reflect.NativeMethodAccessorImpl.invoke (NativeMethodAccessorImpl.java:62)
[2019-04-16T21:50:36.127Z]     at sun.reflect.DelegatingMethodAccessorImpl.invoke (DelegatingMethodAccessorImpl.java:43)
[2019-04-16T21:50:36.127Z]     at java.lang.reflect.Method.invoke (Method.java:498)
[2019-04-16T21:50:36.127Z]     at org.codehaus.plexus.classworlds.launcher.Launcher.launchEnhanced
(Launcher.java:289)
[2019-04-16T21:50:36.127Z]     at org.codehaus.plexus.classworlds.launcher.Launcher.launch
(Launcher.java:229)
[2019-04-16T21:50:36.127Z]     at org.codehaus.plexus.classworlds.launcher.Launcher.mainWithExitCode
(Launcher.java:415)
[2019-04-16T21:50:36.127Z]     at org.codehaus.plexus.classworlds.launcher.Launcher.main (Launcher.java:356)
[2019-04-16T21:50:36.127Z] Caused by: org.apache.maven.reporting.MavenReportException: IOException
while reading http://www.apache.org/dist/maven/maven-3/3.6.1/source
[2019-04-16T21:50:36.127Z]     at org.apache.maven.dist.tools.source.DistCheckSourceReleaseMojo.executeReport
(DistCheckSourceReleaseMojo.java:267)
[2019-04-16T21:50:36.127Z]     at org.apache.maven.reporting.AbstractMavenReport.generate
(AbstractMavenReport.java:251)
[2019-04-16T21:50:36.127Z]     at org.apache.maven.plugins.site.render.ReportDocumentRenderer.renderDocument
(ReportDocumentRenderer.java:230)
[2019-04-16T21:50:36.127Z]     at org.apache.maven.doxia.siterenderer.DefaultSiteRenderer.render
(DefaultSiteRenderer.java:349)
[2019-04-16T21:50:36.128Z]     at org.apache.maven.plugins.site.render.SiteMojo.renderLocale
(SiteMojo.java:198)
[2019-04-16T21:50:36.128Z]     at org.apache.maven.plugins.site.render.SiteMojo.execute (SiteMojo.java:147)
[2019-04-16T21:50:36.128Z]     at org.apache.maven.plugin.DefaultBuildPluginManager.executeMojo
(DefaultBuildPluginManager.java:137)
[2019-04-16T21:50:36.128Z]     at org.apache.maven.lifecycle.internal.MojoExecutor.execute
(MojoExecutor.java:210)
[2019-04-16T21:50:36.128Z]     at org.apache.maven.lifecycle.internal.MojoExecutor.execute
(MojoExecutor.java:156)
[2019-04-16T21:50:36.128Z]     at org.apache.maven.lifecycle.internal.MojoExecutor.execute
(MojoExecutor.java:148)
[2019-04-16T21:50:36.128Z]     at org.apache.maven.lifecycle.internal.LifecycleModuleBuilder.buildProject
(LifecycleModuleBuilder.java:117)
[2019-04-16T21:50:36.128Z]     at org.apache.maven.lifecycle.internal.LifecycleModuleBuilder.buildProject
(LifecycleModuleBuilder.java:81)
[2019-04-16T21:50:36.128Z]     at org.apache.maven.lifecycle.internal.builder.singlethreaded.SingleThreadedBuilder.build
(SingleThreadedBuilder.java:56)
[2019-04-16T21:50:36.128Z]     at org.apache.maven.lifecycle.internal.LifecycleStarter.execute
(LifecycleStarter.java:128)
[2019-04-16T21:50:36.128Z]     at org.apache.maven.DefaultMaven.doExecute (DefaultMaven.java:305)
[2019-04-16T21:50:36.128Z]     at org.apache.maven.DefaultMaven.doExecute (DefaultMaven.java:192)
[2019-04-16T21:50:36.128Z]     at org.apache.maven.DefaultMaven.execute (DefaultMaven.java:105)
[2019-04-16T21:50:36.128Z]     at org.apache.maven.cli.MavenCli.execute (MavenCli.java:956)
[2019-04-16T21:50:36.128Z]     at org.apache.maven.cli.MavenCli.doMain (MavenCli.java:288)
[2019-04-16T21:50:36.128Z]     at org.apache.maven.cli.MavenCli.main (MavenCli.java:192)
[2019-04-16T21:50:36.128Z]     at sun.reflect.NativeMethodAccessorImpl.invoke0 (Native Method)
[2019-04-16T21:50:36.128Z]     at sun.reflect.NativeMethodAccessorImpl.invoke (NativeMethodAccessorImpl.java:62)
[2019-04-16T21:50:36.128Z]     at sun.reflect.DelegatingMethodAccessorImpl.invoke (DelegatingMethodAccessorImpl.java:43)
[2019-04-16T21:50:36.128Z]     at java.lang.reflect.Method.invoke (Method.java:498)
[2019-04-16T21:50:36.128Z]     at org.codehaus.plexus.classworlds.launcher.Launcher.launchEnhanced
(Launcher.java:289)
[2019-04-16T21:50:36.128Z]     at org.codehaus.plexus.classworlds.launcher.Launcher.launch
(Launcher.java:229)
[2019-04-16T21:50:36.128Z]     at org.codehaus.plexus.classworlds.launcher.Launcher.mainWithExitCode
(Launcher.java:415)
[2019-04-16T21:50:36.128Z]     at org.codehaus.plexus.classworlds.launcher.Launcher.main (Launcher.java:356)
[2019-04-16T21:50:36.128Z] Caused by: org.apache.maven.plugin.MojoExecutionException: IOException
while reading http://www.apache.org/dist/maven/maven-3/3.6.1/source
[2019-04-16T21:50:36.128Z]     at org.apache.maven.dist.tools.source.DistCheckSourceReleaseMojo.checkArtifact
(DistCheckSourceReleaseMojo.java:562)
[2019-04-16T21:50:36.128Z]     at org.apache.maven.dist.tools.AbstractDistCheckMojo.execute
(AbstractDistCheckMojo.java:268)
[2019-04-16T21:50:36.128Z]     at org.apache.maven.dist.tools.source.DistCheckSourceReleaseMojo.executeReport
(DistCheckSourceReleaseMojo.java:263)
[2019-04-16T21:50:36.128Z]     at org.apache.maven.reporting.AbstractMavenReport.generate
(AbstractMavenReport.java:251)
[2019-04-16T21:50:36.128Z]     at org.apache.maven.plugins.site.render.ReportDocumentRenderer.renderDocument
(ReportDocumentRenderer.java:230)
[2019-04-16T21:50:36.128Z]     at org.apache.maven.doxia.siterenderer.DefaultSiteRenderer.render
(DefaultSiteRenderer.java:349)
[2019-04-16T21:50:36.129Z]     at org.apache.maven.plugins.site.render.SiteMojo.renderLocale
(SiteMojo.java:198)
[2019-04-16T21:50:36.129Z]     at org.apache.maven.plugins.site.render.SiteMojo.execute (SiteMojo.java:147)
[2019-04-16T21:50:36.129Z]     at org.apache.maven.plugin.DefaultBuildPluginManager.executeMojo
(DefaultBuildPluginManager.java:137)
[2019-04-16T21:50:36.129Z]     at org.apache.maven.lifecycle.internal.MojoExecutor.execute
(MojoExecutor.java:210)
[2019-04-16T21:50:36.129Z]     at org.apache.maven.lifecycle.internal.MojoExecutor.execute
(MojoExecutor.java:156)
[2019-04-16T21:50:36.129Z]     at org.apache.maven.lifecycle.internal.MojoExecutor.execute
(MojoExecutor.java:148)
[2019-04-16T21:50:36.129Z]     at org.apache.maven.lifecycle.internal.LifecycleModuleBuilder.buildProject
(LifecycleModuleBuilder.java:117)
[2019-04-16T21:50:36.129Z]     at org.apache.maven.lifecycle.internal.LifecycleModuleBuilder.buildProject
(LifecycleModuleBuilder.java:81)
[2019-04-16T21:50:36.129Z]     at org.apache.maven.lifecycle.internal.builder.singlethreaded.SingleThreadedBuilder.build
(SingleThreadedBuilder.java:56)
[2019-04-16T21:50:36.129Z]     at org.apache.maven.lifecycle.internal.LifecycleStarter.execute
(LifecycleStarter.java:128)
[2019-04-16T21:50:36.129Z]     at org.apache.maven.DefaultMaven.doExecute (DefaultMaven.java:305)
[2019-04-16T21:50:36.129Z]     at org.apache.maven.DefaultMaven.doExecute (DefaultMaven.java:192)
[2019-04-16T21:50:36.129Z]     at org.apache.maven.DefaultMaven.execute (DefaultMaven.java:105)
[2019-04-16T21:50:36.129Z]     at org.apache.maven.cli.MavenCli.execute (MavenCli.java:956)
[2019-04-16T21:50:36.129Z]     at org.apache.maven.cli.MavenCli.doMain (MavenCli.java:288)
[2019-04-16T21:50:36.129Z]     at org.apache.maven.cli.MavenCli.main (MavenCli.java:192)
[2019-04-16T21:50:36.129Z]     at sun.reflect.NativeMethodAccessorImpl.invoke0 (Native Method)
[2019-04-16T21:50:36.129Z]     at sun.reflect.NativeMethodAccessorImpl.invoke (NativeMethodAccessorImpl.java:62)
[2019-04-16T21:50:36.129Z]     at sun.reflect.DelegatingMethodAccessorImpl.invoke (DelegatingMethodAccessorImpl.java:43)
[2019-04-16T21:50:36.129Z]     at java.lang.reflect.Method.invoke (Method.java:498)
[2019-04-16T21:50:36.129Z]     at org.codehaus.plexus.classworlds.launcher.Launcher.launchEnhanced
(Launcher.java:289)
[2019-04-16T21:50:36.129Z]     at org.codehaus.plexus.classworlds.launcher.Launcher.launch
(Launcher.java:229)
[2019-04-16T21:50:36.129Z]     at org.codehaus.plexus.classworlds.launcher.Launcher.mainWithExitCode
(Launcher.java:415)
[2019-04-16T21:50:36.129Z]     at org.codehaus.plexus.classworlds.launcher.Launcher.main (Launcher.java:356)
[2019-04-16T21:50:36.129Z] Caused by: java.io.IOException: IOException while reading http://www.apache.org/dist/maven/maven-3/3.6.1/source
[2019-04-16T21:50:36.129Z]     at org.apache.maven.dist.tools.source.DistCheckSourceReleaseMojo.selectLinks
(DistCheckSourceReleaseMojo.java:444)
[2019-04-16T21:50:36.129Z]     at org.apache.maven.dist.tools.source.DistCheckSourceReleaseMojo.checkDirectoryIndex
(DistCheckSourceReleaseMojo.java:496)
[2019-04-16T21:50:36.129Z]     at org.apache.maven.dist.tools.source.DistCheckSourceReleaseMojo.checkArtifact
(DistCheckSourceReleaseMojo.java:557)
[2019-04-16T21:50:36.129Z]     at org.apache.maven.dist.tools.AbstractDistCheckMojo.execute
(AbstractDistCheckMojo.java:268)
[2019-04-16T21:50:36.129Z]     at org.apache.maven.dist.tools.source.DistCheckSourceReleaseMojo.executeReport
(DistCheckSourceReleaseMojo.java:263)
[2019-04-16T21:50:36.129Z]     at org.apache.maven.reporting.AbstractMavenReport.generate
(AbstractMavenReport.java:251)
[2019-04-16T21:50:36.129Z]     at org.apache.maven.plugins.site.render.ReportDocumentRenderer.renderDocument
(ReportDocumentRenderer.java:230)
[2019-04-16T21:50:36.129Z]     at org.apache.maven.doxia.siterenderer.DefaultSiteRenderer.render
(DefaultSiteRenderer.java:349)
[2019-04-16T21:50:36.129Z]     at org.apache.maven.plugins.site.render.SiteMojo.renderLocale
(SiteMojo.java:198)
[2019-04-16T21:50:36.130Z]     at org.apache.maven.plugins.site.render.SiteMojo.execute (SiteMojo.java:147)
[2019-04-16T21:50:36.130Z]     at org.apache.maven.plugin.DefaultBuildPluginManager.executeMojo
(DefaultBuildPluginManager.java:137)
[2019-04-16T21:50:36.130Z]     at org.apache.maven.lifecycle.internal.MojoExecutor.execute
(MojoExecutor.java:210)
[2019-04-16T21:50:36.130Z]     at org.apache.maven.lifecycle.internal.MojoExecutor.execute
(MojoExecutor.java:156)
[2019-04-16T21:50:36.130Z]     at org.apache.maven.lifecycle.internal.MojoExecutor.execute
(MojoExecutor.java:148)
[2019-04-16T21:50:36.130Z]     at org.apache.maven.lifecycle.internal.LifecycleModuleBuilder.buildProject
(LifecycleModuleBuilder.java:117)
[2019-04-16T21:50:36.130Z]     at org.apache.maven.lifecycle.internal.LifecycleModuleBuilder.buildProject
(LifecycleModuleBuilder.java:81)
[2019-04-16T21:50:36.130Z]     at org.apache.maven.lifecycle.internal.builder.singlethreaded.SingleThreadedBuilder.build
(SingleThreadedBuilder.java:56)
[2019-04-16T21:50:36.130Z]     at org.apache.maven.lifecycle.internal.LifecycleStarter.execute
(LifecycleStarter.java:128)
[2019-04-16T21:50:36.130Z]     at org.apache.maven.DefaultMaven.doExecute (DefaultMaven.java:305)
[2019-04-16T21:50:36.130Z]     at org.apache.maven.DefaultMaven.doExecute (DefaultMaven.java:192)
[2019-04-16T21:50:36.130Z]     at org.apache.maven.DefaultMaven.execute (DefaultMaven.java:105)
[2019-04-16T21:50:36.130Z]     at org.apache.maven.cli.MavenCli.execute (MavenCli.java:956)
[2019-04-16T21:50:36.130Z]     at org.apache.maven.cli.MavenCli.doMain (MavenCli.java:288)
[2019-04-16T21:50:36.130Z]     at org.apache.maven.cli.MavenCli.main (MavenCli.java:192)
[2019-04-16T21:50:36.130Z]     at sun.reflect.NativeMethodAccessorImpl.invoke0 (Native Method)
[2019-04-16T21:50:36.130Z]     at sun.reflect.NativeMethodAccessorImpl.invoke (NativeMethodAccessorImpl.java:62)
[2019-04-16T21:50:36.130Z]     at sun.reflect.DelegatingMethodAccessorImpl.invoke (DelegatingMethodAccessorImpl.java:43)
[2019-04-16T21:50:36.130Z]     at java.lang.reflect.Method.invoke (Method.java:498)
[2019-04-16T21:50:36.130Z]     at org.codehaus.plexus.classworlds.launcher.Launcher.launchEnhanced
(Launcher.java:289)
[2019-04-16T21:50:36.130Z]     at org.codehaus.plexus.classworlds.launcher.Launcher.launch
(Launcher.java:229)
[2019-04-16T21:50:36.130Z]     at org.codehaus.plexus.classworlds.launcher.Launcher.mainWithExitCode
(Launcher.java:415)
[2019-04-16T21:50:36.130Z]     at org.codehaus.plexus.classworlds.launcher.Launcher.main (Launcher.java:356)
[2019-04-16T21:50:36.130Z] Caused by: java.io.IOException: IOException while reading http://www.apache.org/dist/maven/maven-3/3.6.1/source
[2019-04-16T21:50:36.130Z]     at org.apache.maven.dist.tools.JsoupRetry.get (JsoupRetry.java:52)
[2019-04-16T21:50:36.130Z]     at org.apache.maven.dist.tools.source.DistCheckSourceReleaseMojo.read
(DistCheckSourceReleaseMojo.java:425)
[2019-04-16T21:50:36.130Z]     at org.apache.maven.dist.tools.source.DistCheckSourceReleaseMojo.selectLinks
(DistCheckSourceReleaseMojo.java:440)
[2019-04-16T21:50:36.130Z]     at org.apache.maven.dist.tools.source.DistCheckSourceReleaseMojo.checkDirectoryIndex
(DistCheckSourceReleaseMojo.java:496)
[2019-04-16T21:50:36.130Z]     at org.apache.maven.dist.tools.source.DistCheckSourceReleaseMojo.checkArtifact
(DistCheckSourceReleaseMojo.java:557)
[2019-04-16T21:50:36.130Z]     at org.apache.maven.dist.tools.AbstractDistCheckMojo.execute
(AbstractDistCheckMojo.java:268)
[2019-04-16T21:50:36.130Z]     at org.apache.maven.dist.tools.source.DistCheckSourceReleaseMojo.executeReport
(DistCheckSourceReleaseMojo.java:263)
[2019-04-16T21:50:36.130Z]     at org.apache.maven.reporting.AbstractMavenReport.generate
(AbstractMavenReport.java:251)
[2019-04-16T21:50:36.130Z]     at org.apache.maven.plugins.site.render.ReportDocumentRenderer.renderDocument
(ReportDocumentRenderer.java:230)
[2019-04-16T21:50:36.131Z]     at org.apache.maven.doxia.siterenderer.DefaultSiteRenderer.render
(DefaultSiteRenderer.java:349)
[2019-04-16T21:50:36.131Z]     at org.apache.maven.plugins.site.render.SiteMojo.renderLocale
(SiteMojo.java:198)
[2019-04-16T21:50:36.131Z]     at org.apache.maven.plugins.site.render.SiteMojo.execute (SiteMojo.java:147)
[2019-04-16T21:50:36.131Z]     at org.apache.maven.plugin.DefaultBuildPluginManager.executeMojo
(DefaultBuildPluginManager.java:137)
[2019-04-16T21:50:36.131Z]     at org.apache.maven.lifecycle.internal.MojoExecutor.execute
(MojoExecutor.java:210)
[2019-04-16T21:50:36.131Z]     at org.apache.maven.lifecycle.internal.MojoExecutor.execute
(MojoExecutor.java:156)
[2019-04-16T21:50:36.131Z]     at org.apache.maven.lifecycle.internal.MojoExecutor.execute
(MojoExecutor.java:148)
[2019-04-16T21:50:36.131Z]     at org.apache.maven.lifecycle.internal.LifecycleModuleBuilder.buildProject
(LifecycleModuleBuilder.java:117)
[2019-04-16T21:50:36.131Z]     at org.apache.maven.lifecycle.internal.LifecycleModuleBuilder.buildProject
(LifecycleModuleBuilder.java:81)
[2019-04-16T21:50:36.131Z]     at org.apache.maven.lifecycle.internal.builder.singlethreaded.SingleThreadedBuilder.build
(SingleThreadedBuilder.java:56)
[2019-04-16T21:50:36.131Z]     at org.apache.maven.lifecycle.internal.LifecycleStarter.execute
(LifecycleStarter.java:128)
[2019-04-16T21:50:36.131Z]     at org.apache.maven.DefaultMaven.doExecute (DefaultMaven.java:305)
[2019-04-16T21:50:36.131Z]     at org.apache.maven.DefaultMaven.doExecute (DefaultMaven.java:192)
[2019-04-16T21:50:36.131Z]     at org.apache.maven.DefaultMaven.execute (DefaultMaven.java:105)
[2019-04-16T21:50:36.131Z]     at org.apache.maven.cli.MavenCli.execute (MavenCli.java:956)
[2019-04-16T21:50:36.131Z]     at org.apache.maven.cli.MavenCli.doMain (MavenCli.java:288)
[2019-04-16T21:50:36.131Z]     at org.apache.maven.cli.MavenCli.main (MavenCli.java:192)
[2019-04-16T21:50:36.131Z]     at sun.reflect.NativeMethodAccessorImpl.invoke0 (Native Method)
[2019-04-16T21:50:36.131Z]     at sun.reflect.NativeMethodAccessorImpl.invoke (NativeMethodAccessorImpl.java:62)
[2019-04-16T21:50:36.131Z]     at sun.reflect.DelegatingMethodAccessorImpl.invoke (DelegatingMethodAccessorImpl.java:43)
[2019-04-16T21:50:36.131Z]     at java.lang.reflect.Method.invoke (Method.java:498)
[2019-04-16T21:50:36.131Z]     at org.codehaus.plexus.classworlds.launcher.Launcher.launchEnhanced
(Launcher.java:289)
[2019-04-16T21:50:36.131Z]     at org.codehaus.plexus.classworlds.launcher.Launcher.launch
(Launcher.java:229)
[2019-04-16T21:50:36.132Z]     at org.codehaus.plexus.classworlds.launcher.Launcher.mainWithExitCode
(Launcher.java:415)
[2019-04-16T21:50:36.132Z]     at org.codehaus.plexus.classworlds.launcher.Launcher.main (Launcher.java:356)
[2019-04-16T21:50:36.132Z] Caused by: org.jsoup.HttpStatusException: HTTP error fetching URL
[2019-04-16T21:50:36.132Z]     at org.jsoup.helper.HttpConnection$Response.execute (HttpConnection.java:435)
[2019-04-16T21:50:36.132Z]     at org.jsoup.helper.HttpConnection$Response.execute (HttpConnection.java:410)
[2019-04-16T21:50:36.132Z]     at org.jsoup.helper.HttpConnection.execute (HttpConnection.java:164)
[2019-04-16T21:50:36.132Z]     at org.jsoup.helper.HttpConnection.get (HttpConnection.java:153)
[2019-04-16T21:50:36.132Z]     at org.apache.maven.dist.tools.JsoupRetry.get (JsoupRetry.java:43)
[2019-04-16T21:50:36.132Z]     at org.apache.maven.dist.tools.source.DistCheckSourceReleaseMojo.read
(DistCheckSourceReleaseMojo.java:425)
[2019-04-16T21:50:36.132Z]     at org.apache.maven.dist.tools.source.DistCheckSourceReleaseMojo.selectLinks
(DistCheckSourceReleaseMojo.java:440)
[2019-04-16T21:50:36.132Z]     at org.apache.maven.dist.tools.source.DistCheckSourceReleaseMojo.checkDirectoryIndex
(DistCheckSourceReleaseMojo.java:496)
[2019-04-16T21:50:36.132Z]     at org.apache.maven.dist.tools.source.DistCheckSourceReleaseMojo.checkArtifact
(DistCheckSourceReleaseMojo.java:557)
[2019-04-16T21:50:36.132Z]     at org.apache.maven.dist.tools.AbstractDistCheckMojo.execute
(AbstractDistCheckMojo.java:268)
[2019-04-16T21:50:36.132Z]     at org.apache.maven.dist.tools.source.DistCheckSourceReleaseMojo.executeReport
(DistCheckSourceReleaseMojo.java:263)
[2019-04-16T21:50:36.132Z]     at org.apache.maven.reporting.AbstractMavenReport.generate
(AbstractMavenReport.java:251)
[2019-04-16T21:50:36.132Z]     at org.apache.maven.plugins.site.render.ReportDocumentRenderer.renderDocument
(ReportDocumentRenderer.java:230)
[2019-04-16T21:50:36.132Z]     at org.apache.maven.doxia.siterenderer.DefaultSiteRenderer.render
(DefaultSiteRenderer.java:349)
[2019-04-16T21:50:36.132Z]     at org.apache.maven.plugins.site.render.SiteMojo.renderLocale
(SiteMojo.java:198)
[2019-04-16T21:50:36.132Z]     at org.apache.maven.plugins.site.render.SiteMojo.execute (SiteMojo.java:147)
[2019-04-16T21:50:36.132Z]     at org.apache.maven.plugin.DefaultBuildPluginManager.executeMojo
(DefaultBuildPluginManager.java:137)
[2019-04-16T21:50:36.132Z]     at org.apache.maven.lifecycle.internal.MojoExecutor.execute
(MojoExecutor.java:210)
[2019-04-16T21:50:36.132Z]     at org.apache.maven.lifecycle.internal.MojoExecutor.execute
(MojoExecutor.java:156)
[2019-04-16T21:50:36.132Z]     at org.apache.maven.lifecycle.internal.MojoExecutor.execute
(MojoExecutor.java:148)
[2019-04-16T21:50:36.132Z]     at org.apache.maven.lifecycle.internal.LifecycleModuleBuilder.buildProject
(LifecycleModuleBuilder.java:117)
[2019-04-16T21:50:36.132Z]     at org.apache.maven.lifecycle.internal.LifecycleModuleBuilder.buildProject
(LifecycleModuleBuilder.java:81)
[2019-04-16T21:50:36.132Z]     at org.apache.maven.lifecycle.internal.builder.singlethreaded.SingleThreadedBuilder.build
(SingleThreadedBuilder.java:56)
[2019-04-16T21:50:36.132Z]     at org.apache.maven.lifecycle.internal.LifecycleStarter.execute
(LifecycleStarter.java:128)
[2019-04-16T21:50:36.132Z]     at org.apache.maven.DefaultMaven.doExecute (DefaultMaven.java:305)
[2019-04-16T21:50:36.132Z]     at org.apache.maven.DefaultMaven.doExecute (DefaultMaven.java:192)
[2019-04-16T21:50:36.132Z]     at org.apache.maven.DefaultMaven.execute (DefaultMaven.java:105)
[2019-04-16T21:50:36.132Z]     at org.apache.maven.cli.MavenCli.execute (MavenCli.java:956)
[2019-04-16T21:50:36.132Z]     at org.apache.maven.cli.MavenCli.doMain (MavenCli.java:288)
[2019-04-16T21:50:36.132Z]     at org.apache.maven.cli.MavenCli.main (MavenCli.java:192)
[2019-04-16T21:50:36.133Z]     at sun.reflect.NativeMethodAccessorImpl.invoke0 (Native Method)
[2019-04-16T21:50:36.133Z]     at sun.reflect.NativeMethodAccessorImpl.invoke (NativeMethodAccessorImpl.java:62)
[2019-04-16T21:50:36.133Z]     at sun.reflect.DelegatingMethodAccessorImpl.invoke (DelegatingMethodAccessorImpl.java:43)
[2019-04-16T21:50:36.133Z]     at java.lang.reflect.Method.invoke (Method.java:498)
[2019-04-16T21:50:36.133Z]     at org.codehaus.plexus.classworlds.launcher.Launcher.launchEnhanced
(Launcher.java:289)
[2019-04-16T21:50:36.133Z]     at org.codehaus.plexus.classworlds.launcher.Launcher.launch
(Launcher.java:229)
[2019-04-16T21:50:36.133Z]     at org.codehaus.plexus.classworlds.launcher.Launcher.mainWithExitCode
(Launcher.java:415)
[2019-04-16T21:50:36.133Z]     at org.codehaus.plexus.classworlds.launcher.Launcher.main (Launcher.java:356)
[2019-04-16T21:50:36.133Z] [ERROR] 
[2019-04-16T21:50:36.133Z] [ERROR] Re-run Maven using the -X switch to enable full debug logging.
[2019-04-16T21:50:36.133Z] [ERROR] 
[2019-04-16T21:50:36.133Z] [ERROR] For more information about the errors and possible solutions,
please read the following articles:
[2019-04-16T21:50:36.133Z] [ERROR] [Help 1] http://cwiki.apache.org/confluence/display/MAVEN/MojoExecutionException
[Pipeline] }
[2019-04-16T21:50:38.080Z] [withMaven] junitPublisher - Archive test results for Maven artifact
org.apache.maven.dist.tools:dist-tool-plugin:maven-plugin:1.0-SNAPSHOT generated by maven-surefire-plugin:test
(default-test): target/surefire-reports/*.xml
[2019-04-16T21:50:38.080Z] Recording test results
[2019-04-16T21:50:38.736Z] [withMaven] junitPublisher - Archive test results for Maven artifact
org.apache.maven.dist.tools:dist-tool-plugin:maven-plugin:1.0-SNAPSHOT generated by maven-surefire-plugin:test
(default-test): target/surefire-reports/*.xml
[2019-04-16T21:50:38.736Z] Recording test results
[2019-04-16T21:50:40.637Z] [withMaven] openTasksPublisher - Scan Tasks for Maven artifact
org.apache.maven.dist.tools:dist-tool-plugin:maven-plugin:1.0-SNAPSHOT in source directory
src/main/java
[2019-04-16T21:50:40.811Z] [TASKS] Scanning folder '/home/jenkins/jenkins-slave/workspace/maven-box_maven-dist-tool_master'
for files matching the pattern 'src/main/java/**/*' - excludes: null
[2019-04-16T21:50:40.811Z] [TASKS] Found 22 files to scan for tasks
[2019-04-16T21:50:40.811Z] [TASKS] Found 2 open tasks.
[2019-04-16T21:50:40.811Z] Skipping warnings blame since pipelines do not have an SCM link.%n
[2019-04-16T21:50:40.894Z] [TASKS] Computing warning deltas based on reference build #52
[2019-04-16T21:50:41.049Z] [withMaven] Publishers: Pipeline Graph Publisher: 3 ms, Junit Publisher:
1323 ms, Dependencies Fingerprint Publisher: 1 ms, Jacoco Publisher: 1 ms, SpotBugs Publisher:
1 ms, Open Task Scanner Publisher: 566 ms
[Pipeline] // withMaven
[Pipeline] }
[Pipeline] // stage
[Pipeline] stage
[Pipeline] { (Declarative: Post Actions)
[Pipeline] echo
[2019-04-16T21:50:41.556Z] Build result: FAILURE
[Pipeline] jiraIssueSelector
[Pipeline] emailext
Mime
  • Unnamed multipart/mixed (inline, None, 0 bytes)
View raw message