maven-notifications mailing list archives

Site index · List index
Message view « Date » · « Thread »
Top « Date » · « Thread »
From Apache Jenkins Server <jenk...@builds.apache.org>
Subject Build failed in Jenkins: Maven TLP » maven-surefire » 1546-1222 #5
Date Wed, 03 Apr 2019 22:50:52 GMT
See https://builds.apache.org/job/maven-box/job/maven-surefire/job/1546-1222/5/

Changes:

* covered ForkedChannelDecoder and ForkedChannelEncoder
* covered ForkedChannelDecoder and ForkedChannelEncoder
* covered ForkedChannelDecoder and ForkedChannelEncoder
* covered ForkedChannelDecoder and ForkedChannelEncoder
* covered ForkedChannelDecoder and ForkedChannelEncoder
* covered ForkedChannelDecoder and ForkedChannelEncoder
* covered ForkedChannelDecoder and ForkedChannelEncoder
* covered ForkedChannelDecoder and ForkedChannelEncoder

1 tests failed.
FAILED:  org.apache.maven.surefire.its.JUnitPlatformIT.testJupiterEngineWithDisplayNames

Error Message:
Did not find expected message in log

Stack Trace:
junit.framework.AssertionFailedError: Did not find expected message in log
	at org.apache.maven.surefire.its.JUnitPlatformIT.testJupiterEngineWithDisplayNames(JUnitPlatformIT.java:55)




Build log:
[...truncated 44211 lines...]
[2019-04-03T22:50:40.156Z] [ERROR] Failed to execute goal org.apache.maven.plugins:maven-failsafe-plugin:3.0.0-M3:verify
(default) on project surefire-its: There are test failures.
[2019-04-03T22:50:40.156Z] [ERROR] 
[2019-04-03T22:50:40.156Z] [ERROR] Please refer to C:\Users\jenkins\AppData\Local\Temp\2\jenkins-maven-box-maven-surefire-1546-1222-5@2\surefire-its\target\failsafe-reports
for the individual test results.
[2019-04-03T22:50:40.156Z] [ERROR] Please refer to dump files (if any exist) [date].dump,
[date]-jvmRun[N].dump and [date].dumpstream.
[2019-04-03T22:50:40.156Z] [ERROR] -> [Help 1]
[2019-04-03T22:50:40.156Z] org.apache.maven.lifecycle.LifecycleExecutionException: Failed
to execute goal org.apache.maven.plugins:maven-failsafe-plugin:3.0.0-M3:verify (default) on
project surefire-its: There are test failures.
[2019-04-03T22:50:40.156Z] 
[2019-04-03T22:50:40.156Z] Please refer to C:\Users\jenkins\AppData\Local\Temp\2\jenkins-maven-box-maven-surefire-1546-1222-5@2\surefire-its\target\failsafe-reports
for the individual test results.
[2019-04-03T22:50:40.156Z] Please refer to dump files (if any exist) [date].dump, [date]-jvmRun[N].dump
and [date].dumpstream.
[2019-04-03T22:50:40.156Z]     at org.apache.maven.lifecycle.internal.MojoExecutor.execute
(MojoExecutor.java:215)
[2019-04-03T22:50:40.156Z]     at org.apache.maven.lifecycle.internal.MojoExecutor.execute
(MojoExecutor.java:156)
[2019-04-03T22:50:40.156Z]     at org.apache.maven.lifecycle.internal.MojoExecutor.execute
(MojoExecutor.java:148)
[2019-04-03T22:50:40.156Z]     at org.apache.maven.lifecycle.internal.LifecycleModuleBuilder.buildProject
(LifecycleModuleBuilder.java:117)
[2019-04-03T22:50:40.156Z]     at org.apache.maven.lifecycle.internal.LifecycleModuleBuilder.buildProject
(LifecycleModuleBuilder.java:81)
[2019-04-03T22:50:40.156Z]     at org.apache.maven.lifecycle.internal.builder.singlethreaded.SingleThreadedBuilder.build
(SingleThreadedBuilder.java:56)
[2019-04-03T22:50:40.156Z]     at org.apache.maven.lifecycle.internal.LifecycleStarter.execute
(LifecycleStarter.java:128)
[2019-04-03T22:50:40.156Z]     at org.apache.maven.DefaultMaven.doExecute (DefaultMaven.java:305)
[2019-04-03T22:50:40.156Z]     at org.apache.maven.DefaultMaven.doExecute (DefaultMaven.java:192)
[2019-04-03T22:50:40.156Z]     at org.apache.maven.DefaultMaven.execute (DefaultMaven.java:105)
[2019-04-03T22:50:40.156Z]     at org.apache.maven.cli.MavenCli.execute (MavenCli.java:956)
[2019-04-03T22:50:40.156Z]     at org.apache.maven.cli.MavenCli.doMain (MavenCli.java:288)
[2019-04-03T22:50:40.156Z]     at org.apache.maven.cli.MavenCli.main (MavenCli.java:192)
[2019-04-03T22:50:40.156Z]     at sun.reflect.NativeMethodAccessorImpl.invoke0 (Native Method)
[2019-04-03T22:50:40.156Z]     at sun.reflect.NativeMethodAccessorImpl.invoke (NativeMethodAccessorImpl.java:62)
[2019-04-03T22:50:40.156Z]     at sun.reflect.DelegatingMethodAccessorImpl.invoke (DelegatingMethodAccessorImpl.java:43)
[2019-04-03T22:50:40.156Z]     at java.lang.reflect.Method.invoke (Method.java:498)
[2019-04-03T22:50:40.156Z]     at org.codehaus.plexus.classworlds.launcher.Launcher.launchEnhanced
(Launcher.java:289)
[2019-04-03T22:50:40.156Z]     at org.codehaus.plexus.classworlds.launcher.Launcher.launch
(Launcher.java:229)
[2019-04-03T22:50:40.156Z]     at org.codehaus.plexus.classworlds.launcher.Launcher.mainWithExitCode
(Launcher.java:415)
[2019-04-03T22:50:40.156Z]     at org.codehaus.plexus.classworlds.launcher.Launcher.main (Launcher.java:356)
[2019-04-03T22:50:40.157Z] Caused by: org.apache.maven.plugin.MojoFailureException: There
are test failures.
[2019-04-03T22:50:40.157Z] 
[2019-04-03T22:50:40.157Z] Please refer to C:\Users\jenkins\AppData\Local\Temp\2\jenkins-maven-box-maven-surefire-1546-1222-5@2\surefire-its\target\failsafe-reports
for the individual test results.
[2019-04-03T22:50:40.157Z] Please refer to dump files (if any exist) [date].dump, [date]-jvmRun[N].dump
and [date].dumpstream.
[2019-04-03T22:50:40.157Z]     at org.apache.maven.plugin.surefire.SurefireHelper.throwException
(SurefireHelper.java:271)
[2019-04-03T22:50:40.157Z]     at org.apache.maven.plugin.surefire.SurefireHelper.reportExecution
(SurefireHelper.java:159)
[2019-04-03T22:50:40.157Z]     at org.apache.maven.plugin.failsafe.VerifyMojo.execute (VerifyMojo.java:192)
[2019-04-03T22:50:40.157Z]     at org.apache.maven.plugin.DefaultBuildPluginManager.executeMojo
(DefaultBuildPluginManager.java:137)
[2019-04-03T22:50:40.157Z]     at org.apache.maven.lifecycle.internal.MojoExecutor.execute
(MojoExecutor.java:210)
[2019-04-03T22:50:40.157Z]     at org.apache.maven.lifecycle.internal.MojoExecutor.execute
(MojoExecutor.java:156)
[2019-04-03T22:50:40.157Z]     at org.apache.maven.lifecycle.internal.MojoExecutor.execute
(MojoExecutor.java:148)
[2019-04-03T22:50:40.157Z]     at org.apache.maven.lifecycle.internal.LifecycleModuleBuilder.buildProject
(LifecycleModuleBuilder.java:117)
[2019-04-03T22:50:40.157Z]     at org.apache.maven.lifecycle.internal.LifecycleModuleBuilder.buildProject
(LifecycleModuleBuilder.java:81)
[2019-04-03T22:50:40.157Z]     at org.apache.maven.lifecycle.internal.builder.singlethreaded.SingleThreadedBuilder.build
(SingleThreadedBuilder.java:56)
[2019-04-03T22:50:40.157Z]     at org.apache.maven.lifecycle.internal.LifecycleStarter.execute
(LifecycleStarter.java:128)
[2019-04-03T22:50:40.157Z]     at org.apache.maven.DefaultMaven.doExecute (DefaultMaven.java:305)
[2019-04-03T22:50:40.157Z]     at org.apache.maven.DefaultMaven.doExecute (DefaultMaven.java:192)
[2019-04-03T22:50:40.157Z]     at org.apache.maven.DefaultMaven.execute (DefaultMaven.java:105)
[2019-04-03T22:50:40.157Z]     at org.apache.maven.cli.MavenCli.execute (MavenCli.java:956)
[2019-04-03T22:50:40.157Z]     at org.apache.maven.cli.MavenCli.doMain (MavenCli.java:288)
[2019-04-03T22:50:40.157Z]     at org.apache.maven.cli.MavenCli.main (MavenCli.java:192)
[2019-04-03T22:50:40.157Z]     at sun.reflect.NativeMethodAccessorImpl.invoke0 (Native Method)
[2019-04-03T22:50:40.157Z]     at sun.reflect.NativeMethodAccessorImpl.invoke (NativeMethodAccessorImpl.java:62)
[2019-04-03T22:50:40.157Z]     at sun.reflect.DelegatingMethodAccessorImpl.invoke (DelegatingMethodAccessorImpl.java:43)
[2019-04-03T22:50:40.157Z]     at java.lang.reflect.Method.invoke (Method.java:498)
[2019-04-03T22:50:40.157Z]     at org.codehaus.plexus.classworlds.launcher.Launcher.launchEnhanced
(Launcher.java:289)
[2019-04-03T22:50:40.157Z]     at org.codehaus.plexus.classworlds.launcher.Launcher.launch
(Launcher.java:229)
[2019-04-03T22:50:40.157Z]     at org.codehaus.plexus.classworlds.launcher.Launcher.mainWithExitCode
(Launcher.java:415)
[2019-04-03T22:50:40.157Z]     at org.codehaus.plexus.classworlds.launcher.Launcher.main (Launcher.java:356)
[2019-04-03T22:50:40.157Z] [ERROR] 
[2019-04-03T22:50:40.157Z] [ERROR] Re-run Maven using the -X switch to enable full debug logging.
[2019-04-03T22:50:40.157Z] [ERROR] 
[2019-04-03T22:50:40.157Z] [ERROR] For more information about the errors and possible solutions,
please read the following articles:
[2019-04-03T22:50:40.157Z] [ERROR] [Help 1] http://cwiki.apache.org/confluence/display/MAVEN/MojoFailureException
[2019-04-03T22:50:40.157Z] [ERROR] 
[2019-04-03T22:50:40.157Z] [ERROR] After correcting the problems, you can resume the build
with the command
[2019-04-03T22:50:40.157Z] [ERROR]   mvn <goals> -rf :surefire-its
[2019-04-03T22:50:40.162Z] [ERROR] Tests run: 6, Failures: 1, Errors: 0, Skipped: 0, Time
elapsed: 69.181 s <<< FAILURE! - in org.apache.maven.surefire.its.JUnitPlatformIT
[2019-04-03T22:50:40.162Z] [ERROR] testJupiterEngineWithDisplayNames(org.apache.maven.surefire.its.JUnitPlatformIT)
 Time elapsed: 8.723 s  <<< FAILURE!
[2019-04-03T22:50:40.162Z] junit.framework.AssertionFailedError: Did not find expected message
in log
[2019-04-03T22:50:40.162Z] 	at org.apache.maven.surefire.its.JUnitPlatformIT.testJupiterEngineWithDisplayNames(JUnitPlatformIT.java:55)
[2019-04-03T22:50:40.162Z] 
[2019-04-03T22:50:40.162Z] [INFO] 
[2019-04-03T22:50:40.162Z] [INFO] Results:
[2019-04-03T22:50:40.162Z] [INFO] 
[2019-04-03T22:50:40.162Z] [ERROR] Failures: 
[2019-04-03T22:50:40.162Z] [ERROR]   JUnitPlatformIT.testJupiterEngineWithDisplayNames:55
Did not find expected message in log
[2019-04-03T22:50:40.162Z] [INFO] 
[2019-04-03T22:50:40.162Z] [ERROR] Tests run: 6, Failures: 1, Errors: 0, Skipped: 0
[2019-04-03T22:50:40.162Z] [INFO] 
[2019-04-03T22:50:40.162Z] [INFO] 
[2019-04-03T22:50:40.162Z] [INFO] --- maven-checkstyle-plugin:3.0.0:check (checkstyle-check)
@ surefire-its ---
[2019-04-03T22:50:40.162Z] [INFO] 
[2019-04-03T22:50:40.162Z] [INFO] --- maven-failsafe-plugin:3.0.0-M3:verify (default) @ surefire-its
---
[2019-04-03T22:50:40.162Z] [INFO] Failsafe report directory: C:\Users\jenkins\AppData\Local\Temp\2\jenkins-maven-box-maven-surefire-1546-1222-5\surefire-its\target\failsafe-reports
[2019-04-03T22:50:40.162Z] [INFO] ------------------------------------------------------------------------
[2019-04-03T22:50:40.162Z] [INFO] Reactor Summary for Apache Maven Surefire 3.0.0-SNAPSHOT:
[2019-04-03T22:50:40.162Z] [INFO] 
[2019-04-03T22:50:40.162Z] [INFO] Apache Maven Surefire .............................. SUCCESS
[01:10 min]
[2019-04-03T22:50:40.162Z] [INFO] SureFire Logger API ................................ SUCCESS
[ 14.647 s]
[2019-04-03T22:50:40.162Z] [INFO] SureFire API ....................................... SUCCESS
[ 27.583 s]
[2019-04-03T22:50:40.162Z] [INFO] SureFire Booter .................................... SUCCESS
[ 23.774 s]
[2019-04-03T22:50:40.162Z] [INFO] Maven Surefire Test-Grouping Support ............... SUCCESS
[ 14.833 s]
[2019-04-03T22:50:40.162Z] [INFO] SureFire Providers ................................. SUCCESS
[  1.725 s]
[2019-04-03T22:50:40.162Z] [INFO] Shared JUnit3 Provider Code ........................ SUCCESS
[  7.409 s]
[2019-04-03T22:50:40.162Z] [INFO] Shared Java 5 Provider Base ........................ SUCCESS
[  9.032 s]
[2019-04-03T22:50:40.162Z] [INFO] Shared JUnit4 Provider Code ........................ SUCCESS
[  9.249 s]
[2019-04-03T22:50:40.162Z] [INFO] Shared JUnit48 Provider Code ....................... SUCCESS
[ 10.841 s]
[2019-04-03T22:50:40.162Z] [INFO] SureFire JUnit Runner .............................. SUCCESS
[  8.178 s]
[2019-04-03T22:50:40.162Z] [INFO] SureFire JUnit4 Runner ............................. SUCCESS
[  8.043 s]
[2019-04-03T22:50:40.162Z] [INFO] Maven Surefire Common .............................. SUCCESS
[ 51.059 s]
[2019-04-03T22:50:40.162Z] [INFO] SureFire JUnitCore Runner .......................... SUCCESS
[02:29 min]
[2019-04-03T22:50:40.162Z] [INFO] SureFire JUnit Platform Runner ..................... SUCCESS
[ 17.482 s]
[2019-04-03T22:50:40.162Z] [INFO] SureFire TestNG Utils .............................. SUCCESS
[  8.159 s]
[2019-04-03T22:50:40.162Z] [INFO] SureFire TestNG Runner ............................. SUCCESS
[  9.284 s]
[2019-04-03T22:50:40.162Z] [INFO] ShadeFire JUnit3 Provider .......................... SUCCESS
[  3.382 s]
[2019-04-03T22:50:40.162Z] [INFO] Surefire Report Parser ............................. SUCCESS
[ 11.484 s]
[2019-04-03T22:50:40.162Z] [INFO] Maven Surefire Plugin .............................. SUCCESS
[ 21.713 s]
[2019-04-03T22:50:40.162Z] [INFO] Maven Failsafe Plugin .............................. SUCCESS
[02:21 min]
[2019-04-03T22:50:40.162Z] [INFO] Maven Surefire Report Plugin ....................... SUCCESS
[ 26.225 s]
[2019-04-03T22:50:40.162Z] [INFO] Maven Surefire Integration Tests ................... FAILURE
[01:55 min]
[2019-04-03T22:50:40.162Z] [INFO] ------------------------------------------------------------------------
[2019-04-03T22:50:40.162Z] [INFO] BUILD FAILURE
[2019-04-03T22:50:40.162Z] [INFO] ------------------------------------------------------------------------
[2019-04-03T22:50:40.163Z] [INFO] Total time:  12:44 min
[2019-04-03T22:50:40.163Z] [INFO] Finished at: 2019-04-03T15:50:34-07:00
[2019-04-03T22:50:40.163Z] [INFO] ------------------------------------------------------------------------
[2019-04-03T22:50:40.163Z] [ERROR] Failed to execute goal org.apache.maven.plugins:maven-failsafe-plugin:3.0.0-M3:verify
(default) on project surefire-its: There are test failures.
[2019-04-03T22:50:40.163Z] [ERROR] 
[2019-04-03T22:50:40.163Z] [ERROR] Please refer to C:\Users\jenkins\AppData\Local\Temp\2\jenkins-maven-box-maven-surefire-1546-1222-5\surefire-its\target\failsafe-reports
for the individual test results.
[2019-04-03T22:50:40.163Z] [ERROR] Please refer to dump files (if any exist) [date].dump,
[date]-jvmRun[N].dump and [date].dumpstream.
[2019-04-03T22:50:40.163Z] [ERROR] -> [Help 1]
[2019-04-03T22:50:40.163Z] org.apache.maven.lifecycle.LifecycleExecutionException: Failed
to execute goal org.apache.maven.plugins:maven-failsafe-plugin:3.0.0-M3:verify (default) on
project surefire-its: There are test failures.
[2019-04-03T22:50:40.163Z] 
[2019-04-03T22:50:40.163Z] Please refer to C:\Users\jenkins\AppData\Local\Temp\2\jenkins-maven-box-maven-surefire-1546-1222-5\surefire-its\target\failsafe-reports
for the individual test results.
[2019-04-03T22:50:40.163Z] Please refer to dump files (if any exist) [date].dump, [date]-jvmRun[N].dump
and [date].dumpstream.
[2019-04-03T22:50:40.163Z]     at org.apache.maven.lifecycle.internal.MojoExecutor.execute
(MojoExecutor.java:215)
[2019-04-03T22:50:40.163Z]     at org.apache.maven.lifecycle.internal.MojoExecutor.execute
(MojoExecutor.java:156)
[2019-04-03T22:50:40.163Z]     at org.apache.maven.lifecycle.internal.MojoExecutor.execute
(MojoExecutor.java:148)
[2019-04-03T22:50:40.163Z]     at org.apache.maven.lifecycle.internal.LifecycleModuleBuilder.buildProject
(LifecycleModuleBuilder.java:117)
[2019-04-03T22:50:40.163Z]     at org.apache.maven.lifecycle.internal.LifecycleModuleBuilder.buildProject
(LifecycleModuleBuilder.java:81)
[2019-04-03T22:50:40.163Z]     at org.apache.maven.lifecycle.internal.builder.singlethreaded.SingleThreadedBuilder.build
(SingleThreadedBuilder.java:56)
[2019-04-03T22:50:40.163Z]     at org.apache.maven.lifecycle.internal.LifecycleStarter.execute
(LifecycleStarter.java:128)
[2019-04-03T22:50:40.163Z]     at org.apache.maven.DefaultMaven.doExecute (DefaultMaven.java:305)
[2019-04-03T22:50:40.163Z]     at org.apache.maven.DefaultMaven.doExecute (DefaultMaven.java:192)
[2019-04-03T22:50:40.163Z]     at org.apache.maven.DefaultMaven.execute (DefaultMaven.java:105)
[2019-04-03T22:50:40.163Z]     at org.apache.maven.cli.MavenCli.execute (MavenCli.java:956)
[2019-04-03T22:50:40.163Z]     at org.apache.maven.cli.MavenCli.doMain (MavenCli.java:288)
[2019-04-03T22:50:40.163Z]     at org.apache.maven.cli.MavenCli.main (MavenCli.java:192)
[2019-04-03T22:50:40.163Z]     at sun.reflect.NativeMethodAccessorImpl.invoke0 (Native Method)
[2019-04-03T22:50:40.163Z]     at sun.reflect.NativeMethodAccessorImpl.invoke (NativeMethodAccessorImpl.java:62)
[2019-04-03T22:50:40.163Z]     at sun.reflect.DelegatingMethodAccessorImpl.invoke (DelegatingMethodAccessorImpl.java:43)
[2019-04-03T22:50:40.163Z]     at java.lang.reflect.Method.invoke (Method.java:498)
[2019-04-03T22:50:40.163Z]     at org.codehaus.plexus.classworlds.launcher.Launcher.launchEnhanced
(Launcher.java:289)
[2019-04-03T22:50:40.163Z]     at org.codehaus.plexus.classworlds.launcher.Launcher.launch
(Launcher.java:229)
[2019-04-03T22:50:40.163Z]     at org.codehaus.plexus.classworlds.launcher.Launcher.mainWithExitCode
(Launcher.java:415)
[2019-04-03T22:50:40.163Z]     at org.codehaus.plexus.classworlds.launcher.Launcher.main (Launcher.java:356)
[2019-04-03T22:50:40.163Z] Caused by: org.apache.maven.plugin.MojoFailureException: There
are test failures.
[2019-04-03T22:50:40.163Z] 
[2019-04-03T22:50:40.163Z] Please refer to C:\Users\jenkins\AppData\Local\Temp\2\jenkins-maven-box-maven-surefire-1546-1222-5\surefire-its\target\failsafe-reports
for the individual test results.
[2019-04-03T22:50:40.163Z] Please refer to dump files (if any exist) [date].dump, [date]-jvmRun[N].dump
and [date].dumpstream.
[2019-04-03T22:50:40.163Z]     at org.apache.maven.plugin.surefire.SurefireHelper.throwException
(SurefireHelper.java:271)
[2019-04-03T22:50:40.163Z]     at org.apache.maven.plugin.surefire.SurefireHelper.reportExecution
(SurefireHelper.java:159)
[2019-04-03T22:50:40.163Z]     at org.apache.maven.plugin.failsafe.VerifyMojo.execute (VerifyMojo.java:192)
[2019-04-03T22:50:40.163Z]     at org.apache.maven.plugin.DefaultBuildPluginManager.executeMojo
(DefaultBuildPluginManager.java:137)
[2019-04-03T22:50:40.163Z]     at org.apache.maven.lifecycle.internal.MojoExecutor.execute
(MojoExecutor.java:210)
[2019-04-03T22:50:40.163Z]     at org.apache.maven.lifecycle.internal.MojoExecutor.execute
(MojoExecutor.java:156)
[2019-04-03T22:50:40.163Z]     at org.apache.maven.lifecycle.internal.MojoExecutor.execute
(MojoExecutor.java:148)
[2019-04-03T22:50:40.163Z]     at org.apache.maven.lifecycle.internal.LifecycleModuleBuilder.buildProject
(LifecycleModuleBuilder.java:117)
[2019-04-03T22:50:40.163Z]     at org.apache.maven.lifecycle.internal.LifecycleModuleBuilder.buildProject
(LifecycleModuleBuilder.java:81)
[2019-04-03T22:50:40.163Z]     at org.apache.maven.lifecycle.internal.builder.singlethreaded.SingleThreadedBuilder.build
(SingleThreadedBuilder.java:56)
[2019-04-03T22:50:40.163Z]     at org.apache.maven.lifecycle.internal.LifecycleStarter.execute
(LifecycleStarter.java:128)
[2019-04-03T22:50:40.163Z]     at org.apache.maven.DefaultMaven.doExecute (DefaultMaven.java:305)
[2019-04-03T22:50:40.163Z]     at org.apache.maven.DefaultMaven.doExecute (DefaultMaven.java:192)
[2019-04-03T22:50:40.163Z]     at org.apache.maven.DefaultMaven.execute (DefaultMaven.java:105)
[2019-04-03T22:50:40.163Z]     at org.apache.maven.cli.MavenCli.execute (MavenCli.java:956)
[2019-04-03T22:50:40.163Z]     at org.apache.maven.cli.MavenCli.doMain (MavenCli.java:288)
[2019-04-03T22:50:40.163Z]     at org.apache.maven.cli.MavenCli.main (MavenCli.java:192)
[2019-04-03T22:50:40.163Z]     at sun.reflect.NativeMethodAccessorImpl.invoke0 (Native Method)
[2019-04-03T22:50:40.163Z]     at sun.reflect.NativeMethodAccessorImpl.invoke (NativeMethodAccessorImpl.java:62)
[2019-04-03T22:50:40.163Z]     at sun.reflect.DelegatingMethodAccessorImpl.invoke (DelegatingMethodAccessorImpl.java:43)
[2019-04-03T22:50:40.163Z]     at java.lang.reflect.Method.invoke (Method.java:498)
[2019-04-03T22:50:40.163Z]     at org.codehaus.plexus.classworlds.launcher.Launcher.launchEnhanced
(Launcher.java:289)
[2019-04-03T22:50:40.163Z]     at org.codehaus.plexus.classworlds.launcher.Launcher.launch
(Launcher.java:229)
[2019-04-03T22:50:40.163Z]     at org.codehaus.plexus.classworlds.launcher.Launcher.mainWithExitCode
(Launcher.java:415)
[2019-04-03T22:50:40.163Z]     at org.codehaus.plexus.classworlds.launcher.Launcher.main (Launcher.java:356)
[2019-04-03T22:50:40.163Z] [ERROR] 
[2019-04-03T22:50:40.163Z] [ERROR] Re-run Maven using the -X switch to enable full debug logging.
[2019-04-03T22:50:40.163Z] [ERROR] 
[2019-04-03T22:50:40.163Z] [ERROR] For more information about the errors and possible solutions,
please read the following articles:
[2019-04-03T22:50:40.163Z] [ERROR] [Help 1] http://cwiki.apache.org/confluence/display/MAVEN/MojoFailureException
[2019-04-03T22:50:40.163Z] [ERROR] 
[2019-04-03T22:50:40.163Z] [ERROR] After correcting the problems, you can resume the build
with the command
[2019-04-03T22:50:40.163Z] [ERROR]   mvn <goals> -rf :surefire-its
[Pipeline] }
[Pipeline] }
[Pipeline] // withEnv
[Pipeline] // withEnv
[Pipeline] }
[Pipeline] }
[Pipeline] // stage
[Pipeline] // stage
[Pipeline] fileExists
[Pipeline] fileExists
[Pipeline] zip
[Pipeline] zip
[2019-04-03T22:50:40.389Z] Writing zip file of C:\Users\jenkins\AppData\Local\Temp\2\jenkins-maven-box-maven-surefire-1546-1222-5\maven-failsafe-plugin\target\it
to C:\Users\jenkins\AppData\Local\Temp\2\jenkins-maven-box-maven-surefire-1546-1222-5\maven-failsafe-plugin--windows-jdk12-maven3.6.x.zip
[2019-04-03T22:50:40.413Z] Writing zip file of C:\Users\jenkins\AppData\Local\Temp\2\jenkins-maven-box-maven-surefire-1546-1222-5@2\maven-failsafe-plugin\target\it
to C:\Users\jenkins\AppData\Local\Temp\2\jenkins-maven-box-maven-surefire-1546-1222-5@2\maven-failsafe-plugin--windows-jdk11-maven3.6.x.zip
[2019-04-03T22:50:40.522Z] Zipped 78 entries.
[2019-04-03T22:50:40.522Z] Archiving C:\Users\jenkins\AppData\Local\Temp\2\jenkins-maven-box-maven-surefire-1546-1222-5\maven-failsafe-plugin--windows-jdk12-maven3.6.x.zip
[2019-04-03T22:50:40.523Z] [Fast Archiver] No prior successful build to compare, so performing
full copy of artifacts
[2019-04-03T22:50:40.533Z] Zipped 78 entries.
[2019-04-03T22:50:40.533Z] Archiving C:\Users\jenkins\AppData\Local\Temp\2\jenkins-maven-box-maven-surefire-1546-1222-5@2\maven-failsafe-plugin--windows-jdk11-maven3.6.x.zip
[2019-04-03T22:50:40.534Z] [Fast Archiver] No prior successful build to compare, so performing
full copy of artifacts
[Pipeline] fileExists
[Pipeline] fileExists
[Pipeline] zip
[Pipeline] zip
[2019-04-03T22:50:40.655Z] Writing zip file of C:\Users\jenkins\AppData\Local\Temp\2\jenkins-maven-box-maven-surefire-1546-1222-5\surefire-its\target
to C:\Users\jenkins\AppData\Local\Temp\2\jenkins-maven-box-maven-surefire-1546-1222-5\surefire-its--windows-jdk12-maven3.6.x.zip
[2019-04-03T22:50:40.673Z] Writing zip file of C:\Users\jenkins\AppData\Local\Temp\2\jenkins-maven-box-maven-surefire-1546-1222-5@2\surefire-its\target
to C:\Users\jenkins\AppData\Local\Temp\2\jenkins-maven-box-maven-surefire-1546-1222-5@2\surefire-its--windows-jdk11-maven3.6.x.zip
[2019-04-03T22:50:50.202Z] Zipped 1963 entries.
[2019-04-03T22:50:50.202Z] Archiving C:\Users\jenkins\AppData\Local\Temp\2\jenkins-maven-box-maven-surefire-1546-1222-5\surefire-its--windows-jdk12-maven3.6.x.zip
[2019-04-03T22:50:50.202Z] Zipped 1963 entries.
[2019-04-03T22:50:50.203Z] [Fast Archiver] No prior successful build to compare, so performing
full copy of artifacts
[2019-04-03T22:50:50.203Z] Archiving C:\Users\jenkins\AppData\Local\Temp\2\jenkins-maven-box-maven-surefire-1546-1222-5@2\surefire-its--windows-jdk11-maven3.6.x.zip
[2019-04-03T22:50:50.203Z] [Fast Archiver] No prior successful build to compare, so performing
full copy of artifacts
[Pipeline] archiveArtifacts
[2019-04-03T22:50:50.656Z] Archiving artifacts
[2019-04-03T22:50:50.696Z] [Fast Archiver] No prior successful build to compare, so performing
full copy of artifacts
[Pipeline] archiveArtifacts
[2019-04-03T22:50:50.884Z] Archiving artifacts
[2019-04-03T22:50:50.927Z] [Fast Archiver] No prior successful build to compare, so performing
full copy of artifacts
[Pipeline] cleanWs
[2019-04-03T22:50:51.291Z] [WS-CLEANUP] Deleting project workspace...
[2019-04-03T22:50:51.291Z] [WS-CLEANUP] Deferred wipeout is used...
[2019-04-03T22:50:51.405Z] [WS-CLEANUP] done
[Pipeline] }
[Pipeline] // ws
[Pipeline] }
[Pipeline] // timestamps
[Pipeline] }
[Pipeline] // node
[Pipeline] }
[Pipeline] cleanWs
[2019-04-03T22:50:51.611Z] [WS-CLEANUP] Deleting project workspace...
[2019-04-03T22:50:51.611Z] [WS-CLEANUP] Deferred wipeout is used...
[2019-04-03T22:50:51.703Z] [WS-CLEANUP] done
[Pipeline] }
[Pipeline] // ws
[Pipeline] }
[Pipeline] // timestamps
[Pipeline] }
[Pipeline] // node
[Pipeline] }
[Pipeline] // parallel
[Pipeline] echo
Build result: FAILURE
[Pipeline] jiraIssueSelector
[Pipeline] emailext
Mime
  • Unnamed multipart/mixed (inline, None, 0 bytes)
View raw message