maven-notifications mailing list archives

Site index · List index
Message view « Date » · « Thread »
Top « Date » · « Thread »
From Apache Jenkins Server <jenk...@builds.apache.org>
Subject Build unstable in Jenkins: Maven TLP » maven » MNG-6646 #1
Date Fri, 19 Apr 2019 22:21:22 GMT
See https://builds.apache.org/job/maven-box/job/maven/job/MNG-6646/1/

No changes.

1 tests failed.
FAILED:  org.apache.maven.it.MavenITmng0553SettingsAuthzEncryptionTest.windows-jdk7 / Run ITs Windows Java 7 / testitBasic

Error Message:
Exit code was non-zero: 1; command line and log = 
C:\mvn-it-0.tmp\core-it-suite\target\apache-maven\bin\mvn --global-settings C:\mvn-it-0.tmp\core-it-suite\target\test-classes\settings.xml --settings settings.xml -e --batch-mode -Dmaven.repo.local=c:\mvn-it-0.tmp\it-local-repo validate
[INFO] [jenkins-event-spy] Jenkins Maven Event Spy is disabled
[INFO] Error stacktraces are turned on.
[INFO] Scanning for projects...
[INFO] 
[INFO] -----------------< org.apache.maven.its.mng0553:test >------------------
[INFO] Building Maven Integration Test :: MNG-533 1.0-SNAPSHOT
[INFO] --------------------------------[ jar ]---------------------------------
[INFO] Downloading from test: http://localhost:-1/org/apache/maven/its/mng0553/a/0.1-SNAPSHOT/maven-metadata.xml
[WARNING] Could not transfer metadata org.apache.maven.its.mng0553:a:0.1-SNAPSHOT/maven-metadata.xml from/to test (http://localhost:-1/): Connect to localhost:80 [localhost/127.0.0.1, localhost/0:0:0:0:0:0:0:1] failed: Connection refused: connect
[WARNING] Failure to transfer org.apache.maven.its.mng0553:a:0.1-SNAPSHOT/maven-metadata.xml from http://localhost:-1/ was cached in the local repository, resolution will not be reattempted until the update interval of test has elapsed or updates are forced. Original error: Could not transfer metadata org.apache.maven.its.mng0553:a:0.1-SNAPSHOT/maven-metadata.xml from/to test (http://localhost:-1/): Connect to localhost:80 [localhost/127.0.0.1, localhost/0:0:0:0:0:0:0:1] failed: Connection refused: connect
[INFO] Downloading from test: http://localhost:-1/org/apache/maven/its/mng0553/a/0.1-SNAPSHOT/a-0.1-SNAPSHOT.pom
[INFO] ------------------------------------------------------------------------
[INFO] BUILD FAILURE
[INFO] ------------------------------------------------------------------------
[INFO] Total time:  5.822 s
[INFO] Finished at: 2019-04-19T15:15:23-07:00
[INFO] ------------------------------------------------------------------------
[ERROR] Failed to execute goal on project test: Could not resolve dependencies for project org.apache.maven.its.mng0553:test:jar:1.0-SNAPSHOT: Failed to collect dependencies at org.apache.maven.its.mng0553:a:jar:0.1-SNAPSHOT: Failed to read artifact descriptor for org.apache.maven.its.mng0553:a:jar:0.1-SNAPSHOT: Could not transfer artifact org.apache.maven.its.mng0553:a:pom:0.1-SNAPSHOT from/to test (http://localhost:-1/): Connect to localhost:80 [localhost/127.0.0.1, localhost/0:0:0:0:0:0:0:1] failed: Connection refused: connect -> [Help 1]
org.apache.maven.lifecycle.LifecycleExecutionException: Failed to execute goal on project test: Could not resolve dependencies for project org.apache.maven.its.mng0553:test:jar:1.0-SNAPSHOT: Failed to collect dependencies at org.apache.maven.its.mng0553:a:jar:0.1-SNAPSHOT
    at org.apache.maven.lifecycle.internal.LifecycleDependencyResolver.getDependencies (LifecycleDependencyResolver.java:269)
    at org.apache.maven.lifecycle.internal.LifecycleDependencyResolver.resolveProjectDependencies (LifecycleDependencyResolver.java:147)
    at org.apache.maven.lifecycle.internal.MojoExecutor.ensureDependenciesAreResolved (MojoExecutor.java:248)
    at org.apache.maven.lifecycle.internal.MojoExecutor.execute (MojoExecutor.java:202)
    at org.apache.maven.lifecycle.internal.MojoExecutor.execute (MojoExecutor.java:156)
    at org.apache.maven.lifecycle.internal.MojoExecutor.execute (MojoExecutor.java:148)
    at org.apache.maven.lifecycle.internal.LifecycleModuleBuilder.buildProject (LifecycleModuleBuilder.java:117)
    at org.apache.maven.lifecycle.internal.LifecycleModuleBuilder.buildProject (LifecycleModuleBuilder.java:81)
    at org.apache.maven.lifecycle.internal.builder.singlethreaded.SingleThreadedBuilder.build (SingleThreadedBuilder.java:56)
    at org.apache.maven.lifecycle.internal.LifecycleStarter.execute (LifecycleStarter.java:128)
    at org.apache.maven.DefaultMaven.doExecute (DefaultMaven.java:305)
    at org.apache.maven.DefaultMaven.doExecute (DefaultMaven.java:192)
    at org.apache.maven.DefaultMaven.execute (DefaultMaven.java:105)
    at org.apache.maven.cli.MavenCli.execute (MavenCli.java:956)
    at org.apache.maven.cli.MavenCli.doMain (MavenCli.java:288)
    at org.apache.maven.cli.MavenCli.main (MavenCli.java:192)
    at sun.reflect.NativeMethodAccessorImpl.invoke0 (Native Method)
    at sun.reflect.NativeMethodAccessorImpl.invoke (NativeMethodAccessorImpl.java:57)
    at sun.reflect.DelegatingMethodAccessorImpl.invoke (DelegatingMethodAccessorImpl.java:43)
    at java.lang.reflect.Method.invoke (Method.java:606)
    at org.codehaus.plexus.classworlds.launcher.Launcher.launchEnhanced (Launcher.java:282)
    at org.codehaus.plexus.classworlds.launcher.Launcher.launch (Launcher.java:225)
    at org.codehaus.plexus.classworlds.launcher.Launcher.mainWithExitCode (Launcher.java:406)
    at org.codehaus.plexus.classworlds.launcher.Launcher.main (Launcher.java:347)
Caused by: org.apache.maven.project.DependencyResolutionException: Could not resolve dependencies for project org.apache.maven.its.mng0553:test:jar:1.0-SNAPSHOT: Failed to collect dependencies at org.apache.maven.its.mng0553:a:jar:0.1-SNAPSHOT
    at org.apache.maven.project.DefaultProjectDependenciesResolver.resolve (DefaultProjectDependenciesResolver.java:178)
    at org.apache.maven.lifecycle.internal.LifecycleDependencyResolver.getDependencies (LifecycleDependencyResolver.java:243)
    at org.apache.maven.lifecycle.internal.LifecycleDependencyResolver.resolveProjectDependencies (LifecycleDependencyResolver.java:147)
    at org.apache.maven.lifecycle.internal.MojoExecutor.ensureDependenciesAreResolved (MojoExecutor.java:248)
    at org.apache.maven.lifecycle.internal.MojoExecutor.execute (MojoExecutor.java:202)
    at org.apache.maven.lifecycle.internal.MojoExecutor.execute (MojoExecutor.java:156)
    at org.apache.maven.lifecycle.internal.MojoExecutor.execute (MojoExecutor.java:148)
    at org.apache.maven.lifecycle.internal.LifecycleModuleBuilder.buildProject (LifecycleModuleBuilder.java:117)
    at org.apache.maven.lifecycle.internal.LifecycleModuleBuilder.buildProject (LifecycleModuleBuilder.java:81)
    at org.apache.maven.lifecycle.internal.builder.singlethreaded.SingleThreadedBuilder.build (SingleThreadedBuilder.java:56)
    at org.apache.maven.lifecycle.internal.LifecycleStarter.execute (LifecycleStarter.java:128)
    at org.apache.maven.DefaultMaven.doExecute (DefaultMaven.java:305)
    at org.apache.maven.DefaultMaven.doExecute (DefaultMaven.java:192)
    at org.apache.maven.DefaultMaven.execute (DefaultMaven.java:105)
    at org.apache.maven.cli.MavenCli.execute (MavenCli.java:956)
    at org.apache.maven.cli.MavenCli.doMain (MavenCli.java:288)
    at org.apache.maven.cli.MavenCli.main (MavenCli.java:192)
    at sun.reflect.NativeMethodAccessorImpl.invoke0 (Native Method)
    at sun.reflect.NativeMethodAccessorImpl.invoke (NativeMethodAccessorImpl.java:57)
    at sun.reflect.DelegatingMethodAccessorImpl.invoke (DelegatingMethodAccessorImpl.java:43)
    at java.lang.reflect.Method.invoke (Method.java:606)
    at org.codehaus.plexus.classworlds.launcher.Launcher.launchEnhanced (Launcher.java:282)
    at org.codehaus.plexus.classworlds.launcher.Launcher.launch (Launcher.java:225)
    at org.codehaus.plexus.classworlds.launcher.Launcher.mainWithExitCode (Launcher.java:406)
    at org.codehaus.plexus.classworlds.launcher.Launcher.main (Launcher.java:347)
Caused by: org.eclipse.aether.collection.DependencyCollectionException: Failed to collect dependencies at org.apache.maven.its.mng0553:a:jar:0.1-SNAPSHOT
    at org.eclipse.aether.internal.impl.collect.DefaultDependencyCollector.collectDependencies (DefaultDependencyCollector.java:284)
    at org.eclipse.aether.internal.impl.DefaultRepositorySystem.collectDependencies (DefaultRepositorySystem.java:279)
    at org.apache.maven.project.DefaultProjectDependenciesResolver.resolve (DefaultProjectDependenciesResolver.java:169)
    at org.apache.maven.lifecycle.internal.LifecycleDependencyResolver.getDependencies (LifecycleDependencyResolver.java:243)
    at org.apache.maven.lifecycle.internal.LifecycleDependencyResolver.resolveProjectDependencies (LifecycleDependencyResolver.java:147)
    at org.apache.maven.lifecycle.internal.MojoExecutor.ensureDependenciesAreResolved (MojoExecutor.java:248)
    at org.apache.maven.lifecycle.internal.MojoExecutor.execute (MojoExecutor.java:202)
    at org.apache.maven.lifecycle.internal.MojoExecutor.execute (MojoExecutor.java:156)
    at org.apache.maven.lifecycle.internal.MojoExecutor.execute (MojoExecutor.java:148)
    at org.apache.maven.lifecycle.internal.LifecycleModuleBuilder.buildProject (LifecycleModuleBuilder.java:117)
    at org.apache.maven.lifecycle.internal.LifecycleModuleBuilder.buildProject (LifecycleModuleBuilder.java:81)
    at org.apache.maven.lifecycle.internal.builder.singlethreaded.SingleThreadedBuilder.build (SingleThreadedBuilder.java:56)
    at org.apache.maven.lifecycle.internal.LifecycleStarter.execute (LifecycleStarter.java:128)
    at org.apache.maven.DefaultMaven.doExecute (DefaultMaven.java:305)
    at org.apache.maven.DefaultMaven.doExecute (DefaultMaven.java:192)
    at org.apache.maven.DefaultMaven.execute (DefaultMaven.java:105)
    at org.apache.maven.cli.MavenCli.execute (MavenCli.java:956)
    at org.apache.maven.cli.MavenCli.doMain (MavenCli.java:288)
    at org.apache.maven.cli.MavenCli.main (MavenCli.java:192)
    at sun.reflect.NativeMethodAccessorImpl.invoke0 (Native Method)
    at sun.reflect.NativeMethodAccessorImpl.invoke (NativeMethodAccessorImpl.java:57)
    at sun.reflect.DelegatingMethodAccessorImpl.invoke (DelegatingMethodAccessorImpl.java:43)
    at java.lang.reflect.Method.invoke (Method.java:606)
    at org.codehaus.plexus.classworlds.launcher.Launcher.launchEnhanced (Launcher.java:282)
    at org.codehaus.plexus.classworlds.launcher.Launcher.launch (Launcher.java:225)
    at org.codehaus.plexus.classworlds.launcher.Launcher.mainWithExitCode (Launcher.java:406)
    at org.codehaus.plexus.classworlds.launcher.Launcher.main (Launcher.java:347)
Caused by: org.eclipse.aether.resolution.ArtifactDescriptorException: Failed to read artifact descriptor for org.apache.maven.its.mng0553:a:jar:0.1-SNAPSHOT
    at org.apache.maven.repository.internal.DefaultArtifactDescriptorReader.loadPom (DefaultArtifactDescriptorReader.java:255)
    at org.apache.maven.repository.internal.DefaultArtifactDescriptorReader.readArtifactDescriptor (DefaultArtifactDescriptorReader.java:171)
    at org.eclipse.aether.internal.impl.collect.DefaultDependencyCollector.resolveCachedArtifactDescriptor (DefaultDependencyCollector.java:530)
    at org.eclipse.aether.internal.impl.collect.DefaultDependencyCollector.getArtifactDescriptorResult (DefaultDependencyCollector.java:515)
    at org.eclipse.aether.internal.impl.collect.DefaultDependencyCollector.processDependency (DefaultDependencyCollector.java:403)
    at org.eclipse.aether.internal.impl.collect.DefaultDependencyCollector.processDependency (DefaultDependencyCollector.java:356)
    at org.eclipse.aether.internal.impl.collect.DefaultDependencyCollector.process (DefaultDependencyCollector.java:344)
    at org.eclipse.aether.internal.impl.collect.DefaultDependencyCollector.collectDependencies (DefaultDependencyCollector.java:247)
    at org.eclipse.aether.internal.impl.DefaultRepositorySystem.collectDependencies (DefaultRepositorySystem.java:279)
    at org.apache.maven.project.DefaultProjectDependenciesResolver.resolve (DefaultProjectDependenciesResolver.java:169)
    at org.apache.maven.lifecycle.internal.LifecycleDependencyResolver.getDependencies (LifecycleDependencyResolver.java:243)
    at org.apache.maven.lifecycle.internal.LifecycleDependencyResolver.resolveProjectDependencies (LifecycleDependencyResolver.java:147)
    at org.apache.maven.lifecycle.internal.MojoExecutor.ensureDependenciesAreResolved (MojoExecutor.java:248)
    at org.apache.maven.lifecycle.internal.MojoExecutor.execute (MojoExecutor.java:202)
    at org.apache.maven.lifecycle.internal.MojoExecutor.execute (MojoExecutor.java:156)
    at org.apache.maven.lifecycle.internal.MojoExecutor.execute (MojoExecutor.java:148)
    at org.apache.maven.lifecycle.internal.LifecycleModuleBuilder.buildProject (LifecycleModuleBuilder.java:117)
    at org.apache.maven.lifecycle.internal.LifecycleModuleBuilder.buildProject (LifecycleModuleBuilder.java:81)
    at org.apache.maven.lifecycle.internal.builder.singlethreaded.SingleThreadedBuilder.build (SingleThreadedBuilder.java:56)
    at org.apache.maven.lifecycle.internal.LifecycleStarter.execute (LifecycleStarter.java:128)
    at org.apache.maven.DefaultMaven.doExecute (DefaultMaven.java:305)
    at org.apache.maven.DefaultMaven.doExecute (DefaultMaven.java:192)
    at org.apache.maven.DefaultMaven.execute (DefaultMaven.java:105)
    at org.apache.maven.cli.MavenCli.execute (MavenCli.java:956)
    at org.apache.maven.cli.MavenCli.doMain (MavenCli.java:288)
    at org.apache.maven.cli.MavenCli.main (MavenCli.java:192)
    at sun.reflect.NativeMethodAccessorImpl.invoke0 (Native Method)
    at sun.reflect.NativeMethodAccessorImpl.invoke (NativeMethodAccessorImpl.java:57)
    at sun.reflect.DelegatingMethodAccessorImpl.invoke (DelegatingMethodAccessorImpl.java:43)
    at java.lang.reflect.Method.invoke (Method.java:606)
    at org.codehaus.plexus.classworlds.launcher.Launcher.launchEnhanced (Launcher.java:282)
    at org.codehaus.plexus.classworlds.launcher.Launcher.launch (Launcher.java:225)
    at org.codehaus.plexus.classworlds.launcher.Launcher.mainWithExitCode (Launcher.java:406)
    at org.codehaus.plexus.classworlds.launcher.Launcher.main (Launcher.java:347)
Caused by: org.eclipse.aether.resolution.ArtifactResolutionException: Could not transfer artifact org.apache.maven.its.mng0553:a:pom:0.1-SNAPSHOT from/to test (http://localhost:-1/): Connect to localhost:80 [localhost/127.0.0.1, localhost/0:0:0:0:0:0:0:1] failed: Connection refused: connect
    at org.eclipse.aether.internal.impl.DefaultArtifactResolver.resolve (DefaultArtifactResolver.java:423)
    at org.eclipse.aether.internal.impl.DefaultArtifactResolver.resolveArtifacts (DefaultArtifactResolver.java:225)
    at org.eclipse.aether.internal.impl.DefaultArtifactResolver.resolveArtifact (DefaultArtifactResolver.java:202)
    at org.apache.maven.repository.internal.DefaultArtifactDescriptorReader.loadPom (DefaultArtifactDescriptorReader.java:240)
    at org.apache.maven.repository.internal.DefaultArtifactDescriptorReader.readArtifactDescriptor (DefaultArtifactDescriptorReader.java:171)
    at org.eclipse.aether.internal.impl.collect.DefaultDependencyCollector.resolveCachedArtifactDescriptor (DefaultDependencyCollector.java:530)
    at org.eclipse.aether.internal.impl.collect.DefaultDependencyCollector.getArtifactDescriptorResult (DefaultDependencyCollector.java:515)
    at org.eclipse.aether.internal.impl.collect.DefaultDependencyCollector.processDependency (DefaultDependencyCollector.java:403)
    at org.eclipse.aether.internal.impl.collect.DefaultDependencyCollector.processDependency (DefaultDependencyCollector.java:356)
    at org.eclipse.aether.internal.impl.collect.DefaultDependencyCollector.process (DefaultDependencyCollector.java:344)
    at org.eclipse.aether.internal.impl.collect.DefaultDependencyCollector.collectDependencies (DefaultDependencyCollector.java:247)
    at org.eclipse.aether.internal.impl.DefaultRepositorySystem.collectDependencies (DefaultRepositorySystem.java:279)
    at org.apache.maven.project.DefaultProjectDependenciesResolver.resolve (DefaultProjectDependenciesResolver.java:169)
    at org.apache.maven.lifecycle.internal.LifecycleDependencyResolver.getDependencies (LifecycleDependencyResolver.java:243)
    at org.apache.maven.lifecycle.internal.LifecycleDependencyResolver.resolveProjectDependencies (LifecycleDependencyResolver.java:147)
    at org.apache.maven.lifecycle.internal.MojoExecutor.ensureDependenciesAreResolved (MojoExecutor.java:248)
    at org.apache.maven.lifecycle.internal.MojoExecutor.execute (MojoExecutor.java:202)
    at org.apache.maven.lifecycle.internal.MojoExecutor.execute (MojoExecutor.java:156)
    at org.apache.maven.lifecycle.internal.MojoExecutor.execute (MojoExecutor.java:148)
    at org.apache.maven.lifecycle.internal.LifecycleModuleBuilder.buildProject (LifecycleModuleBuilder.java:117)
    at org.apache.maven.lifecycle.internal.LifecycleModuleBuilder.buildProject (LifecycleModuleBuilder.java:81)
    at org.apache.maven.lifecycle.internal.builder.singlethreaded.SingleThreadedBuilder.build (SingleThreadedBuilder.java:56)
    at org.apache.maven.lifecycle.internal.LifecycleStarter.execute (LifecycleStarter.java:128)
    at org.apache.maven.DefaultMaven.doExecute (DefaultMaven.java:305)
    at org.apache.maven.DefaultMaven.doExecute (DefaultMaven.java:192)
    at org.apache.maven.DefaultMaven.execute (DefaultMaven.java:105)
    at org.apache.maven.cli.MavenCli.execute (MavenCli.java:956)
    at org.apache.maven.cli.MavenCli.doMain (MavenCli.java:288)
    at org.apache.maven.cli.MavenCli.main (MavenCli.java:192)
    at sun.reflect.NativeMethodAccessorImpl.invoke0 (Native Method)
    at sun.reflect.NativeMethodAccessorImpl.invoke (NativeMethodAccessorImpl.java:57)
    at sun.reflect.DelegatingMethodAccessorImpl.invoke (DelegatingMethodAccessorImpl.java:43)
    at java.lang.reflect.Method.invoke (Method.java:606)
    at org.codehaus.plexus.classworlds.launcher.Launcher.launchEnhanced (Launcher.java:282)
    at org.codehaus.plexus.classworlds.launcher.Launcher.launch (Launcher.java:225)
    at org.codehaus.plexus.classworlds.launcher.Launcher.mainWithExitCode (Launcher.java:406)
    at org.codehaus.plexus.classworlds.launcher.Launcher.main (Launcher.java:347)
Caused by: org.eclipse.aether.transfer.ArtifactTransferException: Could not transfer artifact org.apache.maven.its.mng0553:a:pom:0.1-SNAPSHOT from/to test (http://localhost:-1/): Connect to localhost:80 [localhost/127.0.0.1, localhost/0:0:0:0:0:0:0:1] failed: Connection refused: connect
    at org.eclipse.aether.connector.basic.ArtifactTransportListener.transferFailed (ArtifactTransportListener.java:52)
    at org.eclipse.aether.connector.basic.BasicRepositoryConnector$TaskRunner.run (BasicRepositoryConnector.java:368)
    at org.eclipse.aether.util.concurrency.RunnableErrorForwarder$1.run (RunnableErrorForwarder.java:75)
    at org.eclipse.aether.connector.basic.BasicRepositoryConnector$DirectExecutor.execute (BasicRepositoryConnector.java:642)
    at org.eclipse.aether.connector.basic.BasicRepositoryConnector.get (BasicRepositoryConnector.java:262)
    at org.eclipse.aether.internal.impl.DefaultArtifactResolver.performDownloads (DefaultArtifactResolver.java:499)
    at org.eclipse.aether.internal.impl.DefaultArtifactResolver.resolve (DefaultArtifactResolver.java:400)
    at org.eclipse.aether.internal.impl.DefaultArtifactResolver.resolveArtifacts (DefaultArtifactResolver.java:225)
    at org.eclipse.aether.internal.impl.DefaultArtifactResolver.resolveArtifact (DefaultArtifactResolver.java:202)
    at org.apache.maven.repository.internal.DefaultArtifactDescriptorReader.loadPom (DefaultArtifactDescriptorReader.java:240)
    at org.apache.maven.repository.internal.DefaultArtifactDescriptorReader.readArtifactDescriptor (DefaultArtifactDescriptorReader.java:171)
    at org.eclipse.aether.internal.impl.collect.DefaultDependencyCollector.resolveCachedArtifactDescriptor (DefaultDependencyCollector.java:530)
    at org.eclipse.aether.internal.impl.collect.DefaultDependencyCollector.getArtifactDescriptorResult (DefaultDependencyCollector.java:515)
    at org.eclipse.aether.internal.impl.collect.DefaultDependencyCollector.processDependency (DefaultDependencyCollector.java:403)
    at org.eclipse.aether.internal.impl.collect.DefaultDependencyCollector.processDependency (DefaultDependencyCollector.java:356)
    at org.eclipse.aether.internal.impl.collect.DefaultDependencyCollector.process (DefaultDependencyCollector.java:344)
    at org.eclipse.aether.internal.impl.collect.DefaultDependencyCollector.collectDependencies (DefaultDependencyCollector.java:247)
    at org.eclipse.aether.internal.impl.DefaultRepositorySystem.collectDependencies (DefaultRepositorySystem.java:279)
    at org.apache.maven.project.DefaultProjectDependenciesResolver.resolve (DefaultProjectDependenciesResolver.java:169)
    at org.apache.maven.lifecycle.internal.LifecycleDependencyResolver.getDependencies (LifecycleDependencyResolver.java:243)
    at org.apache.maven.lifecycle.internal.LifecycleDependencyResolver.resolveProjectDependencies (LifecycleDependencyResolver.java:147)
    at org.apache.maven.lifecycle.internal.MojoExecutor.ensureDependenciesAreResolved (MojoExecutor.java:248)
    at org.apache.maven.lifecycle.internal.MojoExecutor.execute (MojoExecutor.java:202)
    at org.apache.maven.lifecycle.internal.MojoExecutor.execute (MojoExecutor.java:156)
    at org.apache.maven.lifecycle.internal.MojoExecutor.execute (MojoExecutor.java:148)
    at org.apache.maven.lifecycle.internal.LifecycleModuleBuilder.buildProject (LifecycleModuleBuilder.java:117)
    at org.apache.maven.lifecycle.internal.LifecycleModuleBuilder.buildProject (LifecycleModuleBuilder.java:81)
    at org.apache.maven.lifecycle.internal.builder.singlethreaded.SingleThreadedBuilder.build (SingleThreadedBuilder.java:56)
    at org.apache.maven.lifecycle.internal.LifecycleStarter.execute (LifecycleStarter.java:128)
    at org.apache.maven.DefaultMaven.doExecute (DefaultMaven.java:305)
    at org.apache.maven.DefaultMaven.doExecute (DefaultMaven.java:192)
    at org.apache.maven.DefaultMaven.execute (DefaultMaven.java:105)
    at org.apache.maven.cli.MavenCli.execute (MavenCli.java:956)
    at org.apache.maven.cli.MavenCli.doMain (MavenCli.java:288)
    at org.apache.maven.cli.MavenCli.main (MavenCli.java:192)
    at sun.reflect.NativeMethodAccessorImpl.invoke0 (Native Method)
    at sun.reflect.NativeMethodAccessorImpl.invoke (NativeMethodAccessorImpl.java:57)
    at sun.reflect.DelegatingMethodAccessorImpl.invoke (DelegatingMethodAccessorImpl.java:43)
    at java.lang.reflect.Method.invoke (Method.java:606)
    at org.codehaus.plexus.classworlds.launcher.Launcher.launchEnhanced (Launcher.java:282)
    at org.codehaus.plexus.classworlds.launcher.Launcher.launch (Launcher.java:225)
    at org.codehaus.plexus.classworlds.launcher.Launcher.mainWithExitCode (Launcher.java:406)
    at org.codehaus.plexus.classworlds.launcher.Launcher.main (Launcher.java:347)
Caused by: org.apache.maven.wagon.TransferFailedException: Connect to localhost:80 [localhost/127.0.0.1, localhost/0:0:0:0:0:0:0:1] failed: Connection refused: connect
    at org.apache.maven.wagon.providers.http.wagon.shared.AbstractHttpClientWagon.fillInputData (AbstractHttpClientWagon.java:1206)
    at org.apache.maven.wagon.providers.http.wagon.shared.AbstractHttpClientWagon.fillInputData (AbstractHttpClientWagon.java:1094)
    at org.apache.maven.wagon.StreamWagon.getInputStream (StreamWagon.java:126)
    at org.apache.maven.wagon.StreamWagon.getIfNewer (StreamWagon.java:88)
    at org.apache.maven.wagon.StreamWagon.get (StreamWagon.java:61)
    at org.eclipse.aether.transport.wagon.WagonTransporter$GetTaskRunner.run (WagonTransporter.java:567)
    at org.eclipse.aether.transport.wagon.WagonTransporter.execute (WagonTransporter.java:435)
    at org.eclipse.aether.transport.wagon.WagonTransporter.get (WagonTransporter.java:412)
    at org.eclipse.aether.connector.basic.BasicRepositoryConnector$GetTaskRunner.runTask (BasicRepositoryConnector.java:456)
    at org.eclipse.aether.connector.basic.BasicRepositoryConnector$TaskRunner.run (BasicRepositoryConnector.java:363)
    at org.eclipse.aether.util.concurrency.RunnableErrorForwarder$1.run (RunnableErrorForwarder.java:75)
    at org.eclipse.aether.connector.basic.BasicRepositoryConnector$DirectExecutor.execute (BasicRepositoryConnector.java:642)
    at org.eclipse.aether.connector.basic.BasicRepositoryConnector.get (BasicRepositoryConnector.java:262)
    at org.eclipse.aether.internal.impl.DefaultArtifactResolver.performDownloads (DefaultArtifactResolver.java:499)
    at org.eclipse.aether.internal.impl.DefaultArtifactResolver.resolve (DefaultArtifactResolver.java:400)
    at org.eclipse.aether.internal.impl.DefaultArtifactResolver.resolveArtifacts (DefaultArtifactResolver.java:225)
    at org.eclipse.aether.internal.impl.DefaultArtifactResolver.resolveArtifact (DefaultArtifactResolver.java:202)
    at org.apache.maven.repository.internal.DefaultArtifactDescriptorReader.loadPom (DefaultArtifactDescriptorReader.java:240)
    at org.apache.maven.repository.internal.DefaultArtifactDescriptorReader.readArtifactDescriptor (DefaultArtifactDescriptorReader.java:171)
    at org.eclipse.aether.internal.impl.collect.DefaultDependencyCollector.resolveCachedArtifactDescriptor (DefaultDependencyCollector.java:530)
    at org.eclipse.aether.internal.impl.collect.DefaultDependencyCollector.getArtifactDescriptorResult (DefaultDependencyCollector.java:515)
    at org.eclipse.aether.internal.impl.collect.DefaultDependencyCollector.processDependency (DefaultDependencyCollector.java:403)
    at org.eclipse.aether.internal.impl.collect.DefaultDependencyCollector.processDependency (DefaultDependencyCollector.java:356)
    at org.eclipse.aether.internal.impl.collect.DefaultDependencyCollector.process (DefaultDependencyCollector.java:344)
    at org.eclipse.aether.internal.impl.collect.DefaultDependencyCollector.collectDependencies (DefaultDependencyCollector.java:247)
    at org.eclipse.aether.internal.impl.DefaultRepositorySystem.collectDependencies (DefaultRepositorySystem.java:279)
    at org.apache.maven.project.DefaultProjectDependenciesResolver.resolve (DefaultProjectDependenciesResolver.java:169)
    at org.apache.maven.lifecycle.internal.LifecycleDependencyResolver.getDependencies (LifecycleDependencyResolver.java:243)
    at org.apache.maven.lifecycle.internal.LifecycleDependencyResolver.resolveProjectDependencies (LifecycleDependencyResolver.java:147)
    at org.apache.maven.lifecycle.internal.MojoExecutor.ensureDependenciesAreResolved (MojoExecutor.java:248)
    at org.apache.maven.lifecycle.internal.MojoExecutor.execute (MojoExecutor.java:202)
    at org.apache.maven.lifecycle.internal.MojoExecutor.execute (MojoExecutor.java:156)
    at org.apache.maven.lifecycle.internal.MojoExecutor.execute (MojoExecutor.java:148)
    at org.apache.maven.lifecycle.internal.LifecycleModuleBuilder.buildProject (LifecycleModuleBuilder.java:117)
    at org.apache.maven.lifecycle.internal.LifecycleModuleBuilder.buildProject (LifecycleModuleBuilder.java:81)
    at org.apache.maven.lifecycle.internal.builder.singlethreaded.SingleThreadedBuilder.build (SingleThreadedBuilder.java:56)
    at org.apache.maven.lifecycle.internal.LifecycleStarter.execute (LifecycleStarter.java:128)
    at org.apache.maven.DefaultMaven.doExecute (DefaultMaven.java:305)
    at org.apache.maven.DefaultMaven.doExecute (DefaultMaven.java:192)
    at org.apache.maven.DefaultMaven.execute (DefaultMaven.java:105)
    at org.apache.maven.cli.MavenCli.execute (MavenCli.java:956)
    at org.apache.maven.cli.MavenCli.doMain (MavenCli.java:288)
    at org.apache.maven.cli.MavenCli.main (MavenCli.java:192)
    at sun.reflect.NativeMethodAccessorImpl.invoke0 (Native Method)
    at sun.reflect.NativeMethodAccessorImpl.invoke (NativeMethodAccessorImpl.java:57)
    at sun.reflect.DelegatingMethodAccessorImpl.invoke (DelegatingMethodAccessorImpl.java:43)
    at java.lang.reflect.Method.invoke (Method.java:606)
    at org.codehaus.plexus.classworlds.launcher.Launcher.launchEnhanced (Launcher.java:282)
    at org.codehaus.plexus.classworlds.launcher.Launcher.launch (Launcher.java:225)
    at org.codehaus.plexus.classworlds.launcher.Launcher.mainWithExitCode (Launcher.java:406)
    at org.codehaus.plexus.classworlds.launcher.Launcher.main (Launcher.java:347)
Caused by: org.apache.maven.wagon.providers.http.httpclient.conn.HttpHostConnectException: Connect to localhost:80 [localhost/127.0.0.1, localhost/0:0:0:0:0:0:0:1] failed: Connection refused: connect
    at org.apache.maven.wagon.providers.http.httpclient.impl.conn.DefaultHttpClientConnectionOperator.connect (DefaultHttpClientConnectionOperator.java:156)
    at org.apache.maven.wagon.providers.http.httpclient.impl.conn.PoolingHttpClientConnectionManager.connect (PoolingHttpClientConnectionManager.java:374)
    at org.apache.maven.wagon.providers.http.httpclient.impl.execchain.MainClientExec.establishRoute (MainClientExec.java:393)
    at org.apache.maven.wagon.providers.http.httpclient.impl.execchain.MainClientExec.execute (MainClientExec.java:236)
    at org.apache.maven.wagon.providers.http.httpclient.impl.execchain.ProtocolExec.execute (ProtocolExec.java:185)
    at org.apache.maven.wagon.providers.http.httpclient.impl.execchain.RetryExec.execute (RetryExec.java:89)
    at org.apache.maven.wagon.providers.http.httpclient.impl.execchain.RedirectExec.execute (RedirectExec.java:110)
    at org.apache.maven.wagon.providers.http.httpclient.impl.client.InternalHttpClient.doExecute (InternalHttpClient.java:185)
    at org.apache.maven.wagon.providers.http.httpclient.impl.client.CloseableHttpClient.execute (CloseableHttpClient.java:83)
    at org.apache.maven.wagon.providers.http.wagon.shared.AbstractHttpClientWagon.execute (AbstractHttpClientWagon.java:958)
    at org.apache.maven.wagon.providers.http.wagon.shared.AbstractHttpClientWagon.fillInputData (AbstractHttpClientWagon.java:1117)
    at org.apache.maven.wagon.providers.http.wagon.shared.AbstractHttpClientWagon.fillInputData (AbstractHttpClientWagon.java:1094)
    at org.apache.maven.wagon.StreamWagon.getInputStream (StreamWagon.java:126)
    at org.apache.maven.wagon.StreamWagon.getIfNewer (StreamWagon.java:88)
    at org.apache.maven.wagon.StreamWagon.get (StreamWagon.java:61)
    at org.eclipse.aether.transport.wagon.WagonTransporter$GetTaskRunner.run (WagonTransporter.java:567)
    at org.eclipse.aether.transport.wagon.WagonTransporter.execute (WagonTransporter.java:435)
    at org.eclipse.aether.transport.wagon.WagonTransporter.get (WagonTransporter.java:412)
    at org.eclipse.aether.connector.basic.BasicRepositoryConnector$GetTaskRunner.runTask (BasicRepositoryConnector.java:456)
    at org.eclipse.aether.connector.basic.BasicRepositoryConnector$TaskRunner.run (BasicRepositoryConnector.java:363)
    at org.eclipse.aether.util.concurrency.RunnableErrorForwarder$1.run (RunnableErrorForwarder.java:75)
    at org.eclipse.aether.connector.basic.BasicRepositoryConnector$DirectExecutor.execute (BasicRepositoryConnector.java:642)
    at org.eclipse.aether.connector.basic.BasicRepositoryConnector.get (BasicRepositoryConnector.java:262)
    at org.eclipse.aether.internal.impl.DefaultArtifactResolver.performDownloads (DefaultArtifactResolver.java:499)
    at org.eclipse.aether.internal.impl.DefaultArtifactResolver.resolve (DefaultArtifactResolver.java:400)
    at org.eclipse.aether.internal.impl.DefaultArtifactResolver.resolveArtifacts (DefaultArtifactResolver.java:225)
    at org.eclipse.aether.internal.impl.DefaultArtifactResolver.resolveArtifact (DefaultArtifactResolver.java:202)
    at org.apache.maven.repository.internal.DefaultArtifactDescriptorReader.loadPom (DefaultArtifactDescriptorReader.java:240)
    at org.apache.maven.repository.internal.DefaultArtifactDescriptorReader.readArtifactDescriptor (DefaultArtifactDescriptorReader.java:171)
    at org.eclipse.aether.internal.impl.collect.DefaultDependencyCollector.resolveCachedArtifactDescriptor (DefaultDependencyCollector.java:530)
    at org.eclipse.aether.internal.impl.collect.DefaultDependencyCollector.getArtifactDescriptorResult (DefaultDependencyCollector.java:515)
    at org.eclipse.aether.internal.impl.collect.DefaultDependencyCollector.processDependency (DefaultDependencyCollector.java:403)
    at org.eclipse.aether.internal.impl.collect.DefaultDependencyCollector.processDependency (DefaultDependencyCollector.java:356)
    at org.eclipse.aether.internal.impl.collect.DefaultDependencyCollector.process (DefaultDependencyCollector.java:344)
    at org.eclipse.aether.internal.impl.collect.DefaultDependencyCollector.collectDependencies (DefaultDependencyCollector.java:247)
    at org.eclipse.aether.internal.impl.DefaultRepositorySystem.collectDependencies (DefaultRepositorySystem.java:279)
    at org.apache.maven.project.DefaultProjectDependenciesResolver.resolve (DefaultProjectDependenciesResolver.java:169)
    at org.apache.maven.lifecycle.internal.LifecycleDependencyResolver.getDependencies (LifecycleDependencyResolver.java:243)
    at org.apache.maven.lifecycle.internal.LifecycleDependencyResolver.resolveProjectDependencies (LifecycleDependencyResolver.java:147)
    at org.apache.maven.lifecycle.internal.MojoExecutor.ensureDependenciesAreResolved (MojoExecutor.java:248)
    at org.apache.maven.lifecycle.internal.MojoExecutor.execute (MojoExecutor.java:202)
    at org.apache.maven.lifecycle.internal.MojoExecutor.execute (MojoExecutor.java:156)
    at org.apache.maven.lifecycle.internal.MojoExecutor.execute (MojoExecutor.java:148)
    at org.apache.maven.lifecycle.internal.LifecycleModuleBuilder.buildProject (LifecycleModuleBuilder.java:117)
    at org.apache.maven.lifecycle.internal.LifecycleModuleBuilder.buildProject (LifecycleModuleBuilder.java:81)
    at org.apache.maven.lifecycle.internal.builder.singlethreaded.SingleThreadedBuilder.build (SingleThreadedBuilder.java:56)
    at org.apache.maven.lifecycle.internal.LifecycleStarter.execute (LifecycleStarter.java:128)
    at org.apache.maven.DefaultMaven.doExecute (DefaultMaven.java:305)
    at org.apache.maven.DefaultMaven.doExecute (DefaultMaven.java:192)
    at org.apache.maven.DefaultMaven.execute (DefaultMaven.java:105)
    at org.apache.maven.cli.MavenCli.execute (MavenCli.java:956)
    at org.apache.maven.cli.MavenCli.doMain (MavenCli.java:288)
    at org.apache.maven.cli.MavenCli.main (MavenCli.java:192)
    at sun.reflect.NativeMethodAccessorImpl.invoke0 (Native Method)
    at sun.reflect.NativeMethodAccessorImpl.invoke (NativeMethodAccessorImpl.java:57)
    at sun.reflect.DelegatingMethodAccessorImpl.invoke (DelegatingMethodAccessorImpl.java:43)
    at java.lang.reflect.Method.invoke (Method.java:606)
    at org.codehaus.plexus.classworlds.launcher.Launcher.launchEnhanced (Launcher.java:282)
    at org.codehaus.plexus.classworlds.launcher.Launcher.launch (Launcher.java:225)
    at org.codehaus.plexus.classworlds.launcher.Launcher.mainWithExitCode (Launcher.java:406)
    at org.codehaus.plexus.classworlds.launcher.Launcher.main (Launcher.java:347)
Caused by: java.net.ConnectException: Connection refused: connect
    at java.net.DualStackPlainSocketImpl.connect0 (Native Method)
    at java.net.DualStackPlainSocketImpl.socketConnect (DualStackPlainSocketImpl.java:79)
    at java.net.AbstractPlainSocketImpl.doConnect (AbstractPlainSocketImpl.java:339)
    at java.net.AbstractPlainSocketImpl.connectToAddress (AbstractPlainSocketImpl.java:200)
    at java.net.AbstractPlainSocketImpl.connect (AbstractPlainSocketImpl.java:182)
    at java.net.PlainSocketImpl.connect (PlainSocketImpl.java:172)
    at java.net.SocksSocketImpl.connect (SocksSocketImpl.java:392)
    at java.net.Socket.connect (Socket.java:579)
    at org.apache.maven.wagon.providers.http.httpclient.conn.socket.PlainConnectionSocketFactory.connectSocket (PlainConnectionSocketFactory.java:75)
    at org.apache.maven.wagon.providers.http.httpclient.impl.conn.DefaultHttpClientConnectionOperator.connect (DefaultHttpClientConnectionOperator.java:142)
    at org.apache.maven.wagon.providers.http.httpclient.impl.conn.PoolingHttpClientConnectionManager.connect (PoolingHttpClientConnectionManager.java:374)
    at org.apache.maven.wagon.providers.http.httpclient.impl.execchain.MainClientExec.establishRoute (MainClientExec.java:393)
    at org.apache.maven.wagon.providers.http.httpclient.impl.execchain.MainClientExec.execute (MainClientExec.java:236)
    at org.apache.maven.wagon.providers.http.httpclient.impl.execchain.ProtocolExec.execute (ProtocolExec.java:185)
    at org.apache.maven.wagon.providers.http.httpclient.impl.execchain.RetryExec.execute (RetryExec.java:89)
    at org.apache.maven.wagon.providers.http.httpclient.impl.execchain.RedirectExec.execute (RedirectExec.java:110)
    at org.apache.maven.wagon.providers.http.httpclient.impl.client.InternalHttpClient.doExecute (InternalHttpClient.java:185)
    at org.apache.maven.wagon.providers.http.httpclient.impl.client.CloseableHttpClient.execute (CloseableHttpClient.java:83)
    at org.apache.maven.wagon.providers.http.wagon.shared.AbstractHttpClientWagon.execute (AbstractHttpClientWagon.java:958)
    at org.apache.maven.wagon.providers.http.wagon.shared.AbstractHttpClientWagon.fillInputData (AbstractHttpClientWagon.java:1117)
    at org.apache.maven.wagon.providers.http.wagon.shared.AbstractHttpClientWagon.fillInputData (AbstractHttpClientWagon.java:1094)
    at org.apache.maven.wagon.StreamWagon.getInputStream (StreamWagon.java:126)
    at org.apache.maven.wagon.StreamWagon.getIfNewer (StreamWagon.java:88)
    at org.apache.maven.wagon.StreamWagon.get (StreamWagon.java:61)
    at org.eclipse.aether.transport.wagon.WagonTransporter$GetTaskRunner.run (WagonTransporter.java:567)
    at org.eclipse.aether.transport.wagon.WagonTransporter.execute (WagonTransporter.java:435)
    at org.eclipse.aether.transport.wagon.WagonTransporter.get (WagonTransporter.java:412)
    at org.eclipse.aether.connector.basic.BasicRepositoryConnector$GetTaskRunner.runTask (BasicRepositoryConnector.java:456)
    at org.eclipse.aether.connector.basic.BasicRepositoryConnector$TaskRunner.run (BasicRepositoryConnector.java:363)
    at org.eclipse.aether.util.concurrency.RunnableErrorForwarder$1.run (RunnableErrorForwarder.java:75)
    at org.eclipse.aether.connector.basic.BasicRepositoryConnector$DirectExecutor.execute (BasicRepositoryConnector.java:642)
    at org.eclipse.aether.connector.basic.BasicRepositoryConnector.get (BasicRepositoryConnector.java:262)
    at org.eclipse.aether.internal.impl.DefaultArtifactResolver.performDownloads (DefaultArtifactResolver.java:499)
    at org.eclipse.aether.internal.impl.DefaultArtifactResolver.resolve (DefaultArtifactResolver.java:400)
    at org.eclipse.aether.internal.impl.DefaultArtifactResolver.resolveArtifacts (DefaultArtifactResolver.java:225)
    at org.eclipse.aether.internal.impl.DefaultArtifactResolver.resolveArtifact (DefaultArtifactResolver.java:202)
    at org.apache.maven.repository.internal.DefaultArtifactDescriptorReader.loadPom (DefaultArtifactDescriptorReader.java:240)
    at org.apache.maven.repository.internal.DefaultArtifactDescriptorReader.readArtifactDescriptor (DefaultArtifactDescriptorReader.java:171)
    at org.eclipse.aether.internal.impl.collect.DefaultDependencyCollector.resolveCachedArtifactDescriptor (DefaultDependencyCollector.java:530)
    at org.eclipse.aether.internal.impl.collect.DefaultDependencyCollector.getArtifactDescriptorResult (DefaultDependencyCollector.java:515)
    at org.eclipse.aether.internal.impl.collect.DefaultDependencyCollector.processDependency (DefaultDependencyCollector.java:403)
    at org.eclipse.aether.internal.impl.collect.DefaultDependencyCollector.processDependency (DefaultDependencyCollector.java:356)
    at org.eclipse.aether.internal.impl.collect.DefaultDependencyCollector.process (DefaultDependencyCollector.java:344)
    at org.eclipse.aether.internal.impl.collect.DefaultDependencyCollector.collectDependencies (DefaultDependencyCollector.java:247)
    at org.eclipse.aether.internal.impl.DefaultRepositorySystem.collectDependencies (DefaultRepositorySystem.java:279)
    at org.apache.maven.project.DefaultProjectDependenciesResolver.resolve (DefaultProjectDependenciesResolver.java:169)
    at org.apache.maven.lifecycle.internal.LifecycleDependencyResolver.getDependencies (LifecycleDependencyResolver.java:243)
    at org.apache.maven.lifecycle.internal.LifecycleDependencyResolver.resolveProjectDependencies (LifecycleDependencyResolver.java:147)
    at org.apache.maven.lifecycle.internal.MojoExecutor.ensureDependenciesAreResolved (MojoExecutor.java:248)
    at org.apache.maven.lifecycle.internal.MojoExecutor.execute (MojoExecutor.java:202)
    at org.apache.maven.lifecycle.internal.MojoExecutor.execute (MojoExecutor.java:156)
    at org.apache.maven.lifecycle.internal.MojoExecutor.execute (MojoExecutor.java:148)
    at org.apache.maven.lifecycle.internal.LifecycleModuleBuilder.buildProject (LifecycleModuleBuilder.java:117)
    at org.apache.maven.lifecycle.internal.LifecycleModuleBuilder.buildProject (LifecycleModuleBuilder.java:81)
    at org.apache.maven.lifecycle.internal.builder.singlethreaded.SingleThreadedBuilder.build (SingleThreadedBuilder.java:56)
    at org.apache.maven.lifecycle.internal.LifecycleStarter.execute (LifecycleStarter.java:128)
    at org.apache.maven.DefaultMaven.doExecute (DefaultMaven.java:305)
    at org.apache.maven.DefaultMaven.doExecute (DefaultMaven.java:192)
    at org.apache.maven.DefaultMaven.execute (DefaultMaven.java:105)
    at org.apache.maven.cli.MavenCli.execute (MavenCli.java:956)
    at org.apache.maven.cli.MavenCli.doMain (MavenCli.java:288)
    at org.apache.maven.cli.MavenCli.main (MavenCli.java:192)
    at sun.reflect.NativeMethodAccessorImpl.invoke0 (Native Method)
    at sun.reflect.NativeMethodAccessorImpl.invoke (NativeMethodAccessorImpl.java:57)
    at sun.reflect.DelegatingMethodAccessorImpl.invoke (DelegatingMethodAccessorImpl.java:43)
    at java.lang.reflect.Method.invoke (Method.java:606)
    at org.codehaus.plexus.classworlds.launcher.Launcher.launchEnhanced (Launcher.java:282)
    at org.codehaus.plexus.classworlds.launcher.Launcher.launch (Launcher.java:225)
    at org.codehaus.plexus.classworlds.launcher.Launcher.mainWithExitCode (Launcher.java:406)
    at org.codehaus.plexus.classworlds.launcher.Launcher.main (Launcher.java:347)
[ERROR] 
[ERROR] Re-run Maven using the -X switch to enable full debug logging.
[ERROR] 
[ERROR] For more information about the errors and possible solutions, please read the following articles:
[ERROR] [Help 1] http://cwiki.apache.org/confluence/display/MAVEN/DependencyResolutionException
Picked up JAVA_TOOL_OPTIONS: -Dmaven.ext.class.path="c:\mvn-it-0.tmp@tmp\withMaven584124b5\pipeline-maven-spy.jar" -Dorg.jenkinsci.plugins.pipeline.maven.reportsFolder="c:\mvn-it-0.tmp@tmp\withMaven584124b5" 


Stack Trace:
org.apache.maven.it.VerificationException: 
Exit code was non-zero: 1; command line and log = 
C:\mvn-it-0.tmp\core-it-suite\target\apache-maven\bin\mvn --global-settings C:\mvn-it-0.tmp\core-it-suite\target\test-classes\settings.xml --settings settings.xml -e --batch-mode -Dmaven.repo.local=c:\mvn-it-0.tmp\it-local-repo validate
[INFO] [jenkins-event-spy] Jenkins Maven Event Spy is disabled
[INFO] Error stacktraces are turned on.
[INFO] Scanning for projects...
[INFO] 
[INFO] -----------------< org.apache.maven.its.mng0553:test >------------------
[INFO] Building Maven Integration Test :: MNG-533 1.0-SNAPSHOT
[INFO] --------------------------------[ jar ]---------------------------------
[INFO] Downloading from test: http://localhost:-1/org/apache/maven/its/mng0553/a/0.1-SNAPSHOT/maven-metadata.xml
[WARNING] Could not transfer metadata org.apache.maven.its.mng0553:a:0.1-SNAPSHOT/maven-metadata.xml from/to test (http://localhost:-1/): Connect to localhost:80 [localhost/127.0.0.1, localhost/0:0:0:0:0:0:0:1] failed: Connection refused: connect
[WARNING] Failure to transfer org.apache.maven.its.mng0553:a:0.1-SNAPSHOT/maven-metadata.xml from http://localhost:-1/ was cached in the local repository, resolution will not be reattempted until the update interval of test has elapsed or updates are forced. Original error: Could not transfer metadata org.apache.maven.its.mng0553:a:0.1-SNAPSHOT/maven-metadata.xml from/to test (http://localhost:-1/): Connect to localhost:80 [localhost/127.0.0.1, localhost/0:0:0:0:0:0:0:1] failed: Connection refused: connect
[INFO] Downloading from test: http://localhost:-1/org/apache/maven/its/mng0553/a/0.1-SNAPSHOT/a-0.1-SNAPSHOT.pom
[INFO] ------------------------------------------------------------------------
[INFO] BUILD FAILURE
[INFO] ------------------------------------------------------------------------
[INFO] Total time:  5.822 s
[INFO] Finished at: 2019-04-19T15:15:23-07:00
[INFO] ------------------------------------------------------------------------
[ERROR] Failed to execute goal on project test: Could not resolve dependencies for project org.apache.maven.its.mng0553:test:jar:1.0-SNAPSHOT: Failed to collect dependencies at org.apache.maven.its.mng0553:a:jar:0.1-SNAPSHOT: Failed to read artifact descriptor for org.apache.maven.its.mng0553:a:jar:0.1-SNAPSHOT: Could not transfer artifact org.apache.maven.its.mng0553:a:pom:0.1-SNAPSHOT from/to test (http://localhost:-1/): Connect to localhost:80 [localhost/127.0.0.1, localhost/0:0:0:0:0:0:0:1] failed: Connection refused: connect -> [Help 1]
org.apache.maven.lifecycle.LifecycleExecutionException: Failed to execute goal on project test: Could not resolve dependencies for project org.apache.maven.its.mng0553:test:jar:1.0-SNAPSHOT: Failed to collect dependencies at org.apache.maven.its.mng0553:a:jar:0.1-SNAPSHOT
    at org.apache.maven.lifecycle.internal.LifecycleDependencyResolver.getDependencies (LifecycleDependencyResolver.java:269)
    at org.apache.maven.lifecycle.internal.LifecycleDependencyResolver.resolveProjectDependencies (LifecycleDependencyResolver.java:147)
    at org.apache.maven.lifecycle.internal.MojoExecutor.ensureDependenciesAreResolved (MojoExecutor.java:248)
    at org.apache.maven.lifecycle.internal.MojoExecutor.execute (MojoExecutor.java:202)
    at org.apache.maven.lifecycle.internal.MojoExecutor.execute (MojoExecutor.java:156)
    at org.apache.maven.lifecycle.internal.MojoExecutor.execute (MojoExecutor.java:148)
    at org.apache.maven.lifecycle.internal.LifecycleModuleBuilder.buildProject (LifecycleModuleBuilder.java:117)
    at org.apache.maven.lifecycle.internal.LifecycleModuleBuilder.buildProject (LifecycleModuleBuilder.java:81)
    at org.apache.maven.lifecycle.internal.builder.singlethreaded.SingleThreadedBuilder.build (SingleThreadedBuilder.java:56)
    at org.apache.maven.lifecycle.internal.LifecycleStarter.execute (LifecycleStarter.java:128)
    at org.apache.maven.DefaultMaven.doExecute (DefaultMaven.java:305)
    at org.apache.maven.DefaultMaven.doExecute (DefaultMaven.java:192)
    at org.apache.maven.DefaultMaven.execute (DefaultMaven.java:105)
    at org.apache.maven.cli.MavenCli.execute (MavenCli.java:956)
    at org.apache.maven.cli.MavenCli.doMain (MavenCli.java:288)
    at org.apache.maven.cli.MavenCli.main (MavenCli.java:192)
    at sun.reflect.NativeMethodAccessorImpl.invoke0 (Native Method)
    at sun.reflect.NativeMethodAccessorImpl.invoke (NativeMethodAccessorImpl.java:57)
    at sun.reflect.DelegatingMethodAccessorImpl.invoke (DelegatingMethodAccessorImpl.java:43)
    at java.lang.reflect.Method.invoke (Method.java:606)
    at org.codehaus.plexus.classworlds.launcher.Launcher.launchEnhanced (Launcher.java:282)
    at org.codehaus.plexus.classworlds.launcher.Launcher.launch (Launcher.java:225)
    at org.codehaus.plexus.classworlds.launcher.Launcher.mainWithExitCode (Launcher.java:406)
    at org.codehaus.plexus.classworlds.launcher.Launcher.main (Launcher.java:347)
Caused by: org.apache.maven.project.DependencyResolutionException: Could not resolve dependencies for project org.apache.maven.its.mng0553:test:jar:1.0-SNAPSHOT: Failed to collect dependencies at org.apache.maven.its.mng0553:a:jar:0.1-SNAPSHOT
    at org.apache.maven.project.DefaultProjectDependenciesResolver.resolve (DefaultProjectDependenciesResolver.java:178)
    at org.apache.maven.lifecycle.internal.LifecycleDependencyResolver.getDependencies (LifecycleDependencyResolver.java:243)
    at org.apache.maven.lifecycle.internal.LifecycleDependencyResolver.resolveProjectDependencies (LifecycleDependencyResolver.java:147)
    at org.apache.maven.lifecycle.internal.MojoExecutor.ensureDependenciesAreResolved (MojoExecutor.java:248)
    at org.apache.maven.lifecycle.internal.MojoExecutor.execute (MojoExecutor.java:202)
    at org.apache.maven.lifecycle.internal.MojoExecutor.execute (MojoExecutor.java:156)
    at org.apache.maven.lifecycle.internal.MojoExecutor.execute (MojoExecutor.java:148)
    at org.apache.maven.lifecycle.internal.LifecycleModuleBuilder.buildProject (LifecycleModuleBuilder.java:117)
    at org.apache.maven.lifecycle.internal.LifecycleModuleBuilder.buildProject (LifecycleModuleBuilder.java:81)
    at org.apache.maven.lifecycle.internal.builder.singlethreaded.SingleThreadedBuilder.build (SingleThreadedBuilder.java:56)
    at org.apache.maven.lifecycle.internal.LifecycleStarter.execute (LifecycleStarter.java:128)
    at org.apache.maven.DefaultMaven.doExecute (DefaultMaven.java:305)
    at org.apache.maven.DefaultMaven.doExecute (DefaultMaven.java:192)
    at org.apache.maven.DefaultMaven.execute (DefaultMaven.java:105)
    at org.apache.maven.cli.MavenCli.execute (MavenCli.java:956)
    at org.apache.maven.cli.MavenCli.doMain (MavenCli.java:288)
    at org.apache.maven.cli.MavenCli.main (MavenCli.java:192)
    at sun.reflect.NativeMethodAccessorImpl.invoke0 (Native Method)
    at sun.reflect.NativeMethodAccessorImpl.invoke (NativeMethodAccessorImpl.java:57)
    at sun.reflect.DelegatingMethodAccessorImpl.invoke (DelegatingMethodAccessorImpl.java:43)
    at java.lang.reflect.Method.invoke (Method.java:606)
    at org.codehaus.plexus.classworlds.launcher.Launcher.launchEnhanced (Launcher.java:282)
    at org.codehaus.plexus.classworlds.launcher.Launcher.launch (Launcher.java:225)
    at org.codehaus.plexus.classworlds.launcher.Launcher.mainWithExitCode (Launcher.java:406)
    at org.codehaus.plexus.classworlds.launcher.Launcher.main (Launcher.java:347)
Caused by: org.eclipse.aether.collection.DependencyCollectionException: Failed to collect dependencies at org.apache.maven.its.mng0553:a:jar:0.1-SNAPSHOT
    at org.eclipse.aether.internal.impl.collect.DefaultDependencyCollector.collectDependencies (DefaultDependencyCollector.java:284)
    at org.eclipse.aether.internal.impl.DefaultRepositorySystem.collectDependencies (DefaultRepositorySystem.java:279)
    at org.apache.maven.project.DefaultProjectDependenciesResolver.resolve (DefaultProjectDependenciesResolver.java:169)
    at org.apache.maven.lifecycle.internal.LifecycleDependencyResolver.getDependencies (LifecycleDependencyResolver.java:243)
    at org.apache.maven.lifecycle.internal.LifecycleDependencyResolver.resolveProjectDependencies (LifecycleDependencyResolver.java:147)
    at org.apache.maven.lifecycle.internal.MojoExecutor.ensureDependenciesAreResolved (MojoExecutor.java:248)
    at org.apache.maven.lifecycle.internal.MojoExecutor.execute (MojoExecutor.java:202)
    at org.apache.maven.lifecycle.internal.MojoExecutor.execute (MojoExecutor.java:156)
    at org.apache.maven.lifecycle.internal.MojoExecutor.execute (MojoExecutor.java:148)
    at org.apache.maven.lifecycle.internal.LifecycleModuleBuilder.buildProject (LifecycleModuleBuilder.java:117)
    at org.apache.maven.lifecycle.internal.LifecycleModuleBuilder.buildProject (LifecycleModuleBuilder.java:81)
    at org.apache.maven.lifecycle.internal.builder.singlethreaded.SingleThreadedBuilder.build (SingleThreadedBuilder.java:56)
    at org.apache.maven.lifecycle.internal.LifecycleStarter.execute (LifecycleStarter.java:128)
    at org.apache.maven.DefaultMaven.doExecute (DefaultMaven.java:305)
    at org.apache.maven.DefaultMaven.doExecute (DefaultMaven.java:192)
    at org.apache.maven.DefaultMaven.execute (DefaultMaven.java:105)
    at org.apache.maven.cli.MavenCli.execute (MavenCli.java:956)
    at org.apache.maven.cli.MavenCli.doMain (MavenCli.java:288)
    at org.apache.maven.cli.MavenCli.main (MavenCli.java:192)
    at sun.reflect.NativeMethodAccessorImpl.invoke0 (Native Method)
    at sun.reflect.NativeMethodAccessorImpl.invoke (NativeMethodAccessorImpl.java:57)
    at sun.reflect.DelegatingMethodAccessorImpl.invoke (DelegatingMethodAccessorImpl.java:43)
    at java.lang.reflect.Method.invoke (Method.java:606)
    at org.codehaus.plexus.classworlds.launcher.Launcher.launchEnhanced (Launcher.java:282)
    at org.codehaus.plexus.classworlds.launcher.Launcher.launch (Launcher.java:225)
    at org.codehaus.plexus.classworlds.launcher.Launcher.mainWithExitCode (Launcher.java:406)
    at org.codehaus.plexus.classworlds.launcher.Launcher.main (Launcher.java:347)
Caused by: org.eclipse.aether.resolution.ArtifactDescriptorException: Failed to read artifact descriptor for org.apache.maven.its.mng0553:a:jar:0.1-SNAPSHOT
    at org.apache.maven.repository.internal.DefaultArtifactDescriptorReader.loadPom (DefaultArtifactDescriptorReader.java:255)
    at org.apache.maven.repository.internal.DefaultArtifactDescriptorReader.readArtifactDescriptor (DefaultArtifactDescriptorReader.java:171)
    at org.eclipse.aether.internal.impl.collect.DefaultDependencyCollector.resolveCachedArtifactDescriptor (DefaultDependencyCollector.java:530)
    at org.eclipse.aether.internal.impl.collect.DefaultDependencyCollector.getArtifactDescriptorResult (DefaultDependencyCollector.java:515)
    at org.eclipse.aether.internal.impl.collect.DefaultDependencyCollector.processDependency (DefaultDependencyCollector.java:403)
    at org.eclipse.aether.internal.impl.collect.DefaultDependencyCollector.processDependency (DefaultDependencyCollector.java:356)
    at org.eclipse.aether.internal.impl.collect.DefaultDependencyCollector.process (DefaultDependencyCollector.java:344)
    at org.eclipse.aether.internal.impl.collect.DefaultDependencyCollector.collectDependencies (DefaultDependencyCollector.java:247)
    at org.eclipse.aether.internal.impl.DefaultRepositorySystem.collectDependencies (DefaultRepositorySystem.java:279)
    at org.apache.maven.project.DefaultProjectDependenciesResolver.resolve (DefaultProjectDependenciesResolver.java:169)
    at org.apache.maven.lifecycle.internal.LifecycleDependencyResolver.getDependencies (LifecycleDependencyResolver.java:243)
    at org.apache.maven.lifecycle.internal.LifecycleDependencyResolver.resolveProjectDependencies (LifecycleDependencyResolver.java:147)
    at org.apache.maven.lifecycle.internal.MojoExecutor.ensureDependenciesAreResolved (MojoExecutor.java:248)
    at org.apache.maven.lifecycle.internal.MojoExecutor.execute (MojoExecutor.java:202)
    at org.apache.maven.lifecycle.internal.MojoExecutor.execute (MojoExecutor.java:156)
    at org.apache.maven.lifecycle.internal.MojoExecutor.execute (MojoExecutor.java:148)
    at org.apache.maven.lifecycle.internal.LifecycleModuleBuilder.buildProject (LifecycleModuleBuilder.java:117)
    at org.apache.maven.lifecycle.internal.LifecycleModuleBuilder.buildProject (LifecycleModuleBuilder.java:81)
    at org.apache.maven.lifecycle.internal.builder.singlethreaded.SingleThreadedBuilder.build (SingleThreadedBuilder.java:56)
    at org.apache.maven.lifecycle.internal.LifecycleStarter.execute (LifecycleStarter.java:128)
    at org.apache.maven.DefaultMaven.doExecute (DefaultMaven.java:305)
    at org.apache.maven.DefaultMaven.doExecute (DefaultMaven.java:192)
    at org.apache.maven.DefaultMaven.execute (DefaultMaven.java:105)
    at org.apache.maven.cli.MavenCli.execute (MavenCli.java:956)
    at org.apache.maven.cli.MavenCli.doMain (MavenCli.java:288)
    at org.apache.maven.cli.MavenCli.main (MavenCli.java:192)
    at sun.reflect.NativeMethodAccessorImpl.invoke0 (Native Method)
    at sun.reflect.NativeMethodAccessorImpl.invoke (NativeMethodAccessorImpl.java:57)
    at sun.reflect.DelegatingMethodAccessorImpl.invoke (DelegatingMethodAccessorImpl.java:43)
    at java.lang.reflect.Method.invoke (Method.java:606)
    at org.codehaus.plexus.classworlds.launcher.Launcher.launchEnhanced (Launcher.java:282)
    at org.codehaus.plexus.classworlds.launcher.Launcher.launch (Launcher.java:225)
    at org.codehaus.plexus.classworlds.launcher.Launcher.mainWithExitCode (Launcher.java:406)
    at org.codehaus.plexus.classworlds.launcher.Launcher.main (Launcher.java:347)
Caused by: org.eclipse.aether.resolution.ArtifactResolutionException: Could not transfer artifact org.apache.maven.its.mng0553:a:pom:0.1-SNAPSHOT from/to test (http://localhost:-1/): Connect to localhost:80 [localhost/127.0.0.1, localhost/0:0:0:0:0:0:0:1] failed: Connection refused: connect
    at org.eclipse.aether.internal.impl.DefaultArtifactResolver.resolve (DefaultArtifactResolver.java:423)
    at org.eclipse.aether.internal.impl.DefaultArtifactResolver.resolveArtifacts (DefaultArtifactResolver.java:225)
    at org.eclipse.aether.internal.impl.DefaultArtifactResolver.resolveArtifact (DefaultArtifactResolver.java:202)
    at org.apache.maven.repository.internal.DefaultArtifactDescriptorReader.loadPom (DefaultArtifactDescriptorReader.java:240)
    at org.apache.maven.repository.internal.DefaultArtifactDescriptorReader.readArtifactDescriptor (DefaultArtifactDescriptorReader.java:171)
    at org.eclipse.aether.internal.impl.collect.DefaultDependencyCollector.resolveCachedArtifactDescriptor (DefaultDependencyCollector.java:530)
    at org.eclipse.aether.internal.impl.collect.DefaultDependencyCollector.getArtifactDescriptorResult (DefaultDependencyCollector.java:515)
    at org.eclipse.aether.internal.impl.collect.DefaultDependencyCollector.processDependency (DefaultDependencyCollector.java:403)
    at org.eclipse.aether.internal.impl.collect.DefaultDependencyCollector.processDependency (DefaultDependencyCollector.java:356)
    at org.eclipse.aether.internal.impl.collect.DefaultDependencyCollector.process (DefaultDependencyCollector.java:344)
    at org.eclipse.aether.internal.impl.collect.DefaultDependencyCollector.collectDependencies (DefaultDependencyCollector.java:247)
    at org.eclipse.aether.internal.impl.DefaultRepositorySystem.collectDependencies (DefaultRepositorySystem.java:279)
    at org.apache.maven.project.DefaultProjectDependenciesResolver.resolve (DefaultProjectDependenciesResolver.java:169)
    at org.apache.maven.lifecycle.internal.LifecycleDependencyResolver.getDependencies (LifecycleDependencyResolver.java:243)
    at org.apache.maven.lifecycle.internal.LifecycleDependencyResolver.resolveProjectDependencies (LifecycleDependencyResolver.java:147)
    at org.apache.maven.lifecycle.internal.MojoExecutor.ensureDependenciesAreResolved (MojoExecutor.java:248)
    at org.apache.maven.lifecycle.internal.MojoExecutor.execute (MojoExecutor.java:202)
    at org.apache.maven.lifecycle.internal.MojoExecutor.execute (MojoExecutor.java:156)
    at org.apache.maven.lifecycle.internal.MojoExecutor.execute (MojoExecutor.java:148)
    at org.apache.maven.lifecycle.internal.LifecycleModuleBuilder.buildProject (LifecycleModuleBuilder.java:117)
    at org.apache.maven.lifecycle.internal.LifecycleModuleBuilder.buildProject (LifecycleModuleBuilder.java:81)
    at org.apache.maven.lifecycle.internal.builder.singlethreaded.SingleThreadedBuilder.build (SingleThreadedBuilder.java:56)
    at org.apache.maven.lifecycle.internal.LifecycleStarter.execute (LifecycleStarter.java:128)
    at org.apache.maven.DefaultMaven.doExecute (DefaultMaven.java:305)
    at org.apache.maven.DefaultMaven.doExecute (DefaultMaven.java:192)
    at org.apache.maven.DefaultMaven.execute (DefaultMaven.java:105)
    at org.apache.maven.cli.MavenCli.execute (MavenCli.java:956)
    at org.apache.maven.cli.MavenCli.doMain (MavenCli.java:288)
    at org.apache.maven.cli.MavenCli.main (MavenCli.java:192)
    at sun.reflect.NativeMethodAccessorImpl.invoke0 (Native Method)
    at sun.reflect.NativeMethodAccessorImpl.invoke (NativeMethodAccessorImpl.java:57)
    at sun.reflect.DelegatingMethodAccessorImpl.invoke (DelegatingMethodAccessorImpl.java:43)
    at java.lang.reflect.Method.invoke (Method.java:606)
    at org.codehaus.plexus.classworlds.launcher.Launcher.launchEnhanced (Launcher.java:282)
    at org.codehaus.plexus.classworlds.launcher.Launcher.launch (Launcher.java:225)
    at org.codehaus.plexus.classworlds.launcher.Launcher.mainWithExitCode (Launcher.java:406)
    at org.codehaus.plexus.classworlds.launcher.Launcher.main (Launcher.java:347)
Caused by: org.eclipse.aether.transfer.ArtifactTransferException: Could not transfer artifact org.apache.maven.its.mng0553:a:pom:0.1-SNAPSHOT from/to test (http://localhost:-1/): Connect to localhost:80 [localhost/127.0.0.1, localhost/0:0:0:0:0:0:0:1] failed: Connection refused: connect
    at org.eclipse.aether.connector.basic.ArtifactTransportListener.transferFailed (ArtifactTransportListener.java:52)
    at org.eclipse.aether.connector.basic.BasicRepositoryConnector$TaskRunner.run (BasicRepositoryConnector.java:368)
    at org.eclipse.aether.util.concurrency.RunnableErrorForwarder$1.run (RunnableErrorForwarder.java:75)
    at org.eclipse.aether.connector.basic.BasicRepositoryConnector$DirectExecutor.execute (BasicRepositoryConnector.java:642)
    at org.eclipse.aether.connector.basic.BasicRepositoryConnector.get (BasicRepositoryConnector.java:262)
    at org.eclipse.aether.internal.impl.DefaultArtifactResolver.performDownloads (DefaultArtifactResolver.java:499)
    at org.eclipse.aether.internal.impl.DefaultArtifactResolver.resolve (DefaultArtifactResolver.java:400)
    at org.eclipse.aether.internal.impl.DefaultArtifactResolver.resolveArtifacts (DefaultArtifactResolver.java:225)
    at org.eclipse.aether.internal.impl.DefaultArtifactResolver.resolveArtifact (DefaultArtifactResolver.java:202)
    at org.apache.maven.repository.internal.DefaultArtifactDescriptorReader.loadPom (DefaultArtifactDescriptorReader.java:240)
    at org.apache.maven.repository.internal.DefaultArtifactDescriptorReader.readArtifactDescriptor (DefaultArtifactDescriptorReader.java:171)
    at org.eclipse.aether.internal.impl.collect.DefaultDependencyCollector.resolveCachedArtifactDescriptor (DefaultDependencyCollector.java:530)
    at org.eclipse.aether.internal.impl.collect.DefaultDependencyCollector.getArtifactDescriptorResult (DefaultDependencyCollector.java:515)
    at org.eclipse.aether.internal.impl.collect.DefaultDependencyCollector.processDependency (DefaultDependencyCollector.java:403)
    at org.eclipse.aether.internal.impl.collect.DefaultDependencyCollector.processDependency (DefaultDependencyCollector.java:356)
    at org.eclipse.aether.internal.impl.collect.DefaultDependencyCollector.process (DefaultDependencyCollector.java:344)
    at org.eclipse.aether.internal.impl.collect.DefaultDependencyCollector.collectDependencies (DefaultDependencyCollector.java:247)
    at org.eclipse.aether.internal.impl.DefaultRepositorySystem.collectDependencies (DefaultRepositorySystem.java:279)
    at org.apache.maven.project.DefaultProjectDependenciesResolver.resolve (DefaultProjectDependenciesResolver.java:169)
    at org.apache.maven.lifecycle.internal.LifecycleDependencyResolver.getDependencies (LifecycleDependencyResolver.java:243)
    at org.apache.maven.lifecycle.internal.LifecycleDependencyResolver.resolveProjectDependencies (LifecycleDependencyResolver.java:147)
    at org.apache.maven.lifecycle.internal.MojoExecutor.ensureDependenciesAreResolved (MojoExecutor.java:248)
    at org.apache.maven.lifecycle.internal.MojoExecutor.execute (MojoExecutor.java:202)
    at org.apache.maven.lifecycle.internal.MojoExecutor.execute (MojoExecutor.java:156)
    at org.apache.maven.lifecycle.internal.MojoExecutor.execute (MojoExecutor.java:148)
    at org.apache.maven.lifecycle.internal.LifecycleModuleBuilder.buildProject (LifecycleModuleBuilder.java:117)
    at org.apache.maven.lifecycle.internal.LifecycleModuleBuilder.buildProject (LifecycleModuleBuilder.java:81)
    at org.apache.maven.lifecycle.internal.builder.singlethreaded.SingleThreadedBuilder.build (SingleThreadedBuilder.java:56)
    at org.apache.maven.lifecycle.internal.LifecycleStarter.execute (LifecycleStarter.java:128)
    at org.apache.maven.DefaultMaven.doExecute (DefaultMaven.java:305)
    at org.apache.maven.DefaultMaven.doExecute (DefaultMaven.java:192)
    at org.apache.maven.DefaultMaven.execute (DefaultMaven.java:105)
    at org.apache.maven.cli.MavenCli.execute (MavenCli.java:956)
    at org.apache.maven.cli.MavenCli.doMain (MavenCli.java:288)
    at org.apache.maven.cli.MavenCli.main (MavenCli.java:192)
    at sun.reflect.NativeMethodAccessorImpl.invoke0 (Native Method)
    at sun.reflect.NativeMethodAccessorImpl.invoke (NativeMethodAccessorImpl.java:57)
    at sun.reflect.DelegatingMethodAccessorImpl.invoke (DelegatingMethodAccessorImpl.java:43)
    at java.lang.reflect.Method.invoke (Method.java:606)
    at org.codehaus.plexus.classworlds.launcher.Launcher.launchEnhanced (Launcher.java:282)
    at org.codehaus.plexus.classworlds.launcher.Launcher.launch (Launcher.java:225)
    at org.codehaus.plexus.classworlds.launcher.Launcher.mainWithExitCode (Launcher.java:406)
    at org.codehaus.plexus.classworlds.launcher.Launcher.main (Launcher.java:347)
Caused by: org.apache.maven.wagon.TransferFailedException: Connect to localhost:80 [localhost/127.0.0.1, localhost/0:0:0:0:0:0:0:1] failed: Connection refused: connect
    at org.apache.maven.wagon.providers.http.wagon.shared.AbstractHttpClientWagon.fillInputData (AbstractHttpClientWagon.java:1206)
    at org.apache.maven.wagon.providers.http.wagon.shared.AbstractHttpClientWagon.fillInputData (AbstractHttpClientWagon.java:1094)
    at org.apache.maven.wagon.StreamWagon.getInputStream (StreamWagon.java:126)
    at org.apache.maven.wagon.StreamWagon.getIfNewer (StreamWagon.java:88)
    at org.apache.maven.wagon.StreamWagon.get (StreamWagon.java:61)
    at org.eclipse.aether.transport.wagon.WagonTransporter$GetTaskRunner.run (WagonTransporter.java:567)
    at org.eclipse.aether.transport.wagon.WagonTransporter.execute (WagonTransporter.java:435)
    at org.eclipse.aether.transport.wagon.WagonTransporter.get (WagonTransporter.java:412)
    at org.eclipse.aether.connector.basic.BasicRepositoryConnector$GetTaskRunner.runTask (BasicRepositoryConnector.java:456)
    at org.eclipse.aether.connector.basic.BasicRepositoryConnector$TaskRunner.run (BasicRepositoryConnector.java:363)
    at org.eclipse.aether.util.concurrency.RunnableErrorForwarder$1.run (RunnableErrorForwarder.java:75)
    at org.eclipse.aether.connector.basic.BasicRepositoryConnector$DirectExecutor.execute (BasicRepositoryConnector.java:642)
    at org.eclipse.aether.connector.basic.BasicRepositoryConnector.get (BasicRepositoryConnector.java:262)
    at org.eclipse.aether.internal.impl.DefaultArtifactResolver.performDownloads (DefaultArtifactResolver.java:499)
    at org.eclipse.aether.internal.impl.DefaultArtifactResolver.resolve (DefaultArtifactResolver.java:400)
    at org.eclipse.aether.internal.impl.DefaultArtifactResolver.resolveArtifacts (DefaultArtifactResolver.java:225)
    at org.eclipse.aether.internal.impl.DefaultArtifactResolver.resolveArtifact (DefaultArtifactResolver.java:202)
    at org.apache.maven.repository.internal.DefaultArtifactDescriptorReader.loadPom (DefaultArtifactDescriptorReader.java:240)
    at org.apache.maven.repository.internal.DefaultArtifactDescriptorReader.readArtifactDescriptor (DefaultArtifactDescriptorReader.java:171)
    at org.eclipse.aether.internal.impl.collect.DefaultDependencyCollector.resolveCachedArtifactDescriptor (DefaultDependencyCollector.java:530)
    at org.eclipse.aether.internal.impl.collect.DefaultDependencyCollector.getArtifactDescriptorResult (DefaultDependencyCollector.java:515)
    at org.eclipse.aether.internal.impl.collect.DefaultDependencyCollector.processDependency (DefaultDependencyCollector.java:403)
    at org.eclipse.aether.internal.impl.collect.DefaultDependencyCollector.processDependency (DefaultDependencyCollector.java:356)
    at org.eclipse.aether.internal.impl.collect.DefaultDependencyCollector.process (DefaultDependencyCollector.java:344)
    at org.eclipse.aether.internal.impl.collect.DefaultDependencyCollector.collectDependencies (DefaultDependencyCollector.java:247)
    at org.eclipse.aether.internal.impl.DefaultRepositorySystem.collectDependencies (DefaultRepositorySystem.java:279)
    at org.apache.maven.project.DefaultProjectDependenciesResolver.resolve (DefaultProjectDependenciesResolver.java:169)
    at org.apache.maven.lifecycle.internal.LifecycleDependencyResolver.getDependencies (LifecycleDependencyResolver.java:243)
    at org.apache.maven.lifecycle.internal.LifecycleDependencyResolver.resolveProjectDependencies (LifecycleDependencyResolver.java:147)
    at org.apache.maven.lifecycle.internal.MojoExecutor.ensureDependenciesAreResolved (MojoExecutor.java:248)
    at org.apache.maven.lifecycle.internal.MojoExecutor.execute (MojoExecutor.java:202)
    at org.apache.maven.lifecycle.internal.MojoExecutor.execute (MojoExecutor.java:156)
    at org.apache.maven.lifecycle.internal.MojoExecutor.execute (MojoExecutor.java:148)
    at org.apache.maven.lifecycle.internal.LifecycleModuleBuilder.buildProject (LifecycleModuleBuilder.java:117)
    at org.apache.maven.lifecycle.internal.LifecycleModuleBuilder.buildProject (LifecycleModuleBuilder.java:81)
    at org.apache.maven.lifecycle.internal.builder.singlethreaded.SingleThreadedBuilder.build (SingleThreadedBuilder.java:56)
    at org.apache.maven.lifecycle.internal.LifecycleStarter.execute (LifecycleStarter.java:128)
    at org.apache.maven.DefaultMaven.doExecute (DefaultMaven.java:305)
    at org.apache.maven.DefaultMaven.doExecute (DefaultMaven.java:192)
    at org.apache.maven.DefaultMaven.execute (DefaultMaven.java:105)
    at org.apache.maven.cli.MavenCli.execute (MavenCli.java:956)
    at org.apache.maven.cli.MavenCli.doMain (MavenCli.java:288)
    at org.apache.maven.cli.MavenCli.main (MavenCli.java:192)
    at sun.reflect.NativeMethodAccessorImpl.invoke0 (Native Method)
    at sun.reflect.NativeMethodAccessorImpl.invoke (NativeMethodAccessorImpl.java:57)
    at sun.reflect.DelegatingMethodAccessorImpl.invoke (DelegatingMethodAccessorImpl.java:43)
    at java.lang.reflect.Method.invoke (Method.java:606)
    at org.codehaus.plexus.classworlds.launcher.Launcher.launchEnhanced (Launcher.java:282)
    at org.codehaus.plexus.classworlds.launcher.Launcher.launch (Launcher.java:225)
    at org.codehaus.plexus.classworlds.launcher.Launcher.mainWithExitCode (Launcher.java:406)
    at org.codehaus.plexus.classworlds.launcher.Launcher.main (Launcher.java:347)
Caused by: org.apache.maven.wagon.providers.http.httpclient.conn.HttpHostConnectException: Connect to localhost:80 [localhost/127.0.0.1, localhost/0:0:0:0:0:0:0:1] failed: Connection refused: connect
    at org.apache.maven.wagon.providers.http.httpclient.impl.conn.DefaultHttpClientConnectionOperator.connect (DefaultHttpClientConnectionOperator.java:156)
    at org.apache.maven.wagon.providers.http.httpclient.impl.conn.PoolingHttpClientConnectionManager.connect (PoolingHttpClientConnectionManager.java:374)
    at org.apache.maven.wagon.providers.http.httpclient.impl.execchain.MainClientExec.establishRoute (MainClientExec.java:393)
    at org.apache.maven.wagon.providers.http.httpclient.impl.execchain.MainClientExec.execute (MainClientExec.java:236)
    at org.apache.maven.wagon.providers.http.httpclient.impl.execchain.ProtocolExec.execute (ProtocolExec.java:185)
    at org.apache.maven.wagon.providers.http.httpclient.impl.execchain.RetryExec.execute (RetryExec.java:89)
    at org.apache.maven.wagon.providers.http.httpclient.impl.execchain.RedirectExec.execute (RedirectExec.java:110)
    at org.apache.maven.wagon.providers.http.httpclient.impl.client.InternalHttpClient.doExecute (InternalHttpClient.java:185)
    at org.apache.maven.wagon.providers.http.httpclient.impl.client.CloseableHttpClient.execute (CloseableHttpClient.java:83)
    at org.apache.maven.wagon.providers.http.wagon.shared.AbstractHttpClientWagon.execute (AbstractHttpClientWagon.java:958)
    at org.apache.maven.wagon.providers.http.wagon.shared.AbstractHttpClientWagon.fillInputData (AbstractHttpClientWagon.java:1117)
    at org.apache.maven.wagon.providers.http.wagon.shared.AbstractHttpClientWagon.fillInputData (AbstractHttpClientWagon.java:1094)
    at org.apache.maven.wagon.StreamWagon.getInputStream (StreamWagon.java:126)
    at org.apache.maven.wagon.StreamWagon.getIfNewer (StreamWagon.java:88)
    at org.apache.maven.wagon.StreamWagon.get (StreamWagon.java:61)
    at org.eclipse.aether.transport.wagon.WagonTransporter$GetTaskRunner.run (WagonTransporter.java:567)
    at org.eclipse.aether.transport.wagon.WagonTransporter.execute (WagonTransporter.java:435)
    at org.eclipse.aether.transport.wagon.WagonTransporter.get (WagonTransporter.java:412)
    at org.eclipse.aether.connector.basic.BasicRepositoryConnector$GetTaskRunner.runTask (BasicRepositoryConnector.java:456)
    at org.eclipse.aether.connector.basic.BasicRepositoryConnector$TaskRunner.run (BasicRepositoryConnector.java:363)
    at org.eclipse.aether.util.concurrency.RunnableErrorForwarder$1.run (RunnableErrorForwarder.java:75)
    at org.eclipse.aether.connector.basic.BasicRepositoryConnector$DirectExecutor.execute (BasicRepositoryConnector.java:642)
    at org.eclipse.aether.connector.basic.BasicRepositoryConnector.get (BasicRepositoryConnector.java:262)
    at org.eclipse.aether.internal.impl.DefaultArtifactResolver.performDownloads (DefaultArtifactResolver.java:499)
    at org.eclipse.aether.internal.impl.DefaultArtifactResolver.resolve (DefaultArtifactResolver.java:400)
    at org.eclipse.aether.internal.impl.DefaultArtifactResolver.resolveArtifacts (DefaultArtifactResolver.java:225)
    at org.eclipse.aether.internal.impl.DefaultArtifactResolver.resolveArtifact (DefaultArtifactResolver.java:202)
    at org.apache.maven.repository.internal.DefaultArtifactDescriptorReader.loadPom (DefaultArtifactDescriptorReader.java:240)
    at org.apache.maven.repository.internal.DefaultArtifactDescriptorReader.readArtifactDescriptor (DefaultArtifactDescriptorReader.java:171)
    at org.eclipse.aether.internal.impl.collect.DefaultDependencyCollector.resolveCachedArtifactDescriptor (DefaultDependencyCollector.java:530)
    at org.eclipse.aether.internal.impl.collect.DefaultDependencyCollector.getArtifactDescriptorResult (DefaultDependencyCollector.java:515)
    at org.eclipse.aether.internal.impl.collect.DefaultDependencyCollector.processDependency (DefaultDependencyCollector.java:403)
    at org.eclipse.aether.internal.impl.collect.DefaultDependencyCollector.processDependency (DefaultDependencyCollector.java:356)
    at org.eclipse.aether.internal.impl.collect.DefaultDependencyCollector.process (DefaultDependencyCollector.java:344)
    at org.eclipse.aether.internal.impl.collect.DefaultDependencyCollector.collectDependencies (DefaultDependencyCollector.java:247)
    at org.eclipse.aether.internal.impl.DefaultRepositorySystem.collectDependencies (DefaultRepositorySystem.java:279)
    at org.apache.maven.project.DefaultProjectDependenciesResolver.resolve (DefaultProjectDependenciesResolver.java:169)
    at org.apache.maven.lifecycle.internal.LifecycleDependencyResolver.getDependencies (LifecycleDependencyResolver.java:243)
    at org.apache.maven.lifecycle.internal.LifecycleDependencyResolver.resolveProjectDependencies (LifecycleDependencyResolver.java:147)
    at org.apache.maven.lifecycle.internal.MojoExecutor.ensureDependenciesAreResolved (MojoExecutor.java:248)
    at org.apache.maven.lifecycle.internal.MojoExecutor.execute (MojoExecutor.java:202)
    at org.apache.maven.lifecycle.internal.MojoExecutor.execute (MojoExecutor.java:156)
    at org.apache.maven.lifecycle.internal.MojoExecutor.execute (MojoExecutor.java:148)
    at org.apache.maven.lifecycle.internal.LifecycleModuleBuilder.buildProject (LifecycleModuleBuilder.java:117)
    at org.apache.maven.lifecycle.internal.LifecycleModuleBuilder.buildProject (LifecycleModuleBuilder.java:81)
    at org.apache.maven.lifecycle.internal.builder.singlethreaded.SingleThreadedBuilder.build (SingleThreadedBuilder.java:56)
    at org.apache.maven.lifecycle.internal.LifecycleStarter.execute (LifecycleStarter.java:128)
    at org.apache.maven.DefaultMaven.doExecute (DefaultMaven.java:305)
    at org.apache.maven.DefaultMaven.doExecute (DefaultMaven.java:192)
    at org.apache.maven.DefaultMaven.execute (DefaultMaven.java:105)
    at org.apache.maven.cli.MavenCli.execute (MavenCli.java:956)
    at org.apache.maven.cli.MavenCli.doMain (MavenCli.java:288)
    at org.apache.maven.cli.MavenCli.main (MavenCli.java:192)
    at sun.reflect.NativeMethodAccessorImpl.invoke0 (Native Method)
    at sun.reflect.NativeMethodAccessorImpl.invoke (NativeMethodAccessorImpl.java:57)
    at sun.reflect.DelegatingMethodAccessorImpl.invoke (DelegatingMethodAccessorImpl.java:43)
    at java.lang.reflect.Method.invoke (Method.java:606)
    at org.codehaus.plexus.classworlds.launcher.Launcher.launchEnhanced (Launcher.java:282)
    at org.codehaus.plexus.classworlds.launcher.Launcher.launch (Launcher.java:225)
    at org.codehaus.plexus.classworlds.launcher.Launcher.mainWithExitCode (Launcher.java:406)
    at org.codehaus.plexus.classworlds.launcher.Launcher.main (Launcher.java:347)
Caused by: java.net.ConnectException: Connection refused: connect
    at java.net.DualStackPlainSocketImpl.connect0 (Native Method)
    at java.net.DualStackPlainSocketImpl.socketConnect (DualStackPlainSocketImpl.java:79)
    at java.net.AbstractPlainSocketImpl.doConnect (AbstractPlainSocketImpl.java:339)
    at java.net.AbstractPlainSocketImpl.connectToAddress (AbstractPlainSocketImpl.java:200)
    at java.net.AbstractPlainSocketImpl.connect (AbstractPlainSocketImpl.java:182)
    at java.net.PlainSocketImpl.connect (PlainSocketImpl.java:172)
    at java.net.SocksSocketImpl.connect (SocksSocketImpl.java:392)
    at java.net.Socket.connect (Socket.java:579)
    at org.apache.maven.wagon.providers.http.httpclient.conn.socket.PlainConnectionSocketFactory.connectSocket (PlainConnectionSocketFactory.java:75)
    at org.apache.maven.wagon.providers.http.httpclient.impl.conn.DefaultHttpClientConnectionOperator.connect (DefaultHttpClientConnectionOperator.java:142)
    at org.apache.maven.wagon.providers.http.httpclient.impl.conn.PoolingHttpClientConnectionManager.connect (PoolingHttpClientConnectionManager.java:374)
    at org.apache.maven.wagon.providers.http.httpclient.impl.execchain.MainClientExec.establishRoute (MainClientExec.java:393)
    at org.apache.maven.wagon.providers.http.httpclient.impl.execchain.MainClientExec.execute (MainClientExec.java:236)
    at org.apache.maven.wagon.providers.http.httpclient.impl.execchain.ProtocolExec.execute (ProtocolExec.java:185)
    at org.apache.maven.wagon.providers.http.httpclient.impl.execchain.RetryExec.execute (RetryExec.java:89)
    at org.apache.maven.wagon.providers.http.httpclient.impl.execchain.RedirectExec.execute (RedirectExec.java:110)
    at org.apache.maven.wagon.providers.http.httpclient.impl.client.InternalHttpClient.doExecute (InternalHttpClient.java:185)
    at org.apache.maven.wagon.providers.http.httpclient.impl.client.CloseableHttpClient.execute (CloseableHttpClient.java:83)
    at org.apache.maven.wagon.providers.http.wagon.shared.AbstractHttpClientWagon.execute (AbstractHttpClientWagon.java:958)
    at org.apache.maven.wagon.providers.http.wagon.shared.AbstractHttpClientWagon.fillInputData (AbstractHttpClientWagon.java:1117)
    at org.apache.maven.wagon.providers.http.wagon.shared.AbstractHttpClientWagon.fillInputData (AbstractHttpClientWagon.java:1094)
    at org.apache.maven.wagon.StreamWagon.getInputStream (StreamWagon.java:126)
    at org.apache.maven.wagon.StreamWagon.getIfNewer (StreamWagon.java:88)
    at org.apache.maven.wagon.StreamWagon.get (StreamWagon.java:61)
    at org.eclipse.aether.transport.wagon.WagonTransporter$GetTaskRunner.run (WagonTransporter.java:567)
    at org.eclipse.aether.transport.wagon.WagonTransporter.execute (WagonTransporter.java:435)
    at org.eclipse.aether.transport.wagon.WagonTransporter.get (WagonTransporter.java:412)
    at org.eclipse.aether.connector.basic.BasicRepositoryConnector$GetTaskRunner.runTask (BasicRepositoryConnector.java:456)
    at org.eclipse.aether.connector.basic.BasicRepositoryConnector$TaskRunner.run (BasicRepositoryConnector.java:363)
    at org.eclipse.aether.util.concurrency.RunnableErrorForwarder$1.run (RunnableErrorForwarder.java:75)
    at org.eclipse.aether.connector.basic.BasicRepositoryConnector$DirectExecutor.execute (BasicRepositoryConnector.java:642)
    at org.eclipse.aether.connector.basic.BasicRepositoryConnector.get (BasicRepositoryConnector.java:262)
    at org.eclipse.aether.internal.impl.DefaultArtifactResolver.performDownloads (DefaultArtifactResolver.java:499)
    at org.eclipse.aether.internal.impl.DefaultArtifactResolver.resolve (DefaultArtifactResolver.java:400)
    at org.eclipse.aether.internal.impl.DefaultArtifactResolver.resolveArtifacts (DefaultArtifactResolver.java:225)
    at org.eclipse.aether.internal.impl.DefaultArtifactResolver.resolveArtifact (DefaultArtifactResolver.java:202)
    at org.apache.maven.repository.internal.DefaultArtifactDescriptorReader.loadPom (DefaultArtifactDescriptorReader.java:240)
    at org.apache.maven.repository.internal.DefaultArtifactDescriptorReader.readArtifactDescriptor (DefaultArtifactDescriptorReader.java:171)
    at org.eclipse.aether.internal.impl.collect.DefaultDependencyCollector.resolveCachedArtifactDescriptor (DefaultDependencyCollector.java:530)
    at org.eclipse.aether.internal.impl.collect.DefaultDependencyCollector.getArtifactDescriptorResult (DefaultDependencyCollector.java:515)
    at org.eclipse.aether.internal.impl.collect.DefaultDependencyCollector.processDependency (DefaultDependencyCollector.java:403)
    at org.eclipse.aether.internal.impl.collect.DefaultDependencyCollector.processDependency (DefaultDependencyCollector.java:356)
    at org.eclipse.aether.internal.impl.collect.DefaultDependencyCollector.process (DefaultDependencyCollector.java:344)
    at org.eclipse.aether.internal.impl.collect.DefaultDependencyCollector.collectDependencies (DefaultDependencyCollector.java:247)
    at org.eclipse.aether.internal.impl.DefaultRepositorySystem.collectDependencies (DefaultRepositorySystem.java:279)
    at org.apache.maven.project.DefaultProjectDependenciesResolver.resolve (DefaultProjectDependenciesResolver.java:169)
    at org.apache.maven.lifecycle.internal.LifecycleDependencyResolver.getDependencies (LifecycleDependencyResolver.java:243)
    at org.apache.maven.lifecycle.internal.LifecycleDependencyResolver.resolveProjectDependencies (LifecycleDependencyResolver.java:147)
    at org.apache.maven.lifecycle.internal.MojoExecutor.ensureDependenciesAreResolved (MojoExecutor.java:248)
    at org.apache.maven.lifecycle.internal.MojoExecutor.execute (MojoExecutor.java:202)
    at org.apache.maven.lifecycle.internal.MojoExecutor.execute (MojoExecutor.java:156)
    at org.apache.maven.lifecycle.internal.MojoExecutor.execute (MojoExecutor.java:148)
    at org.apache.maven.lifecycle.internal.LifecycleModuleBuilder.buildProject (LifecycleModuleBuilder.java:117)
    at org.apache.maven.lifecycle.internal.LifecycleModuleBuilder.buildProject (LifecycleModuleBuilder.java:81)
    at org.apache.maven.lifecycle.internal.builder.singlethreaded.SingleThreadedBuilder.build (SingleThreadedBuilder.java:56)
    at org.apache.maven.lifecycle.internal.LifecycleStarter.execute (LifecycleStarter.java:128)
    at org.apache.maven.DefaultMaven.doExecute (DefaultMaven.java:305)
    at org.apache.maven.DefaultMaven.doExecute (DefaultMaven.java:192)
    at org.apache.maven.DefaultMaven.execute (DefaultMaven.java:105)
    at org.apache.maven.cli.MavenCli.execute (MavenCli.java:956)
    at org.apache.maven.cli.MavenCli.doMain (MavenCli.java:288)
    at org.apache.maven.cli.MavenCli.main (MavenCli.java:192)
    at sun.reflect.NativeMethodAccessorImpl.invoke0 (Native Method)
    at sun.reflect.NativeMethodAccessorImpl.invoke (NativeMethodAccessorImpl.java:57)
    at sun.reflect.DelegatingMethodAccessorImpl.invoke (DelegatingMethodAccessorImpl.java:43)
    at java.lang.reflect.Method.invoke (Method.java:606)
    at org.codehaus.plexus.classworlds.launcher.Launcher.launchEnhanced (Launcher.java:282)
    at org.codehaus.plexus.classworlds.launcher.Launcher.launch (Launcher.java:225)
    at org.codehaus.plexus.classworlds.launcher.Launcher.mainWithExitCode (Launcher.java:406)
    at org.codehaus.plexus.classworlds.launcher.Launcher.main (Launcher.java:347)
[ERROR] 
[ERROR] Re-run Maven using the -X switch to enable full debug logging.
[ERROR] 
[ERROR] For more information about the errors and possible solutions, please read the following articles:
[ERROR] [Help 1] http://cwiki.apache.org/confluence/display/MAVEN/DependencyResolutionException
Picked up JAVA_TOOL_OPTIONS: -Dmaven.ext.class.path="c:\mvn-it-0.tmp@tmp\withMaven584124b5\pipeline-maven-spy.jar" -Dorg.jenkinsci.plugins.pipeline.maven.reportsFolder="c:\mvn-it-0.tmp@tmp\withMaven584124b5" 

	at org.apache.maven.it.MavenITmng0553SettingsAuthzEncryptionTest.testitBasic(MavenITmng0553SettingsAuthzEncryptionTest.java:129)




Build log:
[...truncated 59974 lines...]
None of the test reports contained any result
[withMaven] junitPublisher - Archive test results for Maven artifact org.apache.maven.plugins:maven-resources-plugin:maven-plugin:0.1-stub-SNAPSHOT generated by maven-surefire-plugin:test (default-test): core-it-support\core-it-plugins\maven-it-plugin-core-stubs\maven-resources-plugin\target\surefire-reports\*.xml
Recording test results
[Pipeline] // dir
None of the test reports contained any result
[withMaven] junitPublisher - Archive test results for Maven artifact org.apache.maven.plugins:maven-site-plugin:maven-plugin:0.1-stub-SNAPSHOT generated by maven-surefire-plugin:test (default-test): core-it-support\core-it-plugins\maven-it-plugin-core-stubs\maven-site-plugin\target\surefire-reports\*.xml
Recording test results
[Pipeline] }
None of the test reports contained any result
[withMaven] junitPublisher - Archive test results for Maven artifact org.apache.maven.plugins:maven-source-plugin:maven-plugin:0.1-stub-SNAPSHOT generated by maven-surefire-plugin:test (default-test): core-it-support\core-it-plugins\maven-it-plugin-core-stubs\maven-source-plugin\target\surefire-reports\*.xml
Recording test results
[Pipeline] // stage
None of the test reports contained any result
[withMaven] junitPublisher - Archive test results for Maven artifact org.apache.maven.plugins:maven-surefire-plugin:maven-plugin:0.1-stub-SNAPSHOT generated by maven-surefire-plugin:test (default-test): core-it-support\core-it-plugins\maven-it-plugin-core-stubs\maven-surefire-plugin\target\surefire-reports\*.xml
Recording test results
[Pipeline] }
None of the test reports contained any result
[withMaven] junitPublisher - Archive test results for Maven artifact org.apache.maven.plugins:maven-war-plugin:maven-plugin:0.1-stub-SNAPSHOT generated by maven-surefire-plugin:test (default-test): core-it-support\core-it-plugins\maven-it-plugin-core-stubs\maven-war-plugin\target\surefire-reports\*.xml
Recording test results
[Pipeline] // node
None of the test reports contained any result
[withMaven] junitPublisher - Archive test results for Maven artifact org.apache.maven.its.plugins:maven-it-plugin-dependency-collection:maven-plugin:2.1-SNAPSHOT generated by maven-surefire-plugin:test (default-test): core-it-support\core-it-plugins\maven-it-plugin-dependency-collection\target\surefire-reports\*.xml
Recording test results
[Pipeline] }
None of the test reports contained any result
[withMaven] junitPublisher - Archive test results for Maven artifact org.apache.maven.its.plugins:maven-it-plugin-dependency-resolution:maven-plugin:2.1-SNAPSHOT generated by maven-surefire-plugin:test (default-test): core-it-support\core-it-plugins\maven-it-plugin-dependency-resolution\target\surefire-reports\*.xml
Recording test results
None of the test reports contained any result
[withMaven] junitPublisher - Archive test results for Maven artifact org.apache.maven.its.plugins:maven-it-plugin-expression:maven-plugin:2.1-SNAPSHOT generated by maven-surefire-plugin:test (default-test): core-it-support\core-it-plugins\maven-it-plugin-expression\target\surefire-reports\*.xml
Recording test results
[withMaven] junitPublisher - Archive test results for Maven artifact org.apache.maven.its.plugins:maven-it-plugin-error:maven-plugin:2.1-SNAPSHOT generated by maven-surefire-plugin:test (default-test): core-it-support\core-it-plugins\maven-it-plugin-error\target\surefire-reports\*.xml
Recording test results
None of the test reports contained any result
[withMaven] junitPublisher - Archive test results for Maven artifact org.apache.maven.its:core-it-component:jar:2.1-SNAPSHOT generated by maven-surefire-plugin:test (default-test): core-it-support\core-it-component\target\surefire-reports\*.xml
Recording test results
None of the test reports contained any result
[withMaven] junitPublisher - Archive test results for Maven artifact org.apache.maven.its.plugins:maven-it-plugin-extension-consumer:maven-plugin:2.1-SNAPSHOT generated by maven-surefire-plugin:test (default-test): core-it-support\core-it-plugins\maven-it-plugin-extension-consumer\target\surefire-reports\*.xml
Recording test results
None of the test reports contained any result
[withMaven] junitPublisher - Archive test results for Maven artifact org.apache.maven.its.plugins:maven-it-plugin-extension-provider:maven-plugin:2.1-SNAPSHOT generated by maven-surefire-plugin:test (default-test): core-it-support\core-it-plugins\maven-it-plugin-extension-provider\target\surefire-reports\*.xml
Recording test results
None of the test reports contained any result
[withMaven] junitPublisher - Archive test results for Maven artifact org.apache.maven.its.plugins:maven-it-plugin-fork:maven-plugin:2.1-SNAPSHOT generated by maven-surefire-plugin:test (default-test): core-it-support\core-it-plugins\maven-it-plugin-fork\target\surefire-reports\*.xml
Recording test results
None of the test reports contained any result
[withMaven] junitPublisher - Archive test results for Maven artifact org.apache.maven.its.plugins:maven-it-plugin-invalid-descriptor:maven-plugin:2.1-SNAPSHOT generated by maven-surefire-plugin:test (default-test): core-it-support\core-it-plugins\maven-it-plugin-invalid-descriptor\target\surefire-reports\*.xml
Recording test results
None of the test reports contained any result
[withMaven] junitPublisher - Archive test results for Maven artifact org.apache.maven.its.plugins:maven-it-plugin-log-file:maven-plugin:2.1-SNAPSHOT generated by maven-surefire-plugin:test (default-test): core-it-support\core-it-plugins\maven-it-plugin-log-file\target\surefire-reports\*.xml
Recording test results
None of the test reports contained any result
[withMaven] junitPublisher - Archive test results for Maven artifact org.apache.maven.its:maven-it-helper:jar:2.1-SNAPSHOT generated by maven-surefire-plugin:test (default-test): core-it-support\maven-it-helper\target\surefire-reports\*.xml
Recording test results
[withMaven] junitPublisher - Archive test results for Maven artifact org.apache.maven.its.plugins:maven-it-plugin-model-interpolation:maven-plugin:2.1-SNAPSHOT generated by maven-surefire-plugin:test (default-test): core-it-support\core-it-plugins\maven-it-plugin-model-interpolation\target\surefire-reports\*.xml
Recording test results
None of the test reports contained any result
[withMaven] junitPublisher - Archive test results for Maven artifact org.apache.maven.its.plugins:maven-it-plugin-no-default-comp:maven-plugin:2.1-SNAPSHOT generated by maven-surefire-plugin:test (default-test): core-it-support\core-it-plugins\maven-it-plugin-no-default-comp\target\surefire-reports\*.xml
Recording test results
None of the test reports contained any result
[withMaven] junitPublisher - Archive test results for Maven artifact org.apache.maven.its.plugins:maven-it-plugin-no-project:maven-plugin:2.1-SNAPSHOT generated by maven-surefire-plugin:test (default-test): core-it-support\core-it-plugins\maven-it-plugin-no-project\target\surefire-reports\*.xml
Recording test results
None of the test reports contained any result
[withMaven] junitPublisher - Archive test results for Maven artifact org.apache.maven.its.plugins:maven-it-plugin-online:maven-plugin:2.1-SNAPSHOT generated by maven-surefire-plugin:test (default-test): core-it-support\core-it-plugins\maven-it-plugin-online\target\surefire-reports\*.xml
Recording test results
None of the test reports contained any result
[withMaven] junitPublisher - Archive test results for Maven artifact org.apache.maven.its.plugins:maven-it-plugin-optional-mojos:maven-plugin:2.1-SNAPSHOT generated by maven-surefire-plugin:test (default-test): core-it-support\core-it-plugins\maven-it-plugin-optional-mojos\target\surefire-reports\*.xml
Recording test results
None of the test reports contained any result
[withMaven] junitPublisher - Archive test results for Maven artifact org.apache.maven.its.plugins:maven-it-plugin-packaging:maven-plugin:2.1-SNAPSHOT generated by maven-surefire-plugin:test (default-test): core-it-support\core-it-plugins\maven-it-plugin-packaging\target\surefire-reports\*.xml
Recording test results
None of the test reports contained any result
[withMaven] junitPublisher - Archive test results for Maven artifact org.apache.maven.its.plugins:maven-it-plugin-parameter-implementation:maven-plugin:2.1-SNAPSHOT generated by maven-surefire-plugin:test (default-test): core-it-support\core-it-plugins\maven-it-plugin-parameter-implementation\target\surefire-reports\*.xml
Recording test results
None of the test reports contained any result
[withMaven] junitPublisher - Archive test results for Maven artifact org.apache.maven.its.plugins:maven-it-plugin-plugin-dependency:maven-plugin:2.1-SNAPSHOT generated by maven-surefire-plugin:test (default-test): core-it-support\core-it-plugins\maven-it-plugin-plugin-dependency\target\surefire-reports\*.xml
Recording test results
None of the test reports contained any result
[withMaven] junitPublisher - Archive test results for Maven artifact org.apache.maven.its.plugins:maven-it-plugin-project:maven-plugin:2.1-SNAPSHOT generated by maven-surefire-plugin:test (default-test): core-it-support\core-it-plugins\maven-it-plugin-project\target\surefire-reports\*.xml
Recording test results
None of the test reports contained any result
[withMaven] junitPublisher - Archive test results for Maven artifact org.apache.maven.its.plugins:maven-it-plugin-project-interpolation:maven-plugin:2.1-SNAPSHOT generated by maven-surefire-plugin:test (default-test): core-it-support\core-it-plugins\maven-it-plugin-project-interpolation\target\surefire-reports\*.xml
Recording test results
None of the test reports contained any result
[withMaven] junitPublisher - Archive test results for Maven artifact org.apache.maven.its.plugins:maven-it-plugin-setter:maven-plugin:2.1-SNAPSHOT generated by maven-surefire-plugin:test (default-test): core-it-support\core-it-plugins\maven-it-plugin-setter\target\surefire-reports\*.xml
Recording test results
None of the test reports contained any result
[withMaven] junitPublisher - Archive test results for Maven artifact org.apache.maven.its.plugins:maven-it-plugin-singleton-component:maven-plugin:2.1-SNAPSHOT generated by maven-surefire-plugin:test (default-test): core-it-support\core-it-plugins\maven-it-plugin-singleton-component\target\surefire-reports\*.xml
Recording test results
None of the test reports contained any result
[withMaven] junitPublisher - Archive test results for Maven artifact org.apache.maven.its.plugins:maven-it-plugin-site:maven-plugin:2.1-SNAPSHOT generated by maven-surefire-plugin:test (default-test): core-it-support\core-it-plugins\maven-it-plugin-site\target\surefire-reports\*.xml
Recording test results
None of the test reports contained any result
[withMaven] junitPublisher - Archive test results for Maven artifact org.apache.maven.its.plugins:maven-it-plugin-toolchain:maven-plugin:2.1-SNAPSHOT generated by maven-surefire-plugin:test (default-test): core-it-support\core-it-plugins\maven-it-plugin-toolchain\target\surefire-reports\*.xml
Recording test results
None of the test reports contained any result
[withMaven] junitPublisher - Archive test results for Maven artifact org.apache.maven.its.plugins:maven-it-plugin-touch:maven-plugin:2.1-SNAPSHOT generated by maven-surefire-plugin:test (default-test): core-it-support\core-it-plugins\maven-it-plugin-touch\target\surefire-reports\*.xml
Recording test results
None of the test reports contained any result
[withMaven] junitPublisher - Archive test results for Maven artifact org.apache.maven.its.plugins:maven-it-plugin-uses-properties:maven-plugin:2.1-SNAPSHOT generated by maven-surefire-plugin:test (default-test): core-it-support\core-it-plugins\maven-it-plugin-uses-properties\target\surefire-reports\*.xml
Recording test results
None of the test reports contained any result
[withMaven] junitPublisher - Archive test results for Maven artifact org.apache.maven.its.plugins:maven-it-plugin-uses-wagon:maven-plugin:2.1-SNAPSHOT generated by maven-surefire-plugin:test (default-test): core-it-support\core-it-plugins\maven-it-plugin-uses-wagon\target\surefire-reports\*.xml
Recording test results
None of the test reports contained any result
[withMaven] junitPublisher - Archive test results for Maven artifact org.apache.maven.its.plugins:maven-it-plugin-all:maven-plugin:2.1-SNAPSHOT generated by maven-surefire-plugin:test (default-test): core-it-support\core-it-plugins\maven-it-plugin-all\target\surefire-reports\*.xml
Recording test results
None of the test reports contained any result
[withMaven] junitPublisher - Archive test results for Maven artifact org.apache.maven.its.plugins:maven-it-plugin-plexus-utils-11:maven-plugin:2.1-SNAPSHOT generated by maven-surefire-plugin:test (default-test): core-it-support\core-it-plugins\maven-it-plugin-plexus-utils-11\target\surefire-reports\*.xml
Recording test results
None of the test reports contained any result
[withMaven] junitPublisher - Archive test results for Maven artifact org.apache.maven.its.plugins:maven-it-plugin-plexus-utils-new:maven-plugin:2.1-SNAPSHOT generated by maven-surefire-plugin:test (default-test): core-it-support\core-it-plugins\maven-it-plugin-plexus-utils-new\target\surefire-reports\*.xml
Recording test results
None of the test reports contained any result
[withMaven] junitPublisher - Archive test results for Maven artifact org.apache.maven.its.plugins:maven-it-plugin-plexus-component-api:maven-plugin:2.1-SNAPSHOT generated by maven-surefire-plugin:test (default-test): core-it-support\core-it-plugins\maven-it-plugin-plexus-component-api\target\surefire-reports\*.xml
Recording test results
None of the test reports contained any result
[withMaven] junitPublisher - Archive test results for Maven artifact org.apache.maven.its.plugins:maven-it-plugin-log4j:maven-plugin:2.1-SNAPSHOT generated by maven-surefire-plugin:test (default-test): core-it-support\core-it-plugins\maven-it-plugin-log4j\target\surefire-reports\*.xml
Recording test results
None of the test reports contained any result
[withMaven] junitPublisher - Archive test results for Maven artifact org.apache.maven.its.plugins:maven-it-plugin-extension1:maven-plugin:2.1-SNAPSHOT generated by maven-surefire-plugin:test (default-test): core-it-support\core-it-plugins\maven-it-plugin-extension1\target\surefire-reports\*.xml
Recording test results
None of the test reports contained any result
[withMaven] junitPublisher - Archive test results for Maven artifact org.apache.maven.its.plugins:maven-it-plugin-extension2:maven-plugin:2.1-SNAPSHOT generated by maven-surefire-plugin:test (default-test): core-it-support\core-it-plugins\maven-it-plugin-extension2\target\surefire-reports\*.xml
Recording test results
None of the test reports contained any result
[withMaven] junitPublisher - Archive test results for Maven artifact org.apache.maven.its.plugins:maven-it-plugin-plexus-lifecycle:maven-plugin:2.1-SNAPSHOT generated by maven-surefire-plugin:test (default-test): core-it-support\core-it-plugins\maven-it-plugin-plexus-lifecycle\target\surefire-reports\*.xml
Recording test results
None of the test reports contained any result
[withMaven] junitPublisher - Archive test results for Maven artifact org.apache.maven.its.plugins:maven-it-plugin-settings:maven-plugin:2.1-SNAPSHOT generated by maven-surefire-plugin:test (default-test): core-it-support\core-it-plugins\maven-it-plugin-settings\target\surefire-reports\*.xml
Recording test results
None of the test reports contained any result
[withMaven] junitPublisher - Archive test results for Maven artifact org.apache.maven.its.plugins:mng-5805-pkg-type-mojo-configuration-extension:jar:2.1-SNAPSHOT generated by maven-surefire-plugin:test (default-test): core-it-support\core-it-plugins\mng5805-extension\target\surefire-reports\*.xml
Recording test results
None of the test reports contained any result
[withMaven] junitPublisher - Archive test results for Maven artifact org.apache.maven.its.plugins:mng-5805-pkg-type-mojo-configuration-extension2:jar:2.1-SNAPSHOT generated by maven-surefire-plugin:test (default-test): core-it-support\core-it-plugins\mng5805-extension2\target\surefire-reports\*.xml
Recording test results
None of the test reports contained any result
[withMaven] junitPublisher - Archive test results for Maven artifact org.apache.maven.its.plugins:mng-5805-pkg-type-mojo-configuration-plugin:maven-plugin:2.1-SNAPSHOT generated by maven-surefire-plugin:test (default-test): core-it-support\core-it-plugins\mng5805-plugin\target\surefire-reports\*.xml
Recording test results
None of the test reports contained any result
[withMaven] junitPublisher - Archive test results for Maven artifact org.apache.maven.its.plugins:mng-5805-pkg-type-mojo-configuration-plugin-dep:jar:2.1-SNAPSHOT generated by maven-surefire-plugin:test (default-test): core-it-support\core-it-plugins\mng5805-plugin-dep\target\surefire-reports\*.xml
Recording test results
None of the test reports contained any result
[withMaven] junitPublisher - Archive test results for Maven artifact org.apache.maven.its.plugins:mng-5958-pkg-type-extension:jar:2.1-SNAPSHOT generated by maven-surefire-plugin:test (default-test): core-it-support\core-it-plugins\mng5958-extension\target\surefire-reports\*.xml
Recording test results
None of the test reports contained any result
[withMaven] junitPublisher - Archive test results for Maven artifact org.apache.maven.its:core-it-toolchain:jar:2.1-SNAPSHOT generated by maven-surefire-plugin:test (default-test): core-it-support\core-it-toolchain\target\surefire-reports\*.xml
Recording test results
None of the test reports contained any result
[withMaven] junitPublisher - Archive test results for Maven artifact org.apache.maven.its:core-it-wagon:jar:2.1-SNAPSHOT generated by maven-surefire-plugin:test (default-test): core-it-support\core-it-wagon\target\surefire-reports\*.xml
Recording test results
None of the test reports contained any result
[withMaven] junitPublisher - Archive test results for Maven artifact org.apache.maven.its:core-it-extension:jar:2.1-SNAPSHOT generated by maven-surefire-plugin:test (default-test): core-it-support\core-it-extension\target\surefire-reports\*.xml
Recording test results
None of the test reports contained any result
[withMaven] junitPublisher - Archive test results for Maven artifact org.apache.maven.its:core-it-suite:jar:2.1-SNAPSHOT generated by maven-surefire-plugin:test (default-test): core-it-suite\target\surefire-reports\*.xml
Recording test results
[Pipeline] }
[Pipeline] // dir
[Pipeline] }
[Pipeline] // stage
[Pipeline] }
[Pipeline] // node
[Pipeline] }
[withMaven] openTasksPublisher - Scan Tasks for Maven artifact org.apache.maven.its.plugins:maven-it-plugin-active-collection:maven-plugin:2.1-SNAPSHOT in source directory core-it-support\core-it-plugins\maven-it-plugin-active-collection\src\main\java
[withMaven] openTasksPublisher - Scan Tasks for Maven artifact org.apache.maven.its.plugins:maven-it-plugin-artifact:maven-plugin:2.1-SNAPSHOT in source directory core-it-support\core-it-plugins\maven-it-plugin-artifact\src\main\java
[withMaven] openTasksPublisher - Scan Tasks for Maven artifact org.apache.maven.its.plugins.class-loader:dep-a:jar:2.1-SNAPSHOT in source directory core-it-support\core-it-plugins\maven-it-plugin-class-loader\dep-a\src\main\java
[withMaven] openTasksPublisher - Scan Tasks for Maven artifact org.apache.maven.its.plugins.class-loader:dep-b:jar:2.1-SNAPSHOT in source directory core-it-support\core-it-plugins\maven-it-plugin-class-loader\dep-b\src\main\java
[withMaven] openTasksPublisher - Scan Tasks for Maven artifact org.apache.maven.its.plugins:maven-it-plugin-class-loader:maven-plugin:2.1-SNAPSHOT in source directory core-it-support\core-it-plugins\maven-it-plugin-class-loader\maven-it-plugin-class-loader\src\main\java
[withMaven] openTasksPublisher - Scan Tasks for Maven artifact org.apache.maven.its.plugins:maven-it-plugin-configuration:maven-plugin:2.1-SNAPSHOT in source directory core-it-support\core-it-plugins\maven-it-plugin-configuration\src\main\java
[withMaven] openTasksPublisher - Scan Tasks for Maven artifact org.apache.maven.its.plugins:maven-it-plugin-context-passing:maven-plugin:2.1-SNAPSHOT in source directory core-it-support\core-it-plugins\maven-it-plugin-context-passing\src\main\java
[withMaven] openTasksPublisher - Scan Tasks for Maven artifact org.apache.maven.plugins:maven-clean-plugin:maven-plugin:0.1-stub-SNAPSHOT in source directory core-it-support\core-it-plugins\maven-it-plugin-core-stubs\maven-clean-plugin\src\main\java
[withMaven] openTasksPublisher - Scan Tasks for Maven artifact org.apache.maven.plugins:maven-compiler-plugin:maven-plugin:0.1-stub-SNAPSHOT in source directory core-it-support\core-it-plugins\maven-it-plugin-core-stubs\maven-compiler-plugin\src\main\java
[withMaven] openTasksPublisher - Scan Tasks for Maven artifact org.apache.maven.plugins:maven-deploy-plugin:maven-plugin:0.1-stub-SNAPSHOT in source directory core-it-support\core-it-plugins\maven-it-plugin-core-stubs\maven-deploy-plugin\src\main\java
[withMaven] openTasksPublisher - Scan Tasks for Maven artifact org.apache.maven.plugins:maven-ear-plugin:maven-plugin:0.1-stub-SNAPSHOT in source directory core-it-support\core-it-plugins\maven-it-plugin-core-stubs\maven-ear-plugin\src\main\java
[withMaven] openTasksPublisher - Scan Tasks for Maven artifact org.apache.maven.plugins:maven-ejb-plugin:maven-plugin:0.1-stub-SNAPSHOT in source directory core-it-support\core-it-plugins\maven-it-plugin-core-stubs\maven-ejb-plugin\src\main\java
[withMaven] openTasksPublisher - Scan Tasks for Maven artifact org.apache.maven.plugins:maven-install-plugin:maven-plugin:0.1-stub-SNAPSHOT in source directory core-it-support\core-it-plugins\maven-it-plugin-core-stubs\maven-install-plugin\src\main\java
[withMaven] openTasksPublisher - Scan Tasks for Maven artifact org.apache.maven.plugins:maven-jar-plugin:maven-plugin:0.1-stub-SNAPSHOT in source directory core-it-support\core-it-plugins\maven-it-plugin-core-stubs\maven-jar-plugin\src\main\java
[withMaven] openTasksPublisher - Scan Tasks for Maven artifact org.apache.maven.plugins:maven-javadoc-plugin:maven-plugin:0.1-stub-SNAPSHOT in source directory core-it-support\core-it-plugins\maven-it-plugin-core-stubs\maven-javadoc-plugin\src\main\java
[withMaven] openTasksPublisher - Scan Tasks for Maven artifact org.apache.maven.plugins:maven-plugin-plugin:maven-plugin:0.1-stub-SNAPSHOT in source directory core-it-support\core-it-plugins\maven-it-plugin-core-stubs\maven-plugin-plugin\src\main\java
[withMaven] openTasksPublisher - Scan Tasks for Maven artifact org.apache.maven.plugins:maven-rar-plugin:maven-plugin:0.1-stub-SNAPSHOT in source directory core-it-support\core-it-plugins\maven-it-plugin-core-stubs\maven-rar-plugin\src\main\java
[withMaven] openTasksPublisher - Scan Tasks for Maven artifact org.apache.maven.plugins:maven-resources-plugin:maven-plugin:0.1-stub-SNAPSHOT in source directory core-it-support\core-it-plugins\maven-it-plugin-core-stubs\maven-resources-plugin\src\main\java
[withMaven] openTasksPublisher - Scan Tasks for Maven artifact org.apache.maven.plugins:maven-site-plugin:maven-plugin:0.1-stub-SNAPSHOT in source directory core-it-support\core-it-plugins\maven-it-plugin-core-stubs\maven-site-plugin\src\main\java
[withMaven] openTasksPublisher - Scan Tasks for Maven artifact org.apache.maven.plugins:maven-source-plugin:maven-plugin:0.1-stub-SNAPSHOT in source directory core-it-support\core-it-plugins\maven-it-plugin-core-stubs\maven-source-plugin\src\main\java
[withMaven] openTasksPublisher - Scan Tasks for Maven artifact org.apache.maven.plugins:maven-surefire-plugin:maven-plugin:0.1-stub-SNAPSHOT in source directory core-it-support\core-it-plugins\maven-it-plugin-core-stubs\maven-surefire-plugin\src\main\java
[withMaven] openTasksPublisher - Scan Tasks for Maven artifact org.apache.maven.plugins:maven-war-plugin:maven-plugin:0.1-stub-SNAPSHOT in source directory core-it-support\core-it-plugins\maven-it-plugin-core-stubs\maven-war-plugin\src\main\java
[withMaven] openTasksPublisher - Scan Tasks for Maven artifact org.apache.maven.its.plugins:maven-it-plugin-dependency-collection:maven-plugin:2.1-SNAPSHOT in source directory core-it-support\core-it-plugins\maven-it-plugin-dependency-collection\src\main\java
[withMaven] openTasksPublisher - Scan Tasks for Maven artifact org.apache.maven.its.plugins:maven-it-plugin-dependency-resolution:maven-plugin:2.1-SNAPSHOT in source directory core-it-support\core-it-plugins\maven-it-plugin-dependency-resolution\src\main\java
[withMaven] openTasksPublisher - Scan Tasks for Maven artifact org.apache.maven.its.plugins:maven-it-plugin-expression:maven-plugin:2.1-SNAPSHOT in source directory core-it-support\core-it-plugins\maven-it-plugin-expression\src\main\java
[withMaven] openTasksPublisher - Scan Tasks for Maven artifact org.apache.maven.its.plugins:maven-it-plugin-error:maven-plugin:2.1-SNAPSHOT in source directory core-it-support\core-it-plugins\maven-it-plugin-error\src\main\java
[withMaven] openTasksPublisher - Scan Tasks for Maven artifact org.apache.maven.its:core-it-component:jar:2.1-SNAPSHOT in source directory core-it-support\core-it-component\src\main\java
[withMaven] openTasksPublisher - Scan Tasks for Maven artifact org.apache.maven.its.plugins:maven-it-plugin-extension-consumer:maven-plugin:2.1-SNAPSHOT in source directory core-it-support\core-it-plugins\maven-it-plugin-extension-consumer\src\main\java
[withMaven] openTasksPublisher - Scan Tasks for Maven artifact org.apache.maven.its.plugins:maven-it-plugin-extension-provider:maven-plugin:2.1-SNAPSHOT in source directory core-it-support\core-it-plugins\maven-it-plugin-extension-provider\src\main\java
[withMaven] openTasksPublisher - Scan Tasks for Maven artifact org.apache.maven.its.plugins:maven-it-plugin-fork:maven-plugin:2.1-SNAPSHOT in source directory core-it-support\core-it-plugins\maven-it-plugin-fork\src\main\java
[withMaven] openTasksPublisher - Scan Tasks for Maven artifact org.apache.maven.its.plugins:maven-it-plugin-invalid-descriptor:maven-plugin:2.1-SNAPSHOT in source directory core-it-support\core-it-plugins\maven-it-plugin-invalid-descriptor\src\main\java
[withMaven] openTasksPublisher - Scan Tasks for Maven artifact org.apache.maven.its.plugins:maven-it-plugin-log-file:maven-plugin:2.1-SNAPSHOT in source directory core-it-support\core-it-plugins\maven-it-plugin-log-file\src\main\java
[withMaven] openTasksPublisher - Scan Tasks for Maven artifact org.apache.maven.its:maven-it-helper:jar:2.1-SNAPSHOT in source directory core-it-support\maven-it-helper\src\main\java
[withMaven] openTasksPublisher - Scan Tasks for Maven artifact org.apache.maven.its.plugins:maven-it-plugin-model-interpolation:maven-plugin:2.1-SNAPSHOT in source directory core-it-support\core-it-plugins\maven-it-plugin-model-interpolation\src\main\java
[withMaven] openTasksPublisher - Scan Tasks for Maven artifact org.apache.maven.its.plugins:maven-it-plugin-no-default-comp:maven-plugin:2.1-SNAPSHOT in source directory core-it-support\core-it-plugins\maven-it-plugin-no-default-comp\src\main\java
[withMaven] openTasksPublisher - Scan Tasks for Maven artifact org.apache.maven.its.plugins:maven-it-plugin-no-project:maven-plugin:2.1-SNAPSHOT in source directory core-it-support\core-it-plugins\maven-it-plugin-no-project\src\main\java
[withMaven] openTasksPublisher - Scan Tasks for Maven artifact org.apache.maven.its.plugins:maven-it-plugin-online:maven-plugin:2.1-SNAPSHOT in source directory core-it-support\core-it-plugins\maven-it-plugin-online\src\main\java
[withMaven] openTasksPublisher - Scan Tasks for Maven artifact org.apache.maven.its.plugins:maven-it-plugin-optional-mojos:maven-plugin:2.1-SNAPSHOT in source directory core-it-support\core-it-plugins\maven-it-plugin-optional-mojos\src\main\java
[withMaven] openTasksPublisher - Scan Tasks for Maven artifact org.apache.maven.its.plugins:maven-it-plugin-packaging:maven-plugin:2.1-SNAPSHOT in source directory core-it-support\core-it-plugins\maven-it-plugin-packaging\src\main\java
[withMaven] openTasksPublisher - Scan Tasks for Maven artifact org.apache.maven.its.plugins:maven-it-plugin-parameter-implementation:maven-plugin:2.1-SNAPSHOT in source directory core-it-support\core-it-plugins\maven-it-plugin-parameter-implementation\src\main\java
[withMaven] openTasksPublisher - Scan Tasks for Maven artifact org.apache.maven.its.plugins:maven-it-plugin-plugin-dependency:maven-plugin:2.1-SNAPSHOT in source directory core-it-support\core-it-plugins\maven-it-plugin-plugin-dependency\src\main\java
[withMaven] openTasksPublisher - Scan Tasks for Maven artifact org.apache.maven.its.plugins:maven-it-plugin-project:maven-plugin:2.1-SNAPSHOT in source directory core-it-support\core-it-plugins\maven-it-plugin-project\src\main\java
[withMaven] openTasksPublisher - Scan Tasks for Maven artifact org.apache.maven.its.plugins:maven-it-plugin-project-interpolation:maven-plugin:2.1-SNAPSHOT in source directory core-it-support\core-it-plugins\maven-it-plugin-project-interpolation\src\main\java
[withMaven] openTasksPublisher - Scan Tasks for Maven artifact org.apache.maven.its.plugins:maven-it-plugin-setter:maven-plugin:2.1-SNAPSHOT in source directory core-it-support\core-it-plugins\maven-it-plugin-setter\src\main\java
[withMaven] openTasksPublisher - Scan Tasks for Maven artifact org.apache.maven.its.plugins:maven-it-plugin-singleton-component:maven-plugin:2.1-SNAPSHOT in source directory core-it-support\core-it-plugins\maven-it-plugin-singleton-component\src\main\java
[withMaven] openTasksPublisher - Scan Tasks for Maven artifact org.apache.maven.its.plugins:maven-it-plugin-site:maven-plugin:2.1-SNAPSHOT in source directory core-it-support\core-it-plugins\maven-it-plugin-site\src\main\java
[withMaven] openTasksPublisher - Scan Tasks for Maven artifact org.apache.maven.its.plugins:maven-it-plugin-toolchain:maven-plugin:2.1-SNAPSHOT in source directory core-it-support\core-it-plugins\maven-it-plugin-toolchain\src\main\java
[withMaven] openTasksPublisher - Scan Tasks for Maven artifact org.apache.maven.its.plugins:maven-it-plugin-touch:maven-plugin:2.1-SNAPSHOT in source directory core-it-support\core-it-plugins\maven-it-plugin-touch\src\main\java
[withMaven] openTasksPublisher - Scan Tasks for Maven artifact org.apache.maven.its.plugins:maven-it-plugin-uses-properties:maven-plugin:2.1-SNAPSHOT in source directory core-it-support\core-it-plugins\maven-it-plugin-uses-properties\src\main\java
[withMaven] openTasksPublisher - Scan Tasks for Maven artifact org.apache.maven.its.plugins:maven-it-plugin-uses-wagon:maven-plugin:2.1-SNAPSHOT in source directory core-it-support\core-it-plugins\maven-it-plugin-uses-wagon\src\main\java
[withMaven] openTasksPublisher - Scan Tasks for Maven artifact org.apache.maven.its.plugins:maven-it-plugin-all:maven-plugin:2.1-SNAPSHOT in source directory core-it-support\core-it-plugins\maven-it-plugin-all\src\main\java
[withMaven] openTasksPublisher - Scan Tasks for Maven artifact org.apache.maven.its.plugins:maven-it-plugin-plexus-utils-11:maven-plugin:2.1-SNAPSHOT in source directory core-it-support\core-it-plugins\maven-it-plugin-plexus-utils-11\src\main\java
[withMaven] openTasksPublisher - Scan Tasks for Maven artifact org.apache.maven.its.plugins:maven-it-plugin-plexus-utils-new:maven-plugin:2.1-SNAPSHOT in source directory core-it-support\core-it-plugins\maven-it-plugin-plexus-utils-new\src\main\java
[withMaven] openTasksPublisher - Scan Tasks for Maven artifact org.apache.maven.its.plugins:maven-it-plugin-plexus-component-api:maven-plugin:2.1-SNAPSHOT in source directory core-it-support\core-it-plugins\maven-it-plugin-plexus-component-api\src\main\java
[withMaven] openTasksPublisher - Scan Tasks for Maven artifact org.apache.maven.its.plugins:maven-it-plugin-log4j:maven-plugin:2.1-SNAPSHOT in source directory core-it-support\core-it-plugins\maven-it-plugin-log4j\src\main\java
[withMaven] openTasksPublisher - Scan Tasks for Maven artifact org.apache.maven.its.plugins:maven-it-plugin-extension1:maven-plugin:2.1-SNAPSHOT in source directory core-it-support\core-it-plugins\maven-it-plugin-extension1\src\main\java
[withMaven] openTasksPublisher - Scan Tasks for Maven artifact org.apache.maven.its.plugins:maven-it-plugin-extension2:maven-plugin:2.1-SNAPSHOT in source directory core-it-support\core-it-plugins\maven-it-plugin-extension2\src\main\java
[withMaven] openTasksPublisher - Scan Tasks for Maven artifact org.apache.maven.its.plugins:maven-it-plugin-plexus-lifecycle:maven-plugin:2.1-SNAPSHOT in source directory core-it-support\core-it-plugins\maven-it-plugin-plexus-lifecycle\src\main\java
[withMaven] openTasksPublisher - Scan Tasks for Maven artifact org.apache.maven.its.plugins:maven-it-plugin-settings:maven-plugin:2.1-SNAPSHOT in source directory core-it-support\core-it-plugins\maven-it-plugin-settings\src\main\java
[withMaven] openTasksPublisher - Scan Tasks for Maven artifact org.apache.maven.its.plugins:mng-5805-pkg-type-mojo-configuration-plugin:maven-plugin:2.1-SNAPSHOT in source directory core-it-support\core-it-plugins\mng5805-plugin\src\main\java
[withMaven] openTasksPublisher - Scan Tasks for Maven artifact org.apache.maven.its.plugins:mng-5805-pkg-type-mojo-configuration-plugin-dep:jar:2.1-SNAPSHOT in source directory core-it-support\core-it-plugins\mng5805-plugin-dep\src\main\java
[withMaven] openTasksPublisher - Scan Tasks for Maven artifact org.apache.maven.its.plugins:mng-5958-pkg-type-extension:jar:2.1-SNAPSHOT in source directory core-it-support\core-it-plugins\mng5958-extension\src\main\java
[withMaven] openTasksPublisher - Scan Tasks for Maven artifact org.apache.maven.its:core-it-toolchain:jar:2.1-SNAPSHOT in source directory core-it-support\core-it-toolchain\src\main\java
[withMaven] openTasksPublisher - Scan Tasks for Maven artifact org.apache.maven.its:core-it-wagon:jar:2.1-SNAPSHOT in source directory core-it-support\core-it-wagon\src\main\java
[TASKS] Scanning folder 'c:\mvn-it-0.tmp' for files matching the pattern 'core-it-support\core-it-plugins\maven-it-plugin-active-collection\src\main\java\**\*,core-it-support\core-it-plugins\maven-it-plugin-artifact\src\main\java\**\*,core-it-support\core-it-plugins\maven-it-plugin-class-loader\dep-a\src\main\java\**\*,core-it-support\core-it-plugins\maven-it-plugin-class-loader\dep-b\src\main\java\**\*,core-it-support\core-it-plugins\maven-it-plugin-class-loader\maven-it-plugin-class-loader\src\main\java\**\*,core-it-support\core-it-plugins\maven-it-plugin-configuration\src\main\java\**\*,core-it-support\core-it-plugins\maven-it-plugin-context-passing\src\main\java\**\*,core-it-support\core-it-plugins\maven-it-plugin-core-stubs\maven-clean-plugin\src\main\java\**\*,core-it-support\core-it-plugins\maven-it-plugin-core-stubs\maven-compiler-plugin\src\main\java\**\*,core-it-support\core-it-plugins\maven-it-plugin-core-stubs\maven-deploy-plugin\src\main\java\**\*,core-it-support\core-it-plugins\maven-it-plugin-core-stubs\maven-ear-plugin\src\main\java\**\*,core-it-support\core-it-plugins\maven-it-plugin-core-stubs\maven-ejb-plugin\src\main\java\**\*,core-it-support\core-it-plugins\maven-it-plugin-core-stubs\maven-install-plugin\src\main\java\**\*,core-it-support\core-it-plugins\maven-it-plugin-core-stubs\maven-jar-plugin\src\main\java\**\*,core-it-support\core-it-plugins\maven-it-plugin-core-stubs\maven-javadoc-plugin\src\main\java\**\*,core-it-support\core-it-plugins\maven-it-plugin-core-stubs\maven-plugin-plugin\src\main\java\**\*,core-it-support\core-it-plugins\maven-it-plugin-core-stubs\maven-rar-plugin\src\main\java\**\*,core-it-support\core-it-plugins\maven-it-plugin-core-stubs\maven-resources-plugin\src\main\java\**\*,core-it-support\core-it-plugins\maven-it-plugin-core-stubs\maven-site-plugin\src\main\java\**\*,core-it-support\core-it-plugins\maven-it-plugin-core-stubs\maven-source-plugin\src\main\java\**\*,core-it-support\core-it-plugins\maven-it-plugin-core-stubs\maven-surefire-plugin\src\main\java\**\*,core-it-support\core-it-plugins\maven-it-plugin-core-stubs\maven-war-plugin\src\main\java\**\*,core-it-support\core-it-plugins\maven-it-plugin-dependency-collection\src\main\java\**\*,core-it-support\core-it-plugins\maven-it-plugin-dependency-resolution\src\main\java\**\*,core-it-support\core-it-plugins\maven-it-plugin-expression\src\main\java\**\*,core-it-support\core-it-plugins\maven-it-plugin-error\src\main\java\**\*,core-it-support\core-it-component\src\main\java\**\*,core-it-support\core-it-plugins\maven-it-plugin-extension-consumer\src\main\java\**\*,core-it-support\core-it-plugins\maven-it-plugin-extension-provider\src\main\java\**\*,core-it-support\core-it-plugins\maven-it-plugin-fork\src\main\java\**\*,core-it-support\core-it-plugins\maven-it-plugin-invalid-descriptor\src\main\java\**\*,core-it-support\core-it-plugins\maven-it-plugin-log-file\src\main\java\**\*,core-it-support\maven-it-helper\src\main\java\**\*,core-it-support\core-it-plugins\maven-it-plugin-model-interpolation\src\main\java\**\*,core-it-support\core-it-plugins\maven-it-plugin-no-default-comp\src\main\java\**\*,core-it-support\core-it-plugins\maven-it-plugin-no-project\src\main\java\**\*,core-it-support\core-it-plugins\maven-it-plugin-online\src\main\java\**\*,core-it-support\core-it-plugins\maven-it-plugin-optional-mojos\src\main\java\**\*,core-it-support\core-it-plugins\maven-it-plugin-packaging\src\main\java\**\*,core-it-support\core-it-plugins\maven-it-plugin-parameter-implementation\src\main\java\**\*,core-it-support\core-it-plugins\maven-it-plugin-plugin-dependency\src\main\java\**\*,core-it-support\core-it-plugins\maven-it-plugin-project\src\main\java\**\*,core-it-support\core-it-plugins\maven-it-plugin-project-interpolation\src\main\java\**\*,core-it-support\core-it-plugins\maven-it-plugin-setter\src\main\java\**\*,core-it-support\core-it-plugins\maven-it-plugin-singleton-component\src\main\java\**\*,core-it-support\core-it-plugins\maven-it-plugin-site\src\main\java\**\*,core-it-support\core-it-plugins\maven-it-plugin-toolchain\src\main\java\**\*,core-it-support\core-it-plugins\maven-it-plugin-touch\src\main\java\**\*,core-it-support\core-it-plugins\maven-it-plugin-uses-properties\src\main\java\**\*,core-it-support\core-it-plugins\maven-it-plugin-uses-wagon\src\main\java\**\*,core-it-support\core-it-plugins\maven-it-plugin-all\src\main\java\**\*,core-it-support\core-it-plugins\maven-it-plugin-plexus-utils-11\src\main\java\**\*,core-it-support\core-it-plugins\maven-it-plugin-plexus-utils-new\src\main\java\**\*,core-it-support\core-it-plugins\maven-it-plugin-plexus-component-api\src\main\java\**\*,core-it-support\core-it-plugins\maven-it-plugin-log4j\src\main\java\**\*,core-it-support\core-it-plugins\maven-it-plugin-extension1\src\main\java\**\*,core-it-support\core-it-plugins\maven-it-plugin-extension2\src\main\java\**\*,core-it-support\core-it-plugins\maven-it-plugin-plexus-lifecycle\src\main\java\**\*,core-it-support\core-it-plugins\maven-it-plugin-settings\src\main\java\**\*,core-it-support\core-it-plugins\mng5805-plugin\src\main\java\**\*,core-it-support\core-it-plugins\mng5805-plugin-dep\src\main\java\**\*,core-it-support\core-it-plugins\mng5958-extension\src\main\java\**\*,core-it-support\core-it-toolchain\src\main\java\**\*,core-it-support\core-it-wagon\src\main\java\**\*' - excludes: null
[TASKS] Found 164 files to scan for tasks
[TASKS] Found 0 open tasks.
Skipping warnings blame since pipelines do not have an SCM link.%n
[withMaven] Publishers: Pipeline Graph Publisher: 38 ms, Generated Artifacts Publisher: 7224 ms, Invoker Publisher: 7 ms, Junit Publisher: 63288 ms, Concordion Publisher: 6 ms, Dependencies Fingerprint Publisher: 311 ms, Findbugs Publisher: 3 ms, JGiven Publisher: 2 ms, Jacoco Publisher: 3 ms, SpotBugs Publisher: 3 ms, Open Task Scanner Publisher: 1448 ms
[Pipeline] // withMaven
[Pipeline] deleteDir
[Pipeline] }
[Pipeline] // dir
[Pipeline] }
[Pipeline] // stage
[Pipeline] }
[Pipeline] // node
[Pipeline] }
[Pipeline] // parallel
[Pipeline] stage
[Pipeline] { (Notifications)
[Pipeline] echo
Build result: UNSTABLE
[Pipeline] jiraIssueSelector
[Pipeline] emailext
Mime
  • Unnamed multipart/mixed (inline, None, 0 bytes)
View raw message