maven-notifications mailing list archives

Site index · List index
Message view « Date » · « Thread »
Top « Date » · « Thread »
From Apache Jenkins Server <jenk...@builds.apache.org>
Subject Build failed in Jenkins: Maven TLP » maven-surefire » 1546-1222 #1
Date Tue, 02 Apr 2019 09:03:44 GMT
See https://builds.apache.org/job/maven-box/job/maven-surefire/job/1546-1222/1/

No changes.

1 tests failed.
FAILED:  junit.framework.JUnit4TestCaseFacade.displayNamesIgnoredInReport

Error Message:
expected: <some display name> but was: <myNamedTestMethod>

Stack Trace:
org.opentest4j.AssertionFailedError: expected: <some display name> but was: <myNamedTestMethod>
	at org.junit.jupiter.api.AssertionUtils.fail(AssertionUtils.java:54)
	at org.junit.jupiter.api.AssertEquals.failNotEqual(AssertEquals.java:195)
	at org.junit.jupiter.api.AssertEquals.assertEquals(AssertEquals.java:184)
	at org.junit.jupiter.api.AssertEquals.assertEquals(AssertEquals.java:179)
	at org.junit.jupiter.api.Assertions.assertEquals(Assertions.java:508)
	at org.apache.maven.surefire.junitplatform.RunListenerAdapterTest.displayNamesIgnoredInReport(RunListenerAdapterTest.java:516)
	at sun.reflect.NativeMethodAccessorImpl.invoke0(Native Method)
	at sun.reflect.NativeMethodAccessorImpl.invoke(NativeMethodAccessorImpl.java:62)
	at sun.reflect.DelegatingMethodAccessorImpl.invoke(DelegatingMethodAccessorImpl.java:43)
	at java.lang.reflect.Method.invoke(Method.java:498)
	at org.junit.runners.model.FrameworkMethod$1.runReflectiveCall(FrameworkMethod.java:50)
	at org.junit.internal.runners.model.ReflectiveCallable.run(ReflectiveCallable.java:12)
	at org.junit.runners.model.FrameworkMethod.invokeExplosively(FrameworkMethod.java:47)
	at org.junit.internal.runners.statements.InvokeMethod.evaluate(InvokeMethod.java:17)
	at org.junit.internal.runners.statements.RunBefores.evaluate(RunBefores.java:26)
	at org.junit.runners.ParentRunner.runLeaf(ParentRunner.java:325)
	at org.junit.runners.BlockJUnit4ClassRunner.runChild(BlockJUnit4ClassRunner.java:78)
	at org.junit.runners.BlockJUnit4ClassRunner.runChild(BlockJUnit4ClassRunner.java:57)
	at org.junit.runners.ParentRunner$3.run(ParentRunner.java:290)
	at org.junit.runners.ParentRunner$1.schedule(ParentRunner.java:71)
	at org.junit.runners.ParentRunner.runChildren(ParentRunner.java:288)
	at org.junit.runners.ParentRunner.access$000(ParentRunner.java:58)
	at org.junit.runners.ParentRunner$2.evaluate(ParentRunner.java:268)
	at org.junit.runners.ParentRunner.run(ParentRunner.java:363)
	at org.junit.runners.Suite.runChild(Suite.java:128)
	at org.junit.runners.Suite.runChild(Suite.java:27)
	at org.junit.runners.ParentRunner$3.run(ParentRunner.java:290)
	at org.junit.runners.ParentRunner$1.schedule(ParentRunner.java:71)
	at org.junit.runners.ParentRunner.runChildren(ParentRunner.java:288)
	at org.junit.runners.ParentRunner.access$000(ParentRunner.java:58)
	at org.junit.runners.ParentRunner$2.evaluate(ParentRunner.java:268)
	at org.junit.runners.ParentRunner.run(ParentRunner.java:363)
	at junit.framework.JUnit4TestAdapter.run(JUnit4TestAdapter.java:38)
	at sun.reflect.NativeMethodAccessorImpl.invoke0(Native Method)
	at sun.reflect.NativeMethodAccessorImpl.invoke(NativeMethodAccessorImpl.java:62)
	at sun.reflect.DelegatingMethodAccessorImpl.invoke(DelegatingMethodAccessorImpl.java:43)
	at java.lang.reflect.Method.invoke(Method.java:498)
	at org.apache.maven.shadefire.surefire.junit.JUnitTestSet.execute(JUnitTestSet.java:99)
	at org.apache.maven.shadefire.surefire.junit.JUnit3Provider.executeTestSet(JUnit3Provider.java:140)
	at org.apache.maven.shadefire.surefire.junit.JUnit3Provider.invoke(JUnit3Provider.java:113)
	at org.apache.maven.shadefire.surefire.booter.ForkedBooter.invokeProviderInSameClassLoader(ForkedBooter.java:384)
	at org.apache.maven.shadefire.surefire.booter.ForkedBooter.runSuitesInProcess(ForkedBooter.java:345)
	at org.apache.maven.shadefire.surefire.booter.ForkedBooter.execute(ForkedBooter.java:126)
	at org.apache.maven.shadefire.surefire.booter.ForkedBooter.main(ForkedBooter.java:418)




Build log:
[...truncated 32450 lines...]
[2019-04-02T09:03:31.272Z] [INFO] Exclude: .repository/**
[2019-04-02T09:03:31.272Z] [INFO] Exclude: .maven/spy.log
[2019-04-02T09:03:31.272Z] [INFO] Exclude: dependency-reduced-pom.xml
[2019-04-02T09:03:31.272Z] [INFO] Exclude: .java-version
[2019-04-02T09:03:31.272Z] [INFO] Exclude: Jenkinsfile
[2019-04-02T09:03:31.272Z] [INFO] Exclude: README.md
[2019-04-02T09:03:31.272Z] [INFO] Exclude: .gitignore
[2019-04-02T09:03:31.272Z] [INFO] Exclude: .git/**/*
[2019-04-02T09:03:31.272Z] [INFO] Exclude: **/.idea
[2019-04-02T09:03:31.273Z] [INFO] Exclude: **/.svn/**/*
[2019-04-02T09:03:31.273Z] [INFO] Exclude: **/*.iml
[2019-04-02T09:03:31.273Z] [INFO] Exclude: **/*.ipr
[2019-04-02T09:03:31.273Z] [INFO] Exclude: **/*.iws
[2019-04-02T09:03:31.273Z] [INFO] Exclude: **/*.versionsBackup
[2019-04-02T09:03:31.273Z] [INFO] Exclude: **/dependency-reduced-pom.xml
[2019-04-02T09:03:31.273Z] [INFO] Exclude: .repository/**
[2019-04-02T09:03:31.273Z] [INFO] Exclude: src/test/resources/**/*
[2019-04-02T09:03:31.273Z] [INFO] Exclude: src/test/resources/**/*.css
[2019-04-02T09:03:31.273Z] [INFO] Exclude: **/*.jj
[2019-04-02T09:03:31.273Z] [INFO] Exclude: src/main/resources/META-INF/services/org.apache.maven.surefire.providerapi.SurefireProvider
[2019-04-02T09:03:31.273Z] [INFO] Exclude: DEPENDENCIES
[2019-04-02T09:03:31.273Z] [INFO] Exclude: .m2/**
[2019-04-02T09:03:31.273Z] [INFO] Exclude: .m2
[2019-04-02T09:03:31.273Z] [INFO] Exclude: .travis.yml
[2019-04-02T09:03:31.273Z] [INFO] 10 resources included (use -debug for more details)
[2019-04-02T09:03:31.603Z] [INFO] Rat check: Summary over all files. Unapproved: 0, unknown:
0, generated: 0, approved: 10 licenses.
[2019-04-02T09:03:31.603Z] [INFO] 
[2019-04-02T09:03:31.603Z] [INFO] --- jacoco-maven-plugin:0.8.3:prepare-agent (jacoco-agent)
@ surefire-junit-platform ---
[2019-04-02T09:03:31.603Z] [INFO] Skipping JaCoCo execution because property jacoco.skip is
set.
[2019-04-02T09:03:31.603Z] [INFO] jacoco.agent set to empty
[2019-04-02T09:03:31.603Z] [INFO] 
[2019-04-02T09:03:31.603Z] [INFO] --- maven-compiler-plugin:3.7.0:compile (compile-generated)
@ surefire-junit-platform ---
[2019-04-02T09:03:31.603Z] [INFO] Nothing to compile - all classes are up to date
[2019-04-02T09:03:31.603Z] [INFO] 
[2019-04-02T09:03:31.603Z] [INFO] --- maven-remote-resources-plugin:1.5:process (process-resource-bundles)
@ surefire-junit-platform ---
[2019-04-02T09:03:31.603Z] [INFO] 
[2019-04-02T09:03:31.603Z] [INFO] --- maven-resources-plugin:3.1.0:resources (default-resources)
@ surefire-junit-platform ---
[2019-04-02T09:03:31.603Z] [INFO] Using 'UTF-8' encoding to copy filtered resources.
[2019-04-02T09:03:31.603Z] [INFO] Copying 1 resource
[2019-04-02T09:03:31.603Z] [INFO] Copying 3 resources
[2019-04-02T09:03:31.603Z] [INFO] 
[2019-04-02T09:03:31.603Z] [INFO] --- maven-compiler-plugin:3.7.0:compile (default-compile)
@ surefire-junit-platform ---
[2019-04-02T09:03:31.603Z] [INFO] Changes detected - recompiling the module!
[2019-04-02T09:03:31.603Z] [INFO] Compiling 4 source files to C:\Users\jenkins\AppData\Local\Temp\2\jenkins-maven-box-maven-surefire-1546-1222-1\surefire-providers\surefire-junit-platform\target\classes
[2019-04-02T09:03:34.444Z] [INFO] 
[2019-04-02T09:03:34.444Z] [INFO] --- animal-sniffer-maven-plugin:1.17:check (signature-check)
@ surefire-junit-platform ---
[2019-04-02T09:03:34.444Z] [INFO] Checking unresolved references to org.codehaus.mojo.signature:java18:1.0
[2019-04-02T09:03:34.444Z] [INFO] Downloading from central: https://repo.maven.apache.org/maven2/org/codehaus/mojo/signature/java18/1.0/java18-1.0.signature
[2019-04-02T09:03:34.444Z] [INFO] Downloaded from central: https://repo.maven.apache.org/maven2/org/codehaus/mojo/signature/java18/1.0/java18-1.0.signature
(2.0 MB at 7.4 MB/s)
[2019-04-02T09:03:35.547Z] [INFO] 
[2019-04-02T09:03:35.547Z] [INFO] --- maven-resources-plugin:3.1.0:testResources (default-testResources)
@ surefire-junit-platform ---
[2019-04-02T09:03:35.548Z] [INFO] Using 'UTF-8' encoding to copy filtered resources.
[2019-04-02T09:03:35.548Z] [INFO] skip non existing resourceDirectory C:\Users\jenkins\AppData\Local\Temp\2\jenkins-maven-box-maven-surefire-1546-1222-1\surefire-providers\surefire-junit-platform\src\test\resources
[2019-04-02T09:03:35.548Z] [INFO] Copying 3 resources
[2019-04-02T09:03:35.548Z] [INFO] 
[2019-04-02T09:03:35.548Z] [INFO] --- maven-compiler-plugin:3.7.0:testCompile (default-testCompile)
@ surefire-junit-platform ---
[2019-04-02T09:03:35.548Z] [INFO] Changes detected - recompiling the module!
[2019-04-02T09:03:35.548Z] [INFO] Compiling 5 source files to C:\Users\jenkins\AppData\Local\Temp\2\jenkins-maven-box-maven-surefire-1546-1222-1\surefire-providers\surefire-junit-platform\target\test-classes
[2019-04-02T09:03:39.142Z] [INFO] 
[2019-04-02T09:03:39.142Z] [INFO] --- maven-surefire-plugin:3.0.0-M3:test (default-test) @
surefire-junit-platform ---
[2019-04-02T09:03:39.142Z] [INFO] Surefire report directory: C:\Users\jenkins\AppData\Local\Temp\2\jenkins-maven-box-maven-surefire-1546-1222-1\surefire-providers\surefire-junit-platform\target\surefire-reports
[2019-04-02T09:03:39.142Z] [INFO] Using configured provider org.apache.maven.shadefire.surefire.junit.JUnit3Provider
[2019-04-02T09:03:39.142Z] [INFO] parallel='none', perCoreThreadCount=true, threadCount=0,
useUnlimitedThreads=false, threadCountSuites=0, threadCountClasses=0, threadCountMethods=0,
parallelOptimized=true
[2019-04-02T09:03:39.142Z] [INFO] 
[2019-04-02T09:03:39.142Z] [INFO] -------------------------------------------------------
[2019-04-02T09:03:39.142Z] [INFO]  T E S T S
[2019-04-02T09:03:39.142Z] [INFO] -------------------------------------------------------
[2019-04-02T09:03:39.813Z] [INFO] Running org.apache.maven.surefire.junitplatform.JUnit47SuiteTest
[2019-04-02T09:03:42.566Z] [ERROR] Tests run: 54, Failures: 0, Errors: 1, Skipped: 0, Time
elapsed: 2.884 s <<< FAILURE! - in org.apache.maven.surefire.junitplatform.JUnit47SuiteTest
[2019-04-02T09:03:42.567Z] [ERROR] displayNamesIgnoredInReport(org.apache.maven.surefire.junitplatform.RunListenerAdapterTest)
 Time elapsed: 0.022 s  <<< ERROR!
[2019-04-02T09:03:42.567Z] org.opentest4j.AssertionFailedError: expected: <some display
name> but was: <myNamedTestMethod>
[2019-04-02T09:03:42.567Z] 	at org.junit.jupiter.api.AssertionUtils.fail(AssertionUtils.java:54)
[2019-04-02T09:03:42.567Z] 	at org.junit.jupiter.api.AssertEquals.failNotEqual(AssertEquals.java:195)
[2019-04-02T09:03:42.567Z] 	at org.junit.jupiter.api.AssertEquals.assertEquals(AssertEquals.java:184)
[2019-04-02T09:03:42.567Z] 	at org.junit.jupiter.api.AssertEquals.assertEquals(AssertEquals.java:179)
[2019-04-02T09:03:42.567Z] 	at org.junit.jupiter.api.Assertions.assertEquals(Assertions.java:508)
[2019-04-02T09:03:42.567Z] 	at org.apache.maven.surefire.junitplatform.RunListenerAdapterTest.displayNamesIgnoredInReport(RunListenerAdapterTest.java:516)
[2019-04-02T09:03:42.567Z] 	at sun.reflect.NativeMethodAccessorImpl.invoke0(Native Method)
[2019-04-02T09:03:42.567Z] 	at sun.reflect.NativeMethodAccessorImpl.invoke(NativeMethodAccessorImpl.java:62)
[2019-04-02T09:03:42.567Z] 	at sun.reflect.DelegatingMethodAccessorImpl.invoke(DelegatingMethodAccessorImpl.java:43)
[2019-04-02T09:03:42.567Z] 	at java.lang.reflect.Method.invoke(Method.java:498)
[2019-04-02T09:03:42.567Z] 	at org.junit.runners.model.FrameworkMethod$1.runReflectiveCall(FrameworkMethod.java:50)
[2019-04-02T09:03:42.567Z] 	at org.junit.internal.runners.model.ReflectiveCallable.run(ReflectiveCallable.java:12)
[2019-04-02T09:03:42.567Z] 	at org.junit.runners.model.FrameworkMethod.invokeExplosively(FrameworkMethod.java:47)
[2019-04-02T09:03:42.567Z] 	at org.junit.internal.runners.statements.InvokeMethod.evaluate(InvokeMethod.java:17)
[2019-04-02T09:03:42.567Z] 	at org.junit.internal.runners.statements.RunBefores.evaluate(RunBefores.java:26)
[2019-04-02T09:03:42.567Z] 	at org.junit.runners.ParentRunner.runLeaf(ParentRunner.java:325)
[2019-04-02T09:03:42.567Z] 	at org.junit.runners.BlockJUnit4ClassRunner.runChild(BlockJUnit4ClassRunner.java:78)
[2019-04-02T09:03:42.567Z] 	at org.junit.runners.BlockJUnit4ClassRunner.runChild(BlockJUnit4ClassRunner.java:57)
[2019-04-02T09:03:42.567Z] 	at org.junit.runners.ParentRunner$3.run(ParentRunner.java:290)
[2019-04-02T09:03:42.567Z] 	at org.junit.runners.ParentRunner$1.schedule(ParentRunner.java:71)
[2019-04-02T09:03:42.567Z] 	at org.junit.runners.ParentRunner.runChildren(ParentRunner.java:288)
[2019-04-02T09:03:42.567Z] 	at org.junit.runners.ParentRunner.access$000(ParentRunner.java:58)
[2019-04-02T09:03:42.567Z] 	at org.junit.runners.ParentRunner$2.evaluate(ParentRunner.java:268)
[2019-04-02T09:03:42.567Z] 	at org.junit.runners.ParentRunner.run(ParentRunner.java:363)
[2019-04-02T09:03:42.567Z] 	at org.junit.runners.Suite.runChild(Suite.java:128)
[2019-04-02T09:03:42.567Z] 	at org.junit.runners.Suite.runChild(Suite.java:27)
[2019-04-02T09:03:42.567Z] 	at org.junit.runners.ParentRunner$3.run(ParentRunner.java:290)
[2019-04-02T09:03:42.567Z] 	at org.junit.runners.ParentRunner$1.schedule(ParentRunner.java:71)
[2019-04-02T09:03:42.567Z] 	at org.junit.runners.ParentRunner.runChildren(ParentRunner.java:288)
[2019-04-02T09:03:42.567Z] 	at org.junit.runners.ParentRunner.access$000(ParentRunner.java:58)
[2019-04-02T09:03:42.567Z] 	at org.junit.runners.ParentRunner$2.evaluate(ParentRunner.java:268)
[2019-04-02T09:03:42.567Z] 	at org.junit.runners.ParentRunner.run(ParentRunner.java:363)
[2019-04-02T09:03:42.567Z] 	at junit.framework.JUnit4TestAdapter.run(JUnit4TestAdapter.java:38)
[2019-04-02T09:03:42.567Z] 	at sun.reflect.NativeMethodAccessorImpl.invoke0(Native Method)
[2019-04-02T09:03:42.567Z] 	at sun.reflect.NativeMethodAccessorImpl.invoke(NativeMethodAccessorImpl.java:62)
[2019-04-02T09:03:42.567Z] 	at sun.reflect.DelegatingMethodAccessorImpl.invoke(DelegatingMethodAccessorImpl.java:43)
[2019-04-02T09:03:42.567Z] 	at java.lang.reflect.Method.invoke(Method.java:498)
[2019-04-02T09:03:42.567Z] 	at org.apache.maven.shadefire.surefire.junit.JUnitTestSet.execute(JUnitTestSet.java:99)
[2019-04-02T09:03:42.567Z] 	at org.apache.maven.shadefire.surefire.junit.JUnit3Provider.executeTestSet(JUnit3Provider.java:140)
[2019-04-02T09:03:42.567Z] 	at org.apache.maven.shadefire.surefire.junit.JUnit3Provider.invoke(JUnit3Provider.java:113)
[2019-04-02T09:03:42.567Z] 	at org.apache.maven.shadefire.surefire.booter.ForkedBooter.invokeProviderInSameClassLoader(ForkedBooter.java:384)
[2019-04-02T09:03:42.567Z] 	at org.apache.maven.shadefire.surefire.booter.ForkedBooter.runSuitesInProcess(ForkedBooter.java:345)
[2019-04-02T09:03:42.567Z] 	at org.apache.maven.shadefire.surefire.booter.ForkedBooter.execute(ForkedBooter.java:126)
[2019-04-02T09:03:42.567Z] 	at org.apache.maven.shadefire.surefire.booter.ForkedBooter.main(ForkedBooter.java:418)
[2019-04-02T09:03:42.567Z] 
[2019-04-02T09:03:42.876Z] [INFO] 
[2019-04-02T09:03:42.876Z] [INFO] Results:
[2019-04-02T09:03:42.876Z] [INFO] 
[2019-04-02T09:03:42.876Z] [ERROR] Errors: 
[2019-04-02T09:03:42.876Z] [ERROR]   junit.framework.JUnit4TestCaseFacade#UNKNOWN  expected:
<some display name> bu...
[2019-04-02T09:03:42.876Z] [INFO] 
[2019-04-02T09:03:42.876Z] [ERROR] Tests run: 54, Failures: 0, Errors: 1, Skipped: 0
[2019-04-02T09:03:42.876Z] [INFO] 
[2019-04-02T09:03:42.876Z] [INFO] ------------------------------------------------------------------------
[2019-04-02T09:03:42.876Z] [INFO] Reactor Summary for Apache Maven Surefire 3.0.0-SNAPSHOT:
[2019-04-02T09:03:42.876Z] [INFO] 
[2019-04-02T09:03:42.876Z] [INFO] Apache Maven Surefire .............................. SUCCESS
[01:16 min]
[2019-04-02T09:03:42.876Z] [INFO] SureFire Logger API ................................ SUCCESS
[ 16.262 s]
[2019-04-02T09:03:42.876Z] [INFO] SureFire API ....................................... SUCCESS
[ 24.947 s]
[2019-04-02T09:03:42.876Z] [INFO] SureFire Booter .................................... SUCCESS
[ 25.469 s]
[2019-04-02T09:03:42.876Z] [INFO] Maven Surefire Test-Grouping Support ............... SUCCESS
[ 14.960 s]
[2019-04-02T09:03:42.876Z] [INFO] SureFire Providers ................................. SUCCESS
[  1.634 s]
[2019-04-02T09:03:42.876Z] [INFO] Shared JUnit3 Provider Code ........................ SUCCESS
[  7.370 s]
[2019-04-02T09:03:42.876Z] [INFO] Shared Java 5 Provider Base ........................ SUCCESS
[  9.295 s]
[2019-04-02T09:03:42.876Z] [INFO] Shared JUnit4 Provider Code ........................ SUCCESS
[  9.317 s]
[2019-04-02T09:03:42.876Z] [INFO] Shared JUnit48 Provider Code ....................... SUCCESS
[ 10.305 s]
[2019-04-02T09:03:42.876Z] [INFO] SureFire JUnit Runner .............................. SUCCESS
[  7.795 s]
[2019-04-02T09:03:42.876Z] [INFO] SureFire JUnit4 Runner ............................. SUCCESS
[ 37.683 s]
[2019-04-02T09:03:42.876Z] [INFO] Maven Surefire Common .............................. SUCCESS
[ 42.903 s]
[2019-04-02T09:03:42.876Z] [INFO] SureFire JUnitCore Runner .......................... SUCCESS
[02:26 min]
[2019-04-02T09:03:42.876Z] [INFO] SureFire JUnit Platform Runner ..................... FAILURE
[ 14.510 s]
[2019-04-02T09:03:42.876Z] [INFO] SureFire TestNG Utils .............................. SKIPPED
[2019-04-02T09:03:42.876Z] [INFO] SureFire TestNG Runner ............................. SKIPPED
[2019-04-02T09:03:42.876Z] [INFO] ShadeFire JUnit3 Provider .......................... SKIPPED
[2019-04-02T09:03:42.876Z] [INFO] Surefire Report Parser ............................. SKIPPED
[2019-04-02T09:03:42.876Z] [INFO] Maven Surefire Plugin .............................. SKIPPED
[2019-04-02T09:03:42.876Z] [INFO] Maven Failsafe Plugin .............................. SKIPPED
[2019-04-02T09:03:42.876Z] [INFO] Maven Surefire Report Plugin ....................... SKIPPED
[2019-04-02T09:03:42.876Z] [INFO] Maven Surefire Integration Tests ................... SKIPPED
[2019-04-02T09:03:42.876Z] [INFO] ------------------------------------------------------------------------
[2019-04-02T09:03:42.876Z] [INFO] BUILD FAILURE
[2019-04-02T09:03:42.876Z] [INFO] ------------------------------------------------------------------------
[2019-04-02T09:03:42.876Z] [INFO] Total time:  07:29 min
[2019-04-02T09:03:42.876Z] [INFO] Finished at: 2019-04-02T02:03:42-07:00
[2019-04-02T09:03:42.876Z] [INFO] ------------------------------------------------------------------------
[2019-04-02T09:03:42.876Z] [ERROR] Failed to execute goal org.apache.maven.plugins:maven-surefire-plugin:3.0.0-M3:test
(default-test) on project surefire-junit-platform: There are test failures.
[2019-04-02T09:03:42.876Z] [ERROR] 
[2019-04-02T09:03:42.876Z] [ERROR] Please refer to C:\Users\jenkins\AppData\Local\Temp\2\jenkins-maven-box-maven-surefire-1546-1222-1\surefire-providers\surefire-junit-platform\target\surefire-reports
for the individual test results.
[2019-04-02T09:03:42.876Z] [ERROR] Please refer to dump files (if any exist) [date].dump,
[date]-jvmRun[N].dump and [date].dumpstream.
[2019-04-02T09:03:42.876Z] [ERROR] -> [Help 1]
[2019-04-02T09:03:42.876Z] org.apache.maven.lifecycle.LifecycleExecutionException: Failed
to execute goal org.apache.maven.plugins:maven-surefire-plugin:3.0.0-M3:test (default-test)
on project surefire-junit-platform: There are test failures.
[2019-04-02T09:03:42.876Z] 
[2019-04-02T09:03:42.876Z] Please refer to C:\Users\jenkins\AppData\Local\Temp\2\jenkins-maven-box-maven-surefire-1546-1222-1\surefire-providers\surefire-junit-platform\target\surefire-reports
for the individual test results.
[2019-04-02T09:03:42.876Z] Please refer to dump files (if any exist) [date].dump, [date]-jvmRun[N].dump
and [date].dumpstream.
[2019-04-02T09:03:42.876Z]     at org.apache.maven.lifecycle.internal.MojoExecutor.execute
(MojoExecutor.java:215)
[2019-04-02T09:03:42.876Z]     at org.apache.maven.lifecycle.internal.MojoExecutor.execute
(MojoExecutor.java:156)
[2019-04-02T09:03:42.876Z]     at org.apache.maven.lifecycle.internal.MojoExecutor.execute
(MojoExecutor.java:148)
[2019-04-02T09:03:42.876Z]     at org.apache.maven.lifecycle.internal.LifecycleModuleBuilder.buildProject
(LifecycleModuleBuilder.java:117)
[2019-04-02T09:03:42.876Z]     at org.apache.maven.lifecycle.internal.LifecycleModuleBuilder.buildProject
(LifecycleModuleBuilder.java:81)
[2019-04-02T09:03:42.876Z]     at org.apache.maven.lifecycle.internal.builder.singlethreaded.SingleThreadedBuilder.build
(SingleThreadedBuilder.java:56)
[2019-04-02T09:03:42.876Z]     at org.apache.maven.lifecycle.internal.LifecycleStarter.execute
(LifecycleStarter.java:128)
[2019-04-02T09:03:42.876Z]     at org.apache.maven.DefaultMaven.doExecute (DefaultMaven.java:305)
[2019-04-02T09:03:42.876Z]     at org.apache.maven.DefaultMaven.doExecute (DefaultMaven.java:192)
[2019-04-02T09:03:42.876Z]     at org.apache.maven.DefaultMaven.execute (DefaultMaven.java:105)
[2019-04-02T09:03:42.876Z]     at org.apache.maven.cli.MavenCli.execute (MavenCli.java:956)
[2019-04-02T09:03:42.876Z]     at org.apache.maven.cli.MavenCli.doMain (MavenCli.java:288)
[2019-04-02T09:03:42.876Z]     at org.apache.maven.cli.MavenCli.main (MavenCli.java:192)
[2019-04-02T09:03:42.876Z]     at sun.reflect.NativeMethodAccessorImpl.invoke0 (Native Method)
[2019-04-02T09:03:42.876Z]     at sun.reflect.NativeMethodAccessorImpl.invoke (NativeMethodAccessorImpl.java:62)
[2019-04-02T09:03:42.876Z]     at sun.reflect.DelegatingMethodAccessorImpl.invoke (DelegatingMethodAccessorImpl.java:43)
[2019-04-02T09:03:42.876Z]     at java.lang.reflect.Method.invoke (Method.java:498)
[2019-04-02T09:03:42.876Z]     at org.codehaus.plexus.classworlds.launcher.Launcher.launchEnhanced
(Launcher.java:289)
[2019-04-02T09:03:42.876Z]     at org.codehaus.plexus.classworlds.launcher.Launcher.launch
(Launcher.java:229)
[2019-04-02T09:03:42.876Z]     at org.codehaus.plexus.classworlds.launcher.Launcher.mainWithExitCode
(Launcher.java:415)
[2019-04-02T09:03:42.876Z]     at org.codehaus.plexus.classworlds.launcher.Launcher.main (Launcher.java:356)
[2019-04-02T09:03:42.876Z] Caused by: org.apache.maven.plugin.MojoFailureException: There
are test failures.
[2019-04-02T09:03:42.876Z] 
[2019-04-02T09:03:42.877Z] Please refer to C:\Users\jenkins\AppData\Local\Temp\2\jenkins-maven-box-maven-surefire-1546-1222-1\surefire-providers\surefire-junit-platform\target\surefire-reports
for the individual test results.
[2019-04-02T09:03:42.877Z] Please refer to dump files (if any exist) [date].dump, [date]-jvmRun[N].dump
and [date].dumpstream.
[2019-04-02T09:03:42.877Z]     at org.apache.maven.plugin.surefire.SurefireHelper.throwException
(SurefireHelper.java:271)
[2019-04-02T09:03:42.877Z]     at org.apache.maven.plugin.surefire.SurefireHelper.reportExecution
(SurefireHelper.java:159)
[2019-04-02T09:03:42.877Z]     at org.apache.maven.plugin.surefire.SurefirePlugin.handleSummary
(SurefirePlugin.java:373)
[2019-04-02T09:03:42.877Z]     at org.apache.maven.plugin.surefire.AbstractSurefireMojo.executeAfterPreconditionsChecked
(AbstractSurefireMojo.java:1018)
[2019-04-02T09:03:42.877Z]     at org.apache.maven.plugin.surefire.AbstractSurefireMojo.execute
(AbstractSurefireMojo.java:848)
[2019-04-02T09:03:42.877Z]     at org.apache.maven.plugin.DefaultBuildPluginManager.executeMojo
(DefaultBuildPluginManager.java:137)
[2019-04-02T09:03:42.877Z]     at org.apache.maven.lifecycle.internal.MojoExecutor.execute
(MojoExecutor.java:210)
[2019-04-02T09:03:42.877Z]     at org.apache.maven.lifecycle.internal.MojoExecutor.execute
(MojoExecutor.java:156)
[2019-04-02T09:03:42.877Z]     at org.apache.maven.lifecycle.internal.MojoExecutor.execute
(MojoExecutor.java:148)
[2019-04-02T09:03:42.877Z]     at org.apache.maven.lifecycle.internal.LifecycleModuleBuilder.buildProject
(LifecycleModuleBuilder.java:117)
[2019-04-02T09:03:42.877Z]     at org.apache.maven.lifecycle.internal.LifecycleModuleBuilder.buildProject
(LifecycleModuleBuilder.java:81)
[2019-04-02T09:03:43.170Z]     at org.apache.maven.lifecycle.internal.builder.singlethreaded.SingleThreadedBuilder.build
(SingleThreadedBuilder.java:56)
[2019-04-02T09:03:43.170Z]     at org.apache.maven.lifecycle.internal.LifecycleStarter.execute
(LifecycleStarter.java:128)
[2019-04-02T09:03:43.170Z]     at org.apache.maven.DefaultMaven.doExecute (DefaultMaven.java:305)
[2019-04-02T09:03:43.170Z]     at org.apache.maven.DefaultMaven.doExecute (DefaultMaven.java:192)
[2019-04-02T09:03:43.170Z]     at org.apache.maven.DefaultMaven.execute (DefaultMaven.java:105)
[2019-04-02T09:03:43.170Z]     at org.apache.maven.cli.MavenCli.execute (MavenCli.java:956)
[2019-04-02T09:03:43.170Z]     at org.apache.maven.cli.MavenCli.doMain (MavenCli.java:288)
[2019-04-02T09:03:43.170Z]     at org.apache.maven.cli.MavenCli.main (MavenCli.java:192)
[2019-04-02T09:03:43.170Z]     at sun.reflect.NativeMethodAccessorImpl.invoke0 (Native Method)
[2019-04-02T09:03:43.170Z]     at sun.reflect.NativeMethodAccessorImpl.invoke (NativeMethodAccessorImpl.java:62)
[2019-04-02T09:03:43.170Z]     at sun.reflect.DelegatingMethodAccessorImpl.invoke (DelegatingMethodAccessorImpl.java:43)
[2019-04-02T09:03:43.170Z]     at java.lang.reflect.Method.invoke (Method.java:498)
[2019-04-02T09:03:43.170Z]     at org.codehaus.plexus.classworlds.launcher.Launcher.launchEnhanced
(Launcher.java:289)
[2019-04-02T09:03:43.170Z]     at org.codehaus.plexus.classworlds.launcher.Launcher.launch
(Launcher.java:229)
[2019-04-02T09:03:43.170Z]     at org.codehaus.plexus.classworlds.launcher.Launcher.mainWithExitCode
(Launcher.java:415)
[2019-04-02T09:03:43.170Z]     at org.codehaus.plexus.classworlds.launcher.Launcher.main (Launcher.java:356)
[2019-04-02T09:03:43.170Z] [ERROR] 
[2019-04-02T09:03:43.170Z] [ERROR] Re-run Maven using the -X switch to enable full debug logging.
[2019-04-02T09:03:43.170Z] [ERROR] 
[2019-04-02T09:03:43.170Z] [ERROR] For more information about the errors and possible solutions,
please read the following articles:
[2019-04-02T09:03:43.170Z] [ERROR] [Help 1] http://cwiki.apache.org/confluence/display/MAVEN/MojoFailureException
[2019-04-02T09:03:43.170Z] [ERROR] 
[2019-04-02T09:03:43.170Z] [ERROR] After correcting the problems, you can resume the build
with the command
[2019-04-02T09:03:43.170Z] [ERROR]   mvn <goals> -rf :surefire-junit-platform
[Pipeline] }
[Pipeline] // withEnv
[Pipeline] }
[Pipeline] // stage
[Pipeline] fileExists
[Pipeline] fileExists
[Pipeline] archiveArtifacts
[2019-04-02T09:03:43.403Z] Archiving artifacts
[Pipeline] cleanWs
[2019-04-02T09:03:43.965Z] [WS-CLEANUP] Deleting project workspace...
[2019-04-02T09:03:43.965Z] [WS-CLEANUP] Deferred wipeout is used...
[2019-04-02T09:03:44.032Z] [WS-CLEANUP] done
[Pipeline] }
[Pipeline] // ws
[Pipeline] }
[Pipeline] // timestamps
[Pipeline] }
[Pipeline] // node
[Pipeline] }
[Pipeline] // parallel
[Pipeline] echo
Build result: FAILURE
[Pipeline] jiraIssueSelector
[Pipeline] emailext
Mime
  • Unnamed multipart/mixed (inline, None, 0 bytes)
View raw message