maven-notifications mailing list archives

Site index · List index
Message view « Date » · « Thread »
Top « Date » · « Thread »
From Apache Jenkins Server <jenk...@builds.apache.org>
Subject Build failed in Jenkins: Maven TLP » maven-gpg-plugin » MGPG-69 #4
Date Mon, 01 Apr 2019 17:50:46 GMT
See https://builds.apache.org/job/maven-box/job/maven-gpg-plugin/job/MGPG-69/4/

No changes.

No tests ran.

Build log:
[...truncated 6836 lines...]
       |        [DEBUG]   (f) attach = true
       |        [DEBUG]   (f) excludeResources = false
       |        [DEBUG]   (f) finalName = test-1.0
       |        [DEBUG]   (f) outputDirectory = F:\jenkins\jenkins-slave\workspace\ven-box_maven-gpg-plugin_MGPG-69@3@2\windows-jdk11-m3.5.x_build\target\it\sign-release\target
       |        [DEBUG]   (f) project = MavenProject: org.apache.maven.its.gpg.sr:test:1.0
@ F:\jenkins\jenkins-slave\workspace\ven-box_maven-gpg-plugin_MGPG-69@3@2\windows-jdk11-m3.5.x_build\target\it\sign-release\pom.xml
       |        [DEBUG]   (f) reactorProjects = [MavenProject: org.apache.maven.its.gpg.sr:test:1.0
@ F:\jenkins\jenkins-slave\workspace\ven-box_maven-gpg-plugin_MGPG-69@3@2\windows-jdk11-m3.5.x_build\target\it\sign-release\pom.xml]
       |        [DEBUG] -- end configuration --
       |        [INFO] Building jar: F:\jenkins\jenkins-slave\workspace\ven-box_maven-gpg-plugin_MGPG-69@3@2\windows-jdk11-m3.5.x_build\target\it\sign-release\target\test-1.0-sources.jar
       |        [INFO] 
       |        [INFO] --- maven-gpg-plugin:1.7-SNAPSHOT:sign (sign-artifacts) @ test ---
       |        [DEBUG] Dependency collection stats: {ConflictMarker.analyzeTime=199910, ConflictMarker.markTime=101260,
ConflictMarker.nodeCount=40, ConflictIdSorter.graphTime=88250, ConflictIdSorter.topsortTime=57940,
ConflictIdSorter.conflictIdCount=18, ConflictIdSorter.conflictIdCycleCount=0, ConflictResolver.totalTime=842610,
ConflictResolver.conflictItemCount=40, DefaultDependencyCollector.collectTime=100667620, DefaultDependencyCollector.transformTime=1360480}
       |        [DEBUG] org.apache.maven.plugins:maven-gpg-plugin:jar:1.7-SNAPSHOT:
       |        [DEBUG]    org.apache.maven:maven-plugin-api:jar:2.2.1:compile
       |        [DEBUG]    org.apache.maven:maven-project:jar:2.2.1:compile
       |        [DEBUG]       org.apache.maven:maven-settings:jar:2.2.1:compile
       |        [DEBUG]       org.apache.maven:maven-profile:jar:2.2.1:compile
       |        [DEBUG]       org.apache.maven:maven-artifact-manager:jar:2.2.1:compile
       |        [DEBUG]          backport-util-concurrent:backport-util-concurrent:jar:3.1:compile
       |        [DEBUG]       org.apache.maven:maven-plugin-registry:jar:2.2.1:compile
       |        [DEBUG]       org.codehaus.plexus:plexus-interpolation:jar:1.11:compile
       |        [DEBUG]       org.codehaus.plexus:plexus-container-default:jar:1.0-alpha-9-stable-1:compile
       |        [DEBUG]          junit:junit:jar:3.8.1:compile
       |        [DEBUG]          classworlds:classworlds:jar:1.1-alpha-2:compile
       |        [DEBUG]    org.apache.maven:maven-artifact:jar:2.2.1:compile
       |        [DEBUG]    org.apache.maven:maven-repository-metadata:jar:2.2.1:compile
       |        [DEBUG]    org.apache.maven:maven-model:jar:2.2.1:compile
       |        [DEBUG]    org.codehaus.plexus:plexus-utils:jar:3.1.0:compile
       |        [DEBUG]    org.sonatype.plexus:plexus-sec-dispatcher:jar:1.4:compile
       |        [DEBUG]       org.sonatype.plexus:plexus-cipher:jar:1.4:compile
       |        [DEBUG] Created new class realm plugin>org.apache.maven.plugins:maven-gpg-plugin:1.7-SNAPSHOT
       |        [DEBUG] Importing foreign packages into class realm plugin>org.apache.maven.plugins:maven-gpg-plugin:1.7-SNAPSHOT
       |        [DEBUG]   Imported:  < maven.api
       |        [DEBUG] Populating class realm plugin>org.apache.maven.plugins:maven-gpg-plugin:1.7-SNAPSHOT
       |        [DEBUG]   Included: org.apache.maven.plugins:maven-gpg-plugin:jar:1.7-SNAPSHOT
       |        [DEBUG]   Included: backport-util-concurrent:backport-util-concurrent:jar:3.1
       |        [DEBUG]   Included: org.codehaus.plexus:plexus-interpolation:jar:1.11
       |        [DEBUG]   Included: junit:junit:jar:3.8.1
       |        [DEBUG]   Included: org.codehaus.plexus:plexus-utils:jar:3.1.0
       |        [DEBUG]   Included: org.sonatype.plexus:plexus-sec-dispatcher:jar:1.4
       |        [DEBUG]   Included: org.sonatype.plexus:plexus-cipher:jar:1.4
       |        [DEBUG] Configuring mojo org.apache.maven.plugins:maven-gpg-plugin:1.7-SNAPSHOT:sign
from plugin realm ClassRealm[plugin>org.apache.maven.plugins:maven-gpg-plugin:1.7-SNAPSHOT,
parent: jdk.internal.loader.ClassLoaders$AppClassLoader@6e5e91e4]
       |        [DEBUG] Configuring mojo 'org.apache.maven.plugins:maven-gpg-plugin:1.7-SNAPSHOT:sign'
with basic configurator -->
       |        [DEBUG]   (f) ascDirectory = F:\jenkins\jenkins-slave\workspace\ven-box_maven-gpg-plugin_MGPG-69@3@2\windows-jdk11-m3.5.x_build\target\it\sign-release\target\gpg
       |        [DEBUG]   (f) defaultKeyring = true
       |        [DEBUG]   (f) homedir = f:\jenkins\jenkins-slave\workspace\ven-box_maven-gpg-plugin_MGPG-69@3@2\windows-jdk11-m3.5.x_build\target\test-classes\gnupg
       |        [DEBUG]   (f) interactive = false
       |        [DEBUG]   (f) passphrase = TEST
       |        [DEBUG]   (f) passphraseServerId = gpg.passphrase
       |        [DEBUG]   (f) project = MavenProject: org.apache.maven.its.gpg.sr:test:1.0
@ F:\jenkins\jenkins-slave\workspace\ven-box_maven-gpg-plugin_MGPG-69@3@2\windows-jdk11-m3.5.x_build\target\it\sign-release\pom.xml
       |        [DEBUG]   (f) settings = org.apache.maven.execution.SettingsAdapter@7f9e8421
       |        [DEBUG]   (f) skip = false
       |        [DEBUG]   (f) useAgent = true
       |        [DEBUG] -- end configuration --
       |        [DEBUG] Generating signature for F:\jenkins\jenkins-slave\workspace\ven-box_maven-gpg-plugin_MGPG-69@3@2\windows-jdk11-m3.5.x_build\target\it\sign-release\target\test-1.0.jar
       |        gpg: starting migration from earlier GnuPG versions
       |        gpg: can't connect to the agent: Filename too long
       |        gpg: error: GnuPG agent unusable. Please check that a GnuPG agent can be started.
       |        gpg: migration aborted
       |        gpg: can't connect to the agent: Filename too long
       |        gpg: can't connect to the agent: Filename too long
       |        gpg: keydb_search failed: No agent running
       |        gpg: no default secret key: No agent running
       |        gpg: signing failed: No agent running
       |        [INFO] ------------------------------------------------------------------------
       |        [INFO] BUILD FAILURE
       |        [INFO] ------------------------------------------------------------------------
       |        [INFO] Total time: 21.381 s
       |        [INFO] Finished at: 2019-04-01T10:50:16-07:00
       |        [INFO] Final Memory: 11M/40M
       |        [INFO] ------------------------------------------------------------------------
       |        [ERROR] Failed to execute goal org.apache.maven.plugins:maven-gpg-plugin:1.7-SNAPSHOT:sign
(sign-artifacts) on project test: Exit code: 2 -> [Help 1]
       |        org.apache.maven.lifecycle.LifecycleExecutionException: Failed to execute
goal org.apache.maven.plugins:maven-gpg-plugin:1.7-SNAPSHOT:sign (sign-artifacts) on project
test: Exit code: 2
       |            at org.apache.maven.lifecycle.internal.MojoExecutor.execute (MojoExecutor.java:213)
       |            at org.apache.maven.lifecycle.internal.MojoExecutor.execute (MojoExecutor.java:154)
       |            at org.apache.maven.lifecycle.internal.MojoExecutor.execute (MojoExecutor.java:146)
       |            at org.apache.maven.lifecycle.internal.LifecycleModuleBuilder.buildProject
(LifecycleModuleBuilder.java:117)
       |            at org.apache.maven.lifecycle.internal.LifecycleModuleBuilder.buildProject
(LifecycleModuleBuilder.java:81)
       |            at org.apache.maven.lifecycle.internal.builder.singlethreaded.SingleThreadedBuilder.build
(SingleThreadedBuilder.java:51)
       |            at org.apache.maven.lifecycle.internal.LifecycleStarter.execute (LifecycleStarter.java:128)
       |            at org.apache.maven.DefaultMaven.doExecute (DefaultMaven.java:309)
       |            at org.apache.maven.DefaultMaven.doExecute (DefaultMaven.java:194)
       |            at org.apache.maven.DefaultMaven.execute (DefaultMaven.java:107)
       |            at org.apache.maven.cli.MavenCli.execute (MavenCli.java:955)
       |            at org.apache.maven.cli.MavenCli.doMain (MavenCli.java:290)
       |            at org.apache.maven.cli.MavenCli.main (MavenCli.java:194)
       |            at jdk.internal.reflect.NativeMethodAccessorImpl.invoke0 (Native Method)
       |            at jdk.internal.reflect.NativeMethodAccessorImpl.invoke (NativeMethodAccessorImpl.java:62)
       |            at jdk.internal.reflect.DelegatingMethodAccessorImpl.invoke (DelegatingMethodAccessorImpl.java:43)
       |            at java.lang.reflect.Method.invoke (Method.java:566)
       |            at org.codehaus.plexus.classworlds.launcher.Launcher.launchEnhanced (Launcher.java:289)
       |            at org.codehaus.plexus.classworlds.launcher.Launcher.launch (Launcher.java:229)
       |            at org.codehaus.plexus.classworlds.launcher.Launcher.mainWithExitCode
(Launcher.java:415)
       |            at org.codehaus.plexus.classworlds.launcher.Launcher.main (Launcher.java:356)
       |        Caused by: org.apache.maven.plugin.MojoExecutionException: Exit code: 2
       |            at org.apache.maven.plugin.gpg.GpgSigner.generateSignatureForFile (GpgSigner.java:167)
       |            at org.apache.maven.plugin.gpg.AbstractGpgSigner.generateSignatureForArtifact
(AbstractGpgSigner.java:205)
       |            at org.apache.maven.plugin.gpg.GpgSignAttachedMojo.execute (GpgSignAttachedMojo.java:140)
       |            at org.apache.maven.plugin.DefaultBuildPluginManager.executeMojo (DefaultBuildPluginManager.java:134)
       |            at org.apache.maven.lifecycle.internal.MojoExecutor.execute (MojoExecutor.java:208)
       |            at org.apache.maven.lifecycle.internal.MojoExecutor.execute (MojoExecutor.java:154)
       |            at org.apache.maven.lifecycle.internal.MojoExecutor.execute (MojoExecutor.java:146)
       |            at org.apache.maven.lifecycle.internal.LifecycleModuleBuilder.buildProject
(LifecycleModuleBuilder.java:117)
       |            at org.apache.maven.lifecycle.internal.LifecycleModuleBuilder.buildProject
(LifecycleModuleBuilder.java:81)
       |            at org.apache.maven.lifecycle.internal.builder.singlethreaded.SingleThreadedBuilder.build
(SingleThreadedBuilder.java:51)
       |            at org.apache.maven.lifecycle.internal.LifecycleStarter.execute (LifecycleStarter.java:128)
       |            at org.apache.maven.DefaultMaven.doExecute (DefaultMaven.java:309)
       |            at org.apache.maven.DefaultMaven.doExecute (DefaultMaven.java:194)
       |            at org.apache.maven.DefaultMaven.execute (DefaultMaven.java:107)
       |            at org.apache.maven.cli.MavenCli.execute (MavenCli.java:955)
       |            at org.apache.maven.cli.MavenCli.doMain (MavenCli.java:290)
       |            at org.apache.maven.cli.MavenCli.main (MavenCli.java:194)
       |            at jdk.internal.reflect.NativeMethodAccessorImpl.invoke0 (Native Method)
       |            at jdk.internal.reflect.NativeMethodAccessorImpl.invoke (NativeMethodAccessorImpl.java:62)
       |            at jdk.internal.reflect.DelegatingMethodAccessorImpl.invoke (DelegatingMethodAccessorImpl.java:43)
       |            at java.lang.reflect.Method.invoke (Method.java:566)
       |            at org.codehaus.plexus.classworlds.launcher.Launcher.launchEnhanced (Launcher.java:289)
       |            at org.codehaus.plexus.classworlds.launcher.Launcher.launch (Launcher.java:229)
       |            at org.codehaus.plexus.classworlds.launcher.Launcher.mainWithExitCode
(Launcher.java:415)
       |            at org.codehaus.plexus.classworlds.launcher.Launcher.main (Launcher.java:356)
       |        [ERROR] 
       |        [ERROR] 
       |        [ERROR] For more information about the errors and possible solutions, please
read the following articles:
       |        [ERROR] [Help 1] http://cwiki.apache.org/confluence/display/MAVEN/MojoExecutionException
       |        Running post-build script: f:\jenkins\jenkins-slave\workspace\ven-box_maven-gpg-plugin_MGPG-69@3@2\windows-jdk11-m3.5.x_build\target\it\sign-release\verify.groovy
       f:\jenkins\jenkins-slave\workspace\ven-box_maven-gpg-plugin_MGPG-69@3@2\windows-jdk11-m3.5.x_build\target\it\sign-release\build.log
[INFO] Building: sign-with-passphase-from-maven-settings\pom.xml
[INFO] run post-build script verify.bsh
[INFO]           sign-with-passphase-from-maven-settings\pom.xml .. FAILED (22.9 s)
[INFO]   The post-build script did not succeed. Missing file f:\jenkins\jenkins-slave\workspace\ven-box_maven-gpg-plugin_MGPG-69@3@2\windows-jdk11-m3.5.x_build\target\local-repo\org\apache\maven\its\gpg\nma\test\1.0\test-1.0.pom
[INFO] 
[INFO] --- maven-checkstyle-plugin:3.0.0:check (checkstyle-check) @ maven-gpg-plugin ---
[INFO] There is 1 error reported by Checkstyle 6.18 with config/maven_checks.xml ruleset.
[INFO] Ignored 1 error, 0 violation remaining.
[INFO] 
[INFO] --- maven-invoker-plugin:3.1.0:verify (integration-test) @ maven-gpg-plugin ---
[INFO] -------------------------------------------------
[INFO] Build Summary:
[INFO]   Passed: 0, Failed: 9, Errors: 0, Skipped: 0
[INFO] -------------------------------------------------
[ERROR] The following builds failed:
[ERROR] *  alternative-secret-keyring\pom.xml
[ERROR] *  no-main-artifact\pom.xml
[ERROR] *  sign-and-deploy-file-with-extras
[ERROR] *  sign-and-deploy-file-with-pom
[ERROR] *  sign-and-deploy-file-without-pom
[ERROR] *  sign-and-deploy-files
[ERROR] *  sign-and-deploy-not-jar-packaging
[ERROR] *  sign-release\pom.xml
[ERROR] *  sign-with-passphase-from-maven-settings\pom.xml
[INFO] -------------------------------------------------
[INFO] ------------------------------------------------------------------------
[INFO] BUILD FAILURE
[INFO] ------------------------------------------------------------------------
[INFO] Total time: 03:54 min
[INFO] Finished at: 2019-04-01T10:50:42-07:00
[INFO] Final Memory: 40M/144M
[INFO] ------------------------------------------------------------------------
[INFO] [jenkins-event-spy] Generated F:\jenkins\jenkins-slave\workspace\ven-box_maven-gpg-plugin_MGPG-69@3@2@tmp\withMaven5c3daaea\maven-spy-20190401-104647-80715503747217921211907.log
[ERROR] Failed to execute goal org.apache.maven.plugins:maven-invoker-plugin:3.1.0:verify
(integration-test) on project maven-gpg-plugin: 9 builds failed. See console output above
for details. -> [Help 1]
org.apache.maven.lifecycle.LifecycleExecutionException: Failed to execute goal org.apache.maven.plugins:maven-invoker-plugin:3.1.0:verify
(integration-test) on project maven-gpg-plugin: 9 builds failed. See console output above
for details.
    at org.apache.maven.lifecycle.internal.MojoExecutor.execute (MojoExecutor.java:213)
    at org.apache.maven.lifecycle.internal.MojoExecutor.execute (MojoExecutor.java:154)
    at org.apache.maven.lifecycle.internal.MojoExecutor.execute (MojoExecutor.java:146)
    at org.apache.maven.lifecycle.internal.LifecycleModuleBuilder.buildProject (LifecycleModuleBuilder.java:117)
    at org.apache.maven.lifecycle.internal.LifecycleModuleBuilder.buildProject (LifecycleModuleBuilder.java:81)
    at org.apache.maven.lifecycle.internal.builder.singlethreaded.SingleThreadedBuilder.build
(SingleThreadedBuilder.java:51)
    at org.apache.maven.lifecycle.internal.LifecycleStarter.execute (LifecycleStarter.java:128)
    at org.apache.maven.DefaultMaven.doExecute (DefaultMaven.java:309)
    at org.apache.maven.DefaultMaven.doExecute (DefaultMaven.java:194)
    at org.apache.maven.DefaultMaven.execute (DefaultMaven.java:107)
    at org.apache.maven.cli.MavenCli.execute (MavenCli.java:955)
    at org.apache.maven.cli.MavenCli.doMain (MavenCli.java:290)
    at org.apache.maven.cli.MavenCli.main (MavenCli.java:194)
    at jdk.internal.reflect.NativeMethodAccessorImpl.invoke0 (Native Method)
    at jdk.internal.reflect.NativeMethodAccessorImpl.invoke (NativeMethodAccessorImpl.java:62)
    at jdk.internal.reflect.DelegatingMethodAccessorImpl.invoke (DelegatingMethodAccessorImpl.java:43)
    at java.lang.reflect.Method.invoke (Method.java:566)
    at org.codehaus.plexus.classworlds.launcher.Launcher.launchEnhanced (Launcher.java:289)
    at org.codehaus.plexus.classworlds.launcher.Launcher.launch (Launcher.java:229)
    at org.codehaus.plexus.classworlds.launcher.Launcher.mainWithExitCode (Launcher.java:415)
    at org.codehaus.plexus.classworlds.launcher.Launcher.main (Launcher.java:356)
Caused by: org.apache.maven.plugin.MojoFailureException: 9 builds failed. See console output
above for details.
    at org.apache.maven.plugins.invoker.InvokerSession.handleFailures (InvokerSession.java:260)
    at org.apache.maven.plugins.invoker.VerifyMojo.execute (VerifyMojo.java:137)
    at org.apache.maven.plugin.DefaultBuildPluginManager.executeMojo (DefaultBuildPluginManager.java:134)
    at org.apache.maven.lifecycle.internal.MojoExecutor.execute (MojoExecutor.java:208)
    at org.apache.maven.lifecycle.internal.MojoExecutor.execute (MojoExecutor.java:154)
    at org.apache.maven.lifecycle.internal.MojoExecutor.execute (MojoExecutor.java:146)
    at org.apache.maven.lifecycle.internal.LifecycleModuleBuilder.buildProject (LifecycleModuleBuilder.java:117)
    at org.apache.maven.lifecycle.internal.LifecycleModuleBuilder.buildProject (LifecycleModuleBuilder.java:81)
    at org.apache.maven.lifecycle.internal.builder.singlethreaded.SingleThreadedBuilder.build
(SingleThreadedBuilder.java:51)
    at org.apache.maven.lifecycle.internal.LifecycleStarter.execute (LifecycleStarter.java:128)
    at org.apache.maven.DefaultMaven.doExecute (DefaultMaven.java:309)
    at org.apache.maven.DefaultMaven.doExecute (DefaultMaven.java:194)
    at org.apache.maven.DefaultMaven.execute (DefaultMaven.java:107)
    at org.apache.maven.cli.MavenCli.execute (MavenCli.java:955)
    at org.apache.maven.cli.MavenCli.doMain (MavenCli.java:290)
    at org.apache.maven.cli.MavenCli.main (MavenCli.java:194)
    at jdk.internal.reflect.NativeMethodAccessorImpl.invoke0 (Native Method)
    at jdk.internal.reflect.NativeMethodAccessorImpl.invoke (NativeMethodAccessorImpl.java:62)
    at jdk.internal.reflect.DelegatingMethodAccessorImpl.invoke (DelegatingMethodAccessorImpl.java:43)
    at java.lang.reflect.Method.invoke (Method.java:566)
    at org.codehaus.plexus.classworlds.launcher.Launcher.launchEnhanced (Launcher.java:289)
    at org.codehaus.plexus.classworlds.launcher.Launcher.launch (Launcher.java:229)
    at org.codehaus.plexus.classworlds.launcher.Launcher.mainWithExitCode (Launcher.java:415)
    at org.codehaus.plexus.classworlds.launcher.Launcher.main (Launcher.java:356)
[ERROR] 
[ERROR] Re-run Maven using the -X switch to enable full debug logging.
[ERROR] 
[ERROR] For more information about the errors and possible solutions, please read the following
articles:
[ERROR] [Help 1] http://cwiki.apache.org/confluence/display/MAVEN/MojoFailureException
[Pipeline] }
[Pipeline] // dir
[Pipeline] }
[Fast Archiver] No prior successful build to compare, so performing full copy of artifacts
[withMaven] junitPublisher - Archive test results for Maven artifact org.apache.maven.plugins:maven-gpg-plugin:maven-plugin:1.7-SNAPSHOT
generated by maven-surefire-plugin:test (default-test): windows-jdk11-m3.5.x_build\target\surefire-reports\*.xml
Recording test results
None of the test reports contained any result
[withMaven] openTasksPublisher - Scan Tasks for Maven artifact org.apache.maven.plugins:maven-gpg-plugin:maven-plugin:1.7-SNAPSHOT
in source directory windows-jdk11-m3.5.x_build\src\main\java
[TASKS] Scanning folder 'f:\jenkins\jenkins-slave\workspace\ven-box_maven-gpg-plugin_MGPG-69@3@2'
for files matching the pattern 'windows-jdk11-m3.5.x_build\src\main\java\**\*' - excludes:
null
[TASKS] Found 8 files to scan for tasks
[TASKS] Found 1 open tasks.
Skipping warnings blame since pipelines do not have an SCM link.%n
[withMaven] invokerPublisher - Archive invoker results for Maven artifact MavenArtifact{org.apache.maven.plugins:maven-gpg-plugin:maven-plugin:1.7-SNAPSHOT(version:
1.7-SNAPSHOT, snapshot:false) } generated by PluginInvocation{org.apache.maven.plugins:maven-invoker-plugin:3.1.0@integration-test
 integration-test}: windows-jdk11-m3.5.x_build\target\invoker-reports\*.xml
[withMaven] Publishers: Generated Artifacts Publisher: 19 ms, Junit Publisher: 23 ms, Open
Task Scanner Publisher: 90 ms, Invoker Publisher: 1382 ms
[Pipeline] // withMaven
[Pipeline] cleanWs
[WS-CLEANUP] Deleting project workspace...
[WS-CLEANUP] Deferred wipeout is used...
[WS-CLEANUP] done
[Pipeline] cleanWs
[WS-CLEANUP] Deleting project workspace...
[WS-CLEANUP] Deferred wipeout is used...
[WS-CLEANUP] done
[Pipeline] }
[Pipeline] // stage
[Pipeline] }
[Pipeline] // ws
[Pipeline] }
[Pipeline] // node
[Pipeline] }
Failed in branch windows-jdk11-m3.5.x_build
[Pipeline] // parallel
[Pipeline] stage
[Pipeline] { (Notifications)
[Pipeline] echo
Build result: FAILURE
[Pipeline] jiraIssueSelector
[Pipeline] emailext
Mime
  • Unnamed multipart/mixed (inline, None, 0 bytes)
View raw message