maven-notifications mailing list archives

Site index · List index
Message view « Date » · « Thread »
Top « Date » · « Thread »
From Apache Jenkins Server <jenk...@builds.apache.org>
Subject Build failed in Jenkins: Maven TLP » maven-changes-plugin » master #28
Date Wed, 02 Jan 2019 20:23:21 GMT
See https://builds.apache.org/job/maven-box/job/maven-changes-plugin/job/master/28/

Changes:

* add mavenLinkerPublisher

All tests passed

Build log:
[...truncated 4844 lines...]
  found:    java.util.List
[WARNING] /f:/jenkins/jenkins-slave/workspace/-box_maven-changes-plugin_master@2/windows-jdk11-m3.5.x_build/target/generated-sources/modello/org/apache/maven/plugins/changes/model/io/xpp3/ChangesXpp3Reader.java:[865,28]
unchecked call to add(E) as a member of the raw type java.util.List
[INFO] 
[INFO] --- maven-plugin-plugin:3.5.2:descriptor (default-descriptor) @ maven-changes-plugin
---
[INFO] Using 'UTF-8' encoding to read mojo source files.
[INFO] java-javadoc mojo extractor found 0 mojo descriptor.
[INFO] java-annotations mojo extractor found 9 mojo descriptors.
[INFO] 
[INFO] --- plexus-component-metadata:1.7.1:generate-metadata (default) @ maven-changes-plugin
---
[INFO] Discovered 1 component descriptors(s)
[INFO] 
[INFO] --- maven-resources-plugin:3.1.0:testResources (default-testResources) @ maven-changes-plugin
---
[INFO] Using 'UTF-8' encoding to copy filtered resources.
[INFO] Copying 4 resources
[INFO] Copying 3 resources
[INFO] 
[INFO] --- maven-compiler-plugin:3.7.0:testCompile (default-testCompile) @ maven-changes-plugin
---
[INFO] Changes detected - recompiling the module!
[INFO] Compiling 20 source files to f:\jenkins\jenkins-slave\workspace\-box_maven-changes-plugin_master@2\windows-jdk11-m3.5.x_build\target\test-classes
[INFO] 
[INFO] --- maven-surefire-plugin:2.22.0:test (default-test) @ maven-changes-plugin ---
[INFO] Surefire report directory: f:\jenkins\jenkins-slave\workspace\-box_maven-changes-plugin_master@2\windows-jdk11-m3.5.x_build\target\surefire-reports
[INFO] 
[INFO] -------------------------------------------------------
[INFO]  T E S T S
[INFO] -------------------------------------------------------
[INFO] Running org.apache.maven.plugins.announcement.AnnouncementMojoTest
[INFO] Including issues from file f:\jenkins\jenkins-slave\workspace\-box_maven-changes-plugin_master@2\windows-jdk11-m3.5.x_build\src\test\unit\announce-changes.xml
in announcement...
[debug] Found 2 releases.
[WARNING] File encoding has not been set, using platform encoding Cp1252, i.e. build is platform
dependent!
[INFO] Created template f:\jenkins\jenkins-slave\workspace\-box_maven-changes-plugin_master@2\windows-jdk11-m3.5.x_build\target\test\announcement.vm
[INFO] Tests run: 1, Failures: 0, Errors: 0, Skipped: 0, Time elapsed: 2.987 s - in org.apache.maven.plugins.announcement.AnnouncementMojoTest
[INFO] Running org.apache.maven.plugins.changes.ActionTest
[INFO] Tests run: 6, Failures: 0, Errors: 0, Skipped: 0, Time elapsed: 0 s - in org.apache.maven.plugins.changes.ActionTest
[INFO] Running org.apache.maven.plugins.changes.ChangesCheckMojoTestCase
[WARNING] Tests run: 3, Failures: 0, Errors: 0, Skipped: 1, Time elapsed: 0.428 s - in org.apache.maven.plugins.changes.ChangesCheckMojoTestCase
[INFO] Running org.apache.maven.plugins.changes.ChangesValidatorMojoTest
[WARNING] failed to validate changes.xml file f:\jenkins\jenkins-slave\workspace\-box_maven-changes-plugin_master@2\windows-jdk11-m3.5.x_build\src\test\unit\non-valid-changes.xml
[WARNING] validation errors: 
[WARNING] cvc-complex-type.2.4.a: Invalid content was found starting with element 'atitle'.
One of '{"http://maven.apache.org/changes/1.0.0":title, "http://maven.apache.org/changes/1.0.0":author}'
is expected.
[INFO]  skip previous validation errors due to failOnError=false.
[INFO] Tests run: 3, Failures: 0, Errors: 0, Skipped: 0, Time elapsed: 0.874 s - in org.apache.maven.plugins.changes.ChangesValidatorMojoTest
[INFO] Running org.apache.maven.plugins.changes.ChangesXMLTest
[ERROR] entity reference names can not start with character ' ' (position: START_TAG seen
...<action dev="me" type="add">\r\n                This is my first & ... @25:36)

org.codehaus.plexus.util.xml.pull.XmlPullParserException: entity reference names can not start
with character ' ' (position: START_TAG seen ...<action dev="me" type="add">\r\n   
            This is my first & ... @25:36) 
	at org.codehaus.plexus.util.xml.pull.MXParser.parseEntityRef(MXParser.java:2267)
	at org.codehaus.plexus.util.xml.pull.MXParser.nextImpl(MXParser.java:1313)
	at org.codehaus.plexus.util.xml.pull.MXParser.next(MXParser.java:1131)
	at org.apache.maven.plugins.changes.model.io.xpp3.ChangesXpp3Reader.parseAction(ChangesXpp3Reader.java:477)
	at org.apache.maven.plugins.changes.model.io.xpp3.ChangesXpp3Reader.parseRelease(ChangesXpp3Reader.java:865)
	at org.apache.maven.plugins.changes.model.io.xpp3.ChangesXpp3Reader.parseBody(ChangesXpp3Reader.java:588)
	at org.apache.maven.plugins.changes.model.io.xpp3.ChangesXpp3Reader.parseChangesDocument(ChangesXpp3Reader.java:641)
	at org.apache.maven.plugins.changes.model.io.xpp3.ChangesXpp3Reader.read(ChangesXpp3Reader.java:1167)
	at org.apache.maven.plugins.changes.model.io.xpp3.ChangesXpp3Reader.read(ChangesXpp3Reader.java:1198)
	at org.apache.maven.plugins.changes.ChangesXML.<init>(ChangesXML.java:102)
	at org.apache.maven.plugins.changes.ChangesXMLTest.testParseInvalidChangesFile(ChangesXMLTest.java:164)
	at java.base/jdk.internal.reflect.NativeMethodAccessorImpl.invoke0(Native Method)
	at java.base/jdk.internal.reflect.NativeMethodAccessorImpl.invoke(NativeMethodAccessorImpl.java:62)
	at java.base/jdk.internal.reflect.DelegatingMethodAccessorImpl.invoke(DelegatingMethodAccessorImpl.java:43)
	at java.base/java.lang.reflect.Method.invoke(Method.java:566)
	at junit.framework.TestCase.runTest(TestCase.java:176)
	at junit.framework.TestCase.runBare(TestCase.java:141)
	at junit.framework.TestResult$1.protect(TestResult.java:122)
	at junit.framework.TestResult.runProtected(TestResult.java:142)
	at junit.framework.TestResult.run(TestResult.java:125)
	at junit.framework.TestCase.run(TestCase.java:129)
	at junit.framework.TestSuite.runTest(TestSuite.java:252)
	at junit.framework.TestSuite.run(TestSuite.java:247)
	at org.junit.internal.runners.JUnit38ClassRunner.run(JUnit38ClassRunner.java:86)
	at org.apache.maven.surefire.junit4.JUnit4Provider.execute(JUnit4Provider.java:365)
	at org.apache.maven.surefire.junit4.JUnit4Provider.executeWithRerun(JUnit4Provider.java:273)
	at org.apache.maven.surefire.junit4.JUnit4Provider.executeTestSet(JUnit4Provider.java:238)
	at org.apache.maven.surefire.junit4.JUnit4Provider.invoke(JUnit4Provider.java:159)
	at org.apache.maven.surefire.booter.ForkedBooter.invokeProviderInSameClassLoader(ForkedBooter.java:383)
	at org.apache.maven.surefire.booter.ForkedBooter.runSuitesInProcess(ForkedBooter.java:344)
	at org.apache.maven.surefire.booter.ForkedBooter.execute(ForkedBooter.java:125)
	at org.apache.maven.surefire.booter.ForkedBooter.main(ForkedBooter.java:417)
[INFO] Tests run: 2, Failures: 0, Errors: 0, Skipped: 0, Time elapsed: 0.032 s - in org.apache.maven.plugins.changes.ChangesXMLTest
[INFO] Running org.apache.maven.plugins.changes.FeedGeneratorTest
[INFO] Tests run: 2, Failures: 0, Errors: 0, Skipped: 0, Time elapsed: 0.218 s - in org.apache.maven.plugins.changes.FeedGeneratorTest
[INFO] Running org.apache.maven.plugins.changes.IssueAdapterTest
[INFO] Tests run: 3, Failures: 0, Errors: 0, Skipped: 0, Time elapsed: 0 s - in org.apache.maven.plugins.changes.IssueAdapterTest
[INFO] Running org.apache.maven.plugins.changes.ReleaseTest
[INFO] Tests run: 3, Failures: 0, Errors: 0, Skipped: 0, Time elapsed: 0 s - in org.apache.maven.plugins.changes.ReleaseTest
[INFO] Running org.apache.maven.plugins.changes.ReleaseUtilsTestCase
[INFO] Tests run: 1, Failures: 0, Errors: 0, Skipped: 0, Time elapsed: 0 s - in org.apache.maven.plugins.changes.ReleaseUtilsTestCase
[INFO] Running org.apache.maven.plugins.github.GitHubDownloaderTestCase
[INFO] Tests run: 3, Failures: 0, Errors: 0, Skipped: 0, Time elapsed: 0.35 s - in org.apache.maven.plugins.github.GitHubDownloaderTestCase
[INFO] Running org.apache.maven.plugins.issues.IssueManagementSystemTest
[INFO] Tests run: 2, Failures: 0, Errors: 0, Skipped: 0, Time elapsed: 0.001 s - in org.apache.maven.plugins.issues.IssueManagementSystemTest
[INFO] Running org.apache.maven.plugins.issues.IssueTestCase
[INFO] Tests run: 5, Failures: 0, Errors: 0, Skipped: 0, Time elapsed: 0.001 s - in org.apache.maven.plugins.issues.IssueTestCase
[INFO] Running org.apache.maven.plugins.issues.IssueUtilsTestCase
[INFO] Tests run: 1, Failures: 0, Errors: 0, Skipped: 0, Time elapsed: 0 s - in org.apache.maven.plugins.issues.IssueUtilsTestCase
[INFO] Running org.apache.maven.plugins.jira.JiraHelperTestCase
[INFO] Tests run: 3, Failures: 0, Errors: 0, Skipped: 0, Time elapsed: 0 s - in org.apache.maven.plugins.jira.JiraHelperTestCase
[INFO] Running org.apache.maven.plugins.jira.JiraMojoTest
[INFO] Tests run: 1, Failures: 0, Errors: 0, Skipped: 0, Time elapsed: 0.114 s - in org.apache.maven.plugins.jira.JiraMojoTest
[INFO] Running org.apache.maven.plugins.jira.JiraUnicodeTestCase
[INFO] The JIRA version is '3.13.2'
[INFO] Tests run: 1, Failures: 0, Errors: 0, Skipped: 0, Time elapsed: 1.087 s - in org.apache.maven.plugins.jira.JiraUnicodeTestCase
[INFO] Running org.apache.maven.plugins.jira.JqlQueryBuilderTestCase
[debug] Encoding JQL query project = DOXIA ORDER BY key ASC, assignee DESC, reporter ASC
[debug] Encoded JQL query project+%3D+DOXIA+ORDER+BY+key+ASC%2C+assignee+DESC%2C+reporter+ASC
[debug] Encoding JQL query project = DOXIA ORDER BY key ASC
[debug] Encoded JQL query project+%3D+DOXIA+ORDER+BY+key+ASC
[debug] Encoding JQL query project = DOXIA ORDER BY key ASC
[debug] Encoded JQL query project+%3D+DOXIA+ORDER+BY+key+ASC
[debug] Encoding JQL query project = DOXIA ORDER BY key ASC
[debug] Encoded JQL query project+%3D+DOXIA+ORDER+BY+key+ASC
[debug] Encoding JQL query 
[debug] Encoded JQL query 
[debug] Encoding JQL query project = DOXIA
[debug] Encoded JQL query project+%3D+DOXIA
[debug] Encoding JQL query project = DOXIA ORDER BY key ASC, assignee DESC, reporter ASC
[debug] Encoded JQL query project+%3D+DOXIA+ORDER+BY+key+ASC%2C+assignee+DESC%2C+reporter+ASC
[debug] Encoding JQL query status in ("In Progress")
[debug] Encoded JQL query status+in+%28%22In+Progress%22%29
[debug] Encoding JQL query fixVersion = "1.0"
[debug] Encoded JQL query fixVersion+%3D+%221.0%22
[debug] Encoding JQL query project = DOXIA ORDER BY key DESC
[debug] Encoded JQL query project+%3D+DOXIA+ORDER+BY+key+DESC
[debug] Encoding JQL query project = DOXIA ORDER BY key DESC
[debug] Encoded JQL query project+%3D+DOXIA+ORDER+BY+key+DESC
[debug] Encoding JQL query priority in (Blocker)
[debug] Encoded JQL query priority+in+%28Blocker%29
[debug] Encoding JQL query priority in (Blocker)
[debug] Encoded JQL query priority+in+%28Blocker%29
[debug] Encoding JQL query priority in (Blocker, Critical, Major)
[debug] Encoded JQL query priority+in+%28Blocker%2C+Critical%2C+Major%29
[debug] Encoding JQL query priority in (Blocker, Critical, Major)
[debug] Encoded JQL query priority+in+%28Blocker%2C+Critical%2C+Major%29
[debug] Encoding JQL query priority in (Blocker) AND status in (Resolved)
[debug] Encoded JQL query priority+in+%28Blocker%29+AND+status+in+%28Resolved%29
[debug] Encoding JQL query project = DOXIA AND fixVersion = "1.0"
[debug] Encoded JQL query project+%3D+DOXIA+AND+fixVersion+%3D+%221.0%22
[INFO] Tests run: 12, Failures: 0, Errors: 0, Skipped: 0, Time elapsed: 0.011 s - in org.apache.maven.plugins.jira.JqlQueryBuilderTestCase
[INFO] Running org.apache.maven.plugins.jira.UrlBuilderTestCase
[INFO] Tests run: 4, Failures: 0, Errors: 0, Skipped: 0, Time elapsed: 0 s - in org.apache.maven.plugins.jira.UrlBuilderTestCase
[INFO] 
[INFO] Results:
[INFO] 
[WARNING] Tests run: 56, Failures: 0, Errors: 0, Skipped: 1
[INFO] 
[INFO] 
[INFO] --- maven-jar-plugin:3.1.0:jar (default-jar) @ maven-changes-plugin ---
[INFO] Building jar: f:\jenkins\jenkins-slave\workspace\-box_maven-changes-plugin_master@2\windows-jdk11-m3.5.x_build\target\maven-changes-plugin-3.0.0-SNAPSHOT.jar
[INFO] 
[INFO] --- maven-plugin-plugin:3.5.2:addPluginArtifactMetadata (default-addPluginArtifactMetadata)
@ maven-changes-plugin ---
[INFO] 
[INFO] --- maven-site-plugin:3.7.1:attach-descriptor (attach-descriptor) @ maven-changes-plugin
---
[INFO] Skipping because packaging 'maven-plugin' is not pom.
[INFO] 
[INFO] --- maven-invoker-plugin:3.1.0:install (integration-test) @ maven-changes-plugin ---
[INFO] Installing f:\jenkins\jenkins-slave\workspace\-box_maven-changes-plugin_master@2\windows-jdk11-m3.5.x_build\pom.xml
to f:\jenkins\jenkins-slave\workspace\-box_maven-changes-plugin_master@2\windows-jdk11-m3.5.x_build\target\local-repo\org\apache\maven\plugins\maven-changes-plugin\3.0.0-SNAPSHOT\maven-changes-plugin-3.0.0-SNAPSHOT.pom
[INFO] Installing f:\jenkins\jenkins-slave\workspace\-box_maven-changes-plugin_master@2\windows-jdk11-m3.5.x_build\target\maven-changes-plugin-3.0.0-SNAPSHOT.jar
to f:\jenkins\jenkins-slave\workspace\-box_maven-changes-plugin_master@2\windows-jdk11-m3.5.x_build\target\local-repo\org\apache\maven\plugins\maven-changes-plugin\3.0.0-SNAPSHOT\maven-changes-plugin-3.0.0-SNAPSHOT.jar
[INFO] 
[INFO] --- maven-invoker-plugin:3.1.0:integration-test (integration-test) @ maven-changes-plugin
---
[INFO] Building: announce-generate\pom.xml
[INFO] run post-build script verify.groovy
WARNING: An illegal reflective access operation has occurred
WARNING: Illegal reflective access by org.codehaus.groovy.reflection.CachedClass (file:/f:/jenkins/jenkins-slave/workspace/.maven_repositories/null/org/codehaus/groovy/groovy-all/2.4.8/groovy-all-2.4.8.jar)
to method java.lang.Object.finalize()
WARNING: Please consider reporting this to the maintainers of org.codehaus.groovy.reflection.CachedClass
WARNING: Use --illegal-access=warn to enable warnings of further illegal reflective access
operations
WARNING: All illegal access operations will be denied in a future release
[INFO]           announce-generate\pom.xml ........................ SUCCESS (10.4 s)
[INFO] Building: announce-generate-inconsistent-issue-management\pom.xml
[INFO]           announce-generate-inconsistent-issue-management\pom.xml SUCCESS (5.9 s)
[INFO] Building: announce-generate-no-issue-management\pom.xml
[INFO]           announce-generate-no-issue-management\pom.xml .... SUCCESS (6.3 s)
[INFO] Building: announce-generate-no-url\pom.xml
[INFO]           announce-generate-no-url\pom.xml ................. SUCCESS (5.3 s)
[INFO] Building: announcement-generate-custom-template\pom.xml
[INFO] run post-build script verify.bsh
[INFO]           announcement-generate-custom-template\pom.xml .... SUCCESS (7.2 s)
[INFO] Building: report-aggregated-changes-generation\pom.xml
[INFO] run post-build script verify.groovy
[INFO]           report-aggregated-changes-generation\pom.xml ..... SUCCESS (15.0 s)
[INFO] Building: report-changes-generation\pom.xml
[INFO] run post-build script verify.bsh
[INFO]           report-changes-generation\pom.xml ................ SUCCESS (10.6 s)
[INFO] Building: report-changes-interpolation\pom.xml
[INFO] run post-build script verify.bsh
[INFO]           report-changes-interpolation\pom.xml ............. SUCCESS (9.9 s)
[INFO] Building: report-changes-nofile\pom.xml
[INFO]           report-changes-nofile\pom.xml .................... SUCCESS (7.9 s)
[INFO] Building: report-changes-skip-snapshots\pom.xml
[INFO] run post-build script verify.groovy
[INFO]           report-changes-skip-snapshots\pom.xml ............ SUCCESS (8.3 s)
[INFO] Building: report-changes-system\pom.xml
[INFO] run post-build script verify.bsh
[INFO]           report-changes-system\pom.xml .................... SUCCESS (10.6 s)
[INFO] Building: report-changes-system-noissuemanagement\pom.xml
[INFO] run post-build script verify.bsh
[INFO]           report-changes-system-noissuemanagement\pom.xml .. SUCCESS (11.0 s)
[INFO] Building: report-jira-invalid-issuemanagement\pom.xml
[INFO] run post-build script verify.groovy
[INFO]           report-jira-invalid-issuemanagement\pom.xml ...... SUCCESS (7.9 s)
[INFO] 
[INFO] --- maven-checkstyle-plugin:3.0.0:check (checkstyle-check) @ maven-changes-plugin ---
[INFO] 
[INFO] --- maven-invoker-plugin:3.1.0:verify (integration-test) @ maven-changes-plugin ---
[INFO] -------------------------------------------------
[INFO] Build Summary:
[INFO]   Passed: 13, Failed: 0, Errors: 0, Skipped: 0
[INFO] -------------------------------------------------
[INFO] ------------------------------------------------------------------------
[INFO] BUILD SUCCESS
[INFO] ------------------------------------------------------------------------
[INFO] Total time: 02:45 min
[INFO] Finished at: 2019-01-02T20:23:07Z
[INFO] Final Memory: 50M/174M
[INFO] ------------------------------------------------------------------------
[INFO] [jenkins-event-spy] Generated F:\jenkins\jenkins-slave\workspace\-box_maven-changes-plugin_master@2@tmp\withMavenf35d5062\maven-spy-20190102-202021-5456637868990807270698.log
[Pipeline] }
[Pipeline] // dir
[Pipeline] }
[withMaven] artifactsPublisher - Archive artifact windows-jdk11-m3.5.x_build\pom.xml under
org\apache\maven\plugins\maven-changes-plugin\3.0.0-SNAPSHOT\maven-changes-plugin-3.0.0-SNAPSHOT.pom
[withMaven] artifactsPublisher - Archive artifact windows-jdk11-m3.5.x_build\target\maven-changes-plugin-3.0.0-SNAPSHOT.jar
under org\apache\maven\plugins\maven-changes-plugin\3.0.0-SNAPSHOT\maven-changes-plugin-3.0.0-SNAPSHOT.jar
[withMaven] junitPublisher - Archive test results for Maven artifact org.apache.maven.plugins:maven-changes-plugin:maven-plugin:3.0.0-SNAPSHOT
generated by maven-surefire-plugin:test (default-test): windows-jdk11-m3.5.x_build\target\surefire-reports\*.xml
Recording test results
[withMaven] openTasksPublisher - Scan Tasks for Maven artifact org.apache.maven.plugins:maven-changes-plugin:maven-plugin:3.0.0-SNAPSHOT
in source directory windows-jdk11-m3.5.x_build\src\main\java
[TASKS] Scanning folder 'f:\jenkins\jenkins-slave\workspace\-box_maven-changes-plugin_master@2'
for files matching the pattern 'windows-jdk11-m3.5.x_build\src\main\java\**\*' - excludes:
null
[TASKS] Found 48 files to scan for tasks
[TASKS] Found 4 open tasks.
Skipping warnings blame since pipelines do not have an SCM link.%n
[TASKS] Computing warning deltas based on reference build #26
[withMaven] invokerPublisher - Archive invoker results for Maven artifact MavenArtifact{org.apache.maven.plugins:maven-changes-plugin:maven-plugin:3.0.0-SNAPSHOT(version:
3.0.0-SNAPSHOT, snapshot:false) } generated by PluginInvocation{org.apache.maven.plugins:maven-invoker-plugin:3.1.0@integration-test
 integration-test}: windows-jdk11-m3.5.x_build\target\invoker-reports\*.xml
[withMaven] Publishers: Generated Artifacts Publisher: 1083 ms, Junit Publisher: 4994 ms,
Open Task Scanner Publisher: 1297 ms, Dependencies Fingerprint Publisher: 1 ms, Invoker Publisher:
2899 ms, Pipeline Graph Publisher: 2 ms
[Pipeline] // withMaven
[Pipeline] cleanWs
[WS-CLEANUP] Deleting project workspace...
[WS-CLEANUP] Deferred wipeout is used...
ERROR: Cannot delete workspace :f:\jenkins\jenkins-slave\workspace\-box_maven-changes-plugin_master@2\windows-jdk11-m3.5.x_build\target\invoker-reports\BUILD-announce-generate-inconsistent-issue-management.xml
[Pipeline] }
[Pipeline] // stage
[Pipeline] }
[Pipeline] // ws
[Pipeline] }
[Pipeline] // node
[Pipeline] }
Failed in branch windows-jdk11-m3.5.x_build
[Pipeline] // parallel
[Pipeline] stage
[Pipeline] { (Notifications)
[Pipeline] echo
Build result: FAILURE
[Pipeline] jiraIssueSelector
[Pipeline] emailext
Mime
  • Unnamed multipart/mixed (inline, None, 0 bytes)
View raw message