maven-notifications mailing list archives

Site index · List index
Message view « Date » · « Thread »
Top « Date » · « Thread »
From Apache Jenkins Server <jenk...@builds.apache.org>
Subject Build failed in Jenkins: Maven TLP » maven-jdeps-plugin » MNGSITE-332 #17
Date Wed, 02 Jan 2019 08:53:47 GMT
See https://builds.apache.org/job/maven-box/job/maven-jdeps-plugin/job/MNGSITE-332/17/

Changes:

* add mavenLinkerPublisher

All tests passed

Build log:
[...truncated 9062 lines...]
[Pipeline] // dir
[Pipeline] }
[INFO] Downloaded from central: https://repo.maven.apache.org/maven2/com/google/guava/guava/19.0/guava-19.0.pom
(6.8 kB at 617 kB/s)
[INFO] Downloading from central: https://repo.maven.apache.org/maven2/com/google/guava/guava-parent/19.0/guava-parent-19.0.pom
[INFO] Downloaded from central: https://repo.maven.apache.org/maven2/com/google/guava/guava-parent/19.0/guava-parent-19.0.pom
(9.9 kB at 898 kB/s)
[INFO] Downloading from central: https://repo.maven.apache.org/maven2/org/sonatype/oss/oss-parent/7/oss-parent-7.pom
[INFO] Downloaded from central: https://repo.maven.apache.org/maven2/org/sonatype/oss/oss-parent/7/oss-parent-7.pom
(4.8 kB at 439 kB/s)
[INFO] Downloading from central: https://repo.maven.apache.org/maven2/org/apache/maven/shared/maven-shared-resources/2/maven-shared-resources-2.jar
[INFO] Downloading from central: https://repo.maven.apache.org/maven2/commons-digester/commons-digester/1.6/commons-digester-1.6.jar
[INFO] Downloading from central: https://repo.maven.apache.org/maven2/org/apache/maven/doxia/doxia-core/1.2/doxia-core-1.2.jar
[INFO] Downloading from central: https://repo.maven.apache.org/maven2/org/apache/maven/doxia/doxia-integration-tools/1.6/doxia-integration-tools-1.6.jar
[INFO] Downloading from central: https://repo.maven.apache.org/maven2/commons-logging/commons-logging/1.0.4/commons-logging-1.0.4.jar
[INFO] Downloaded from central: https://repo.maven.apache.org/maven2/org/apache/maven/shared/maven-shared-resources/2/maven-shared-resources-2.jar
(13 kB at 1.0 MB/s)
[INFO] Downloading from central: https://repo.maven.apache.org/maven2/commons-io/commons-io/1.4/commons-io-1.4.jar
[INFO] Downloaded from central: https://repo.maven.apache.org/maven2/org/apache/maven/doxia/doxia-integration-tools/1.6/doxia-integration-tools-1.6.jar
(45 kB at 2.5 MB/s)
[INFO] Downloading from central: https://repo.maven.apache.org/maven2/org/codehaus/plexus/plexus-resources/1.1.0/plexus-resources-1.1.0.jar
[INFO] Downloaded from central: https://repo.maven.apache.org/maven2/commons-logging/commons-logging/1.0.4/commons-logging-1.0.4.jar
(38 kB at 2.1 MB/s)
[INFO] Downloading from central: https://repo.maven.apache.org/maven2/com/puppycrawl/tools/checkstyle/6.18/checkstyle-6.18.jar
[INFO] Downloaded from central: https://repo.maven.apache.org/maven2/org/apache/maven/doxia/doxia-core/1.2/doxia-core-1.2.jar
(154 kB at 7.3 MB/s)
[INFO] Downloading from central: https://repo.maven.apache.org/maven2/antlr/antlr/2.7.7/antlr-2.7.7.jar
[INFO] Downloaded from central: https://repo.maven.apache.org/maven2/commons-digester/commons-digester/1.6/commons-digester-1.6.jar
(168 kB at 7.7 MB/s)
[INFO] Downloading from central: https://repo.maven.apache.org/maven2/org/antlr/antlr4-runtime/4.5.3/antlr4-runtime-4.5.3.jar
[INFO] Downloaded from central: https://repo.maven.apache.org/maven2/commons-io/commons-io/1.4/commons-io-1.4.jar
(109 kB at 3.5 MB/s)
[INFO] Downloading from central: https://repo.maven.apache.org/maven2/commons-beanutils/commons-beanutils/1.9.2/commons-beanutils-1.9.2.jar
[INFO] Downloaded from central: https://repo.maven.apache.org/maven2/org/codehaus/plexus/plexus-resources/1.1.0/plexus-resources-1.1.0.jar
(23 kB at 725 kB/s)
[INFO] Downloading from central: https://repo.maven.apache.org/maven2/commons-cli/commons-cli/1.3.1/commons-cli-1.3.1.jar
[INFO] Downloaded from central: https://repo.maven.apache.org/maven2/commons-cli/commons-cli/1.3.1/commons-cli-1.3.1.jar
(53 kB at 1.2 MB/s)
[INFO] Downloading from central: https://repo.maven.apache.org/maven2/com/google/guava/guava/19.0/guava-19.0.jar
[INFO] Downloaded from central: https://repo.maven.apache.org/maven2/org/antlr/antlr4-runtime/4.5.3/antlr4-runtime-4.5.3.jar
(302 kB at 5.9 MB/s)
[INFO] Downloaded from central: https://repo.maven.apache.org/maven2/antlr/antlr/2.7.7/antlr-2.7.7.jar
(445 kB at 8.7 MB/s)
[INFO] Downloading from central: https://repo.maven.apache.org/maven2/commons-lang/commons-lang/2.1/commons-lang-2.1.jar
[INFO] Downloaded from central: https://repo.maven.apache.org/maven2/commons-beanutils/commons-beanutils/1.9.2/commons-beanutils-1.9.2.jar
(234 kB at 3.7 MB/s)
[INFO] Downloaded from central: https://repo.maven.apache.org/maven2/commons-lang/commons-lang/2.1/commons-lang-2.1.jar
(208 kB at 2.9 MB/s)
[INFO] Downloaded from central: https://repo.maven.apache.org/maven2/com/puppycrawl/tools/checkstyle/6.18/checkstyle-6.18.jar
(1.2 MB at 15 MB/s)
[INFO] Downloaded from central: https://repo.maven.apache.org/maven2/com/google/guava/guava/19.0/guava-19.0.jar
(2.3 MB at 15 MB/s)
[withMaven] invokerPublisher - Archive invoker results for Maven artifact MavenArtifact{org.apache.maven.plugins:maven-jdeps-plugin:maven-plugin:3.1.2-SNAPSHOT(version:
3.1.2-SNAPSHOT, snapshot:false) } generated by PluginInvocation{org.apache.maven.plugins:maven-invoker-plugin:3.0.1@integration-test
 integration-test}: m/target/invoker-reports/*.xml
[INFO] 
[INFO] --- maven-invoker-plugin:3.0.1:verify (integration-test) @ maven-jdeps-plugin ---
[INFO] -------------------------------------------------
[INFO] Build Summary:
[INFO]   Passed: 3, Failed: 3, Errors: 0, Skipped: 1
[INFO] -------------------------------------------------
[WARNING] The following builds failed:
[WARNING] *  unsupported-api_test/pom.xml
[WARNING] *  package/pom.xml
[WARNING] *  unsupported-api_main/pom.xml
[INFO] -------------------------------------------------
[WARNING] Ignoring that 3 builds failed.
[INFO] ------------------------------------------------------------------------
[INFO] BUILD SUCCESS
[INFO] ------------------------------------------------------------------------
[INFO] Total time: 54.096 s
[INFO] Finished at: 2019-01-01T16:10:05Z
[INFO] ------------------------------------------------------------------------
[INFO] [jenkins-event-spy] Generated /home/jenkins/jenkins-slave/workspace/x_maven-jdeps-plugin_MNGSITE-332@tmp/withMaven2ca04c6e/maven-spy-20190101-160910-7225022020572485946915.log
[Pipeline] }
[Pipeline] // dir
[Pipeline] }
[withMaven] artifactsPublisher - Archive artifact m/pom.xml under org/apache/maven/plugins/maven-jdeps-plugin/3.1.2-SNAPSHOT/maven-jdeps-plugin-3.1.2-SNAPSHOT.pom
[withMaven] artifactsPublisher - Archive artifact m/target/maven-jdeps-plugin-3.1.2-SNAPSHOT.jar
under org/apache/maven/plugins/maven-jdeps-plugin/3.1.2-SNAPSHOT/maven-jdeps-plugin-3.1.2-SNAPSHOT.jar
[withMaven] invokerPublisher - Archive invoker results for Maven artifact MavenArtifact{org.apache.maven.plugins:maven-jdeps-plugin:maven-plugin:3.1.2-SNAPSHOT(version:
3.1.2-SNAPSHOT, snapshot:false) } generated by PluginInvocation{org.apache.maven.plugins:maven-invoker-plugin:3.0.1@integration-test
 integration-test}: m/target/invoker-reports/*.xml
[withMaven] junitPublisher - Archive test results for Maven artifact org.apache.maven.plugins:maven-jdeps-plugin:maven-plugin:3.1.2-SNAPSHOT
generated by maven-surefire-plugin:test (default-test): m/target/surefire-reports/*.xml
Recording test results
[withMaven] Publishers: Pipeline Graph Publisher: 1 ms, Invoker Publisher: 6294 ms, Junit
Publisher: 622 ms
[Pipeline] // withMaven
[Pipeline] cleanWs
[WS-CLEANUP] Deleting project workspace...
[WS-CLEANUP] Deferred wipeout is used...
[WS-CLEANUP] done
[Pipeline] }
[Pipeline] // stage
[Pipeline] }
[Pipeline] // node
[Pipeline] }
[withMaven] junitPublisher - Archive test results for Maven artifact org.apache.maven.plugins:maven-jdeps-plugin:maven-plugin:3.1.2-SNAPSHOT
generated by maven-surefire-plugin:test (default-test): m/target/surefire-reports/*.xml
Recording test results
[withMaven] openTasksPublisher - Scan Tasks for Maven artifact org.apache.maven.plugins:maven-jdeps-plugin:maven-plugin:3.1.2-SNAPSHOT
in source directory m/src/main/java
[TASKS] Scanning folder '/home/jenkins/jenkins-slave/workspace/x_maven-jdeps-plugin_MNGSITE-332'
for files matching the pattern 'm/src/main/java/**/*' - excludes: null
[TASKS] Found 5 files to scan for tasks
[TASKS] Found 1 open tasks.
Skipping warnings blame since pipelines do not have an SCM link.%n
[TASKS] Computing warning deltas based on reference build #15
[withMaven] Publishers: Pipeline Graph Publisher: 2 ms, Generated Artifacts Publisher: 1100
ms, Invoker Publisher: 6889 ms, Junit Publisher: 629 ms, Open Task Scanner Publisher: 507
ms
[Pipeline] // withMaven
[Pipeline] cleanWs
[WS-CLEANUP] Deleting project workspace...
[WS-CLEANUP] Deferred wipeout is used...
[WS-CLEANUP] done
[Pipeline] }
[Pipeline] // stage
[Pipeline] }
[Pipeline] // node
[Pipeline] }
Running on windows-2016-1 in f:\jenkins\jenkins-slave\workspace\en-jdeps-plugin_MNGSITE-332-HYDPJXUVU2Y7MUXSB7TAQR5BQ5LXUXLCBQCWQPOX53WTXZY5ZAQQ
[Pipeline] {
[Pipeline] stage
[Pipeline] { (Checkout windows-jdk8)
[Pipeline] dir
Running in f:\jenkins\jenkins-slave\workspace\en-jdeps-plugin_MNGSITE-332-HYDPJXUVU2Y7MUXSB7TAQR5BQ5LXUXLCBQCWQPOX53WTXZY5ZAQQ\m
[Pipeline] {
[Pipeline] checkout
 > git rev-parse --is-inside-work-tree # timeout=10
Fetching changes from the remote Git repository
Fetching without tags
 > git config remote.origin.url https://gitbox.apache.org/repos/asf/maven-jdeps-plugin.git
# timeout=10
Fetching upstream changes from https://gitbox.apache.org/repos/asf/maven-jdeps-plugin.git
 > git --version # timeout=10
 > git fetch --no-tags --progress https://gitbox.apache.org/repos/asf/maven-jdeps-plugin.git
+refs/heads/*:refs/remotes/origin/*
Checking out Revision fc167c123b36cfb9a30ae38559ea729c0a7dc294 (MNGSITE-332)
 > git config core.sparsecheckout # timeout=10
 > git checkout -f fc167c123b36cfb9a30ae38559ea729c0a7dc294
Commit message: "- Changed download templates of plugins not to reference .md5 anymore"
Cleaning workspace
 > git rev-parse --verify HEAD # timeout=10
Resetting working tree
 > git reset --hard # timeout=10
 > git clean -fdx # timeout=10
[Pipeline] }
[Pipeline] // dir
[Pipeline] cleanWs
[WS-CLEANUP] Deleting project workspace...
[WS-CLEANUP] Deferred wipeout is used...
ERROR: Cannot delete workspace :f:\jenkins\jenkins-slave\workspace\en-jdeps-plugin_MNGSITE-332-HYDPJXUVU2Y7MUXSB7TAQR5BQ5LXUXLCBQCWQPOX53WTXZY5ZAQQ\m\target\invoker-reports\BUILD-basic.xml
[Pipeline] }
[Pipeline] // stage
[Pipeline] }
[Pipeline] // node
[Pipeline] }
Failed in branch windows-jdk8
Running on windows-2016-1 in f:\jenkins\jenkins-slave\workspace\en-jdeps-plugin_MNGSITE-332-HYDPJXUVU2Y7MUXSB7TAQR5BQ5LXUXLCBQCWQPOX53WTXZY5ZAQQ
[Pipeline] {
[Pipeline] stage
[Pipeline] { (Checkout windows-jdk9)
[Pipeline] dir
Running in f:\jenkins\jenkins-slave\workspace\en-jdeps-plugin_MNGSITE-332-HYDPJXUVU2Y7MUXSB7TAQR5BQ5LXUXLCBQCWQPOX53WTXZY5ZAQQ\m
[Pipeline] {
[Pipeline] checkout
Cloning the remote Git repository
Cloning with configured refspecs honoured and without tags
Cloning repository https://gitbox.apache.org/repos/asf/maven-jdeps-plugin.git
ERROR: Failed to clean the workspace
java.io.IOException: Unable to delete 'f:\jenkins\jenkins-slave\workspace\en-jdeps-plugin_MNGSITE-332-HYDPJXUVU2Y7MUXSB7TAQR5BQ5LXUXLCBQCWQPOX53WTXZY5ZAQQ\m'.
Tried 3 times (of a maximum of 3) waiting 0.1 sec between attempts.
	at hudson.Util.deleteContentsRecursive(Util.java:257)
	at org.jenkinsci.plugins.gitclient.CliGitAPIImpl$2.execute(CliGitAPIImpl.java:592)
	at org.jenkinsci.plugins.gitclient.RemoteGitImpl$CommandInvocationHandler$1.call(RemoteGitImpl.java:153)
	at org.jenkinsci.plugins.gitclient.RemoteGitImpl$CommandInvocationHandler$1.call(RemoteGitImpl.java:146)
	at hudson.remoting.UserRequest.perform(UserRequest.java:181)
	at hudson.remoting.UserRequest.perform(UserRequest.java:52)
	at hudson.remoting.Request$2.run(Request.java:336)
	at hudson.remoting.InterceptingExecutorService$1.call(InterceptingExecutorService.java:68)
	at java.util.concurrent.FutureTask.run(Unknown Source)
	at java.util.concurrent.ThreadPoolExecutor.runWorker(Unknown Source)
	at java.util.concurrent.ThreadPoolExecutor$Worker.run(Unknown Source)
	at hudson.remoting.Engine$1$1.run(Engine.java:98)
	at java.lang.Thread.run(Unknown Source)
Caused by: java.nio.file.AccessDeniedException: f:\jenkins\jenkins-slave\workspace\en-jdeps-plugin_MNGSITE-332-HYDPJXUVU2Y7MUXSB7TAQR5BQ5LXUXLCBQCWQPOX53WTXZY5ZAQQ\m\target\invoker-reports\BUILD-basic.xml
	at sun.nio.fs.WindowsException.translateToIOException(Unknown Source)
	at sun.nio.fs.WindowsException.rethrowAsIOException(Unknown Source)
	at sun.nio.fs.WindowsException.rethrowAsIOException(Unknown Source)
	at sun.nio.fs.WindowsFileAttributeViews$Basic.readAttributes(Unknown Source)
	at sun.nio.fs.WindowsFileAttributeViews$Basic.readAttributes(Unknown Source)
	at sun.nio.fs.WindowsFileSystemProvider.readAttributes(Unknown Source)
	at java.nio.file.Files.readAttributes(Unknown Source)
	at hudson.Util.isSymlink(Util.java:529)
	at hudson.Util.tryOnceDeleteRecursive(Util.java:386)
	at hudson.Util.tryOnceDeleteContentsRecursive(Util.java:407)
	at hudson.Util.tryOnceDeleteRecursive(Util.java:387)
	at hudson.Util.tryOnceDeleteContentsRecursive(Util.java:407)
	at hudson.Util.tryOnceDeleteRecursive(Util.java:387)
	at hudson.Util.tryOnceDeleteContentsRecursive(Util.java:407)
	at hudson.Util.deleteContentsRecursive(Util.java:252)
	... 12 more
ERROR: Error cloning remote repo 'origin'
hudson.plugins.git.GitException: Failed to delete workspace
	at org.jenkinsci.plugins.gitclient.CliGitAPIImpl$2.execute(CliGitAPIImpl.java:595)
	at org.jenkinsci.plugins.gitclient.RemoteGitImpl$CommandInvocationHandler$1.call(RemoteGitImpl.java:153)
	at org.jenkinsci.plugins.gitclient.RemoteGitImpl$CommandInvocationHandler$1.call(RemoteGitImpl.java:146)
	at hudson.remoting.UserRequest.perform(UserRequest.java:181)
	at hudson.remoting.UserRequest.perform(UserRequest.java:52)
	at hudson.remoting.Request$2.run(Request.java:336)
	at hudson.remoting.InterceptingExecutorService$1.call(InterceptingExecutorService.java:68)
	at java.util.concurrent.FutureTask.run(Unknown Source)
	at java.util.concurrent.ThreadPoolExecutor.runWorker(Unknown Source)
	at java.util.concurrent.ThreadPoolExecutor$Worker.run(Unknown Source)
	at hudson.remoting.Engine$1$1.run(Engine.java:98)
	at java.lang.Thread.run(Unknown Source)
	Suppressed: hudson.remoting.Channel$CallSiteStackTrace: Remote call to JNLP4-connect connection
from ec2-34-228-168-168.compute-1.amazonaws.com/34.228.168.168:49341
		at hudson.remoting.Channel.attachCallSiteStackTrace(Channel.java:1741)
		at hudson.remoting.UserResponse.retrieve(UserRequest.java:389)
		at hudson.remoting.Channel.call(Channel.java:955)
		at org.jenkinsci.plugins.gitclient.RemoteGitImpl$CommandInvocationHandler.execute(RemoteGitImpl.java:146)
		at sun.reflect.GeneratedMethodAccessor1100.invoke(Unknown Source)
		at sun.reflect.DelegatingMethodAccessorImpl.invoke(DelegatingMethodAccessorImpl.java:43)
		at java.lang.reflect.Method.invoke(Method.java:498)
		at org.jenkinsci.plugins.gitclient.RemoteGitImpl$CommandInvocationHandler.invoke(RemoteGitImpl.java:132)
		at com.sun.proxy.$Proxy125.execute(Unknown Source)
		at hudson.plugins.git.GitSCM.retrieveChanges(GitSCM.java:1146)
		at hudson.plugins.git.GitSCM.checkout(GitSCM.java:1186)
		at org.jenkinsci.plugins.workflow.steps.scm.SCMStep.checkout(SCMStep.java:120)
		at org.jenkinsci.plugins.workflow.steps.scm.SCMStep$StepExecutionImpl.run(SCMStep.java:90)
		at org.jenkinsci.plugins.workflow.steps.scm.SCMStep$StepExecutionImpl.run(SCMStep.java:77)
		at org.jenkinsci.plugins.workflow.steps.SynchronousNonBlockingStepExecution$1$1.call(SynchronousNonBlockingStepExecution.java:51)
		at hudson.security.ACL.impersonate(ACL.java:290)
		at org.jenkinsci.plugins.workflow.steps.SynchronousNonBlockingStepExecution$1.run(SynchronousNonBlockingStepExecution.java:48)
		at java.util.concurrent.Executors$RunnableAdapter.call(Executors.java:511)
		at java.util.concurrent.FutureTask.run(FutureTask.java:266)
		at java.util.concurrent.ThreadPoolExecutor.runWorker(ThreadPoolExecutor.java:1149)
		at java.util.concurrent.ThreadPoolExecutor$Worker.run(ThreadPoolExecutor.java:624)
		at java.lang.Thread.run(Thread.java:748)
Caused by: java.io.IOException: Unable to delete 'f:\jenkins\jenkins-slave\workspace\en-jdeps-plugin_MNGSITE-332-HYDPJXUVU2Y7MUXSB7TAQR5BQ5LXUXLCBQCWQPOX53WTXZY5ZAQQ\m'.
Tried 3 times (of a maximum of 3) waiting 0.1 sec between attempts.
	at hudson.Util.deleteContentsRecursive(Util.java:257)
	at org.jenkinsci.plugins.gitclient.CliGitAPIImpl$2.execute(CliGitAPIImpl.java:592)
	... 11 more
Caused by: java.nio.file.AccessDeniedException: f:\jenkins\jenkins-slave\workspace\en-jdeps-plugin_MNGSITE-332-HYDPJXUVU2Y7MUXSB7TAQR5BQ5LXUXLCBQCWQPOX53WTXZY5ZAQQ\m\target\invoker-reports\BUILD-basic.xml
	at sun.nio.fs.WindowsException.translateToIOException(Unknown Source)
	at sun.nio.fs.WindowsException.rethrowAsIOException(Unknown Source)
	at sun.nio.fs.WindowsException.rethrowAsIOException(Unknown Source)
	at sun.nio.fs.WindowsFileAttributeViews$Basic.readAttributes(Unknown Source)
	at sun.nio.fs.WindowsFileAttributeViews$Basic.readAttributes(Unknown Source)
	at sun.nio.fs.WindowsFileSystemProvider.readAttributes(Unknown Source)
	at java.nio.file.Files.readAttributes(Unknown Source)
	at hudson.Util.isSymlink(Util.java:529)
	at hudson.Util.tryOnceDeleteRecursive(Util.java:386)
	at hudson.Util.tryOnceDeleteContentsRecursive(Util.java:407)
	at hudson.Util.tryOnceDeleteRecursive(Util.java:387)
	at hudson.Util.tryOnceDeleteContentsRecursive(Util.java:407)
	at hudson.Util.tryOnceDeleteRecursive(Util.java:387)
	at hudson.Util.tryOnceDeleteContentsRecursive(Util.java:407)
	at hudson.Util.deleteContentsRecursive(Util.java:252)
	... 12 more
[Pipeline] }
[Pipeline] // dir
[Pipeline] cleanWs
[WS-CLEANUP] Deleting project workspace...
[WS-CLEANUP] Deferred wipeout is used...
ERROR: Cannot delete workspace :f:\jenkins\jenkins-slave\workspace\en-jdeps-plugin_MNGSITE-332-HYDPJXUVU2Y7MUXSB7TAQR5BQ5LXUXLCBQCWQPOX53WTXZY5ZAQQ\m\target\invoker-reports\BUILD-basic.xml
[Pipeline] }
[Pipeline] // stage
[Pipeline] }
[Pipeline] // node
[Pipeline] }
Failed in branch windows-jdk9
[Pipeline] // parallel
[Pipeline] stage
[Pipeline] { (Notifications)
[Pipeline] echo
Build result: FAILURE
[Pipeline] jiraIssueSelector
[Pipeline] emailext
Mime
  • Unnamed multipart/mixed (inline, None, 0 bytes)
View raw message