maven-notifications mailing list archives

Site index · List index
Message view « Date » · « Thread »
Top « Date » · « Thread »
From Apache Jenkins Server <jenk...@builds.apache.org>
Subject Build unstable in Jenkins: Maven TLP » maven-shade-plugin » MSHADE-306 #7
Date Thu, 10 Jan 2019 03:49:27 GMT
See https://builds.apache.org/job/maven-box/job/maven-shade-plugin/job/MSHADE-306/7/

Changes:

* Disable cleanWs() due to issues with file handles on Windows
* added a link to asf-gitpubsub-jenkins-plugin
* fixed markup (asciidoc, not markdown...)

5 tests failed.
FAILED:  org.apache.maven.plugins.shade.DefaultShaderTest.windows-jdk7-m3.2.x_build / Build
windows-jdk7-m3.2.x_build / testOverlappingResourcesAreLogged

Error Message:
[Processing JAR src\test\jars\test-project-1.0-SNAPSHOT.jar, Processing JAR src\test\jars\plexus-utils-1.4.1.jar,
We have a duplicate META-INF/MANIFEST.MF in src\test\jars\plexus-utils-1.4.1.jar]

Stack Trace:
junit.framework.AssertionFailedError: [Processing JAR src\test\jars\test-project-1.0-SNAPSHOT.jar,
Processing JAR src\test\jars\plexus-utils-1.4.1.jar, We have a duplicate META-INF/MANIFEST.MF
in src\test\jars\plexus-utils-1.4.1.jar]
	at org.apache.maven.plugins.shade.DefaultShaderTest.testOverlappingResourcesAreLogged(DefaultShaderTest.java:122)


FAILED:  org.apache.maven.plugins.shade.DefaultShaderTest.windows-jdk7-m3.3.x_build / Build
windows-jdk7-m3.3.x_build / testOverlappingResourcesAreLogged

Error Message:
[Processing JAR src\test\jars\test-project-1.0-SNAPSHOT.jar, Processing JAR src\test\jars\plexus-utils-1.4.1.jar,
We have a duplicate META-INF/MANIFEST.MF in src\test\jars\plexus-utils-1.4.1.jar]

Stack Trace:
junit.framework.AssertionFailedError: [Processing JAR src\test\jars\test-project-1.0-SNAPSHOT.jar,
Processing JAR src\test\jars\plexus-utils-1.4.1.jar, We have a duplicate META-INF/MANIFEST.MF
in src\test\jars\plexus-utils-1.4.1.jar]
	at org.apache.maven.plugins.shade.DefaultShaderTest.testOverlappingResourcesAreLogged(DefaultShaderTest.java:122)


FAILED:  org.apache.maven.plugins.shade.DefaultShaderTest.windows-jdk7-m3.5.x_build / Build
windows-jdk7-m3.5.x_build / testOverlappingResourcesAreLogged

Error Message:
[Processing JAR src\test\jars\test-project-1.0-SNAPSHOT.jar, Processing JAR src\test\jars\plexus-utils-1.4.1.jar,
We have a duplicate META-INF/MANIFEST.MF in src\test\jars\plexus-utils-1.4.1.jar]

Stack Trace:
junit.framework.AssertionFailedError: [Processing JAR src\test\jars\test-project-1.0-SNAPSHOT.jar,
Processing JAR src\test\jars\plexus-utils-1.4.1.jar, We have a duplicate META-INF/MANIFEST.MF
in src\test\jars\plexus-utils-1.4.1.jar]
	at org.apache.maven.plugins.shade.DefaultShaderTest.testOverlappingResourcesAreLogged(DefaultShaderTest.java:122)


FAILED:  org.apache.maven.plugins.shade.DefaultShaderTest.windows-jdk8-m3.5.x_build / Build
windows-jdk8-m3.5.x_build / testOverlappingResourcesAreLogged

Error Message:
[Processing JAR src\test\jars\test-project-1.0-SNAPSHOT.jar, Processing JAR src\test\jars\plexus-utils-1.4.1.jar,
We have a duplicate META-INF/MANIFEST.MF in src\test\jars\plexus-utils-1.4.1.jar]

Stack Trace:
junit.framework.AssertionFailedError: [Processing JAR src\test\jars\test-project-1.0-SNAPSHOT.jar,
Processing JAR src\test\jars\plexus-utils-1.4.1.jar, We have a duplicate META-INF/MANIFEST.MF
in src\test\jars\plexus-utils-1.4.1.jar]
	at org.apache.maven.plugins.shade.DefaultShaderTest.testOverlappingResourcesAreLogged(DefaultShaderTest.java:122)


FAILED:  org.apache.maven.plugins.shade.DefaultShaderTest.windows-jdk11-m3.5.x_build / Build
windows-jdk11-m3.5.x_build / testOverlappingResourcesAreLogged

Error Message:
[Processing JAR src\test\jars\test-project-1.0-SNAPSHOT.jar, Processing JAR src\test\jars\plexus-utils-1.4.1.jar,
We have a duplicate META-INF/MANIFEST.MF in src\test\jars\plexus-utils-1.4.1.jar]

Stack Trace:
junit.framework.AssertionFailedError: [Processing JAR src\test\jars\test-project-1.0-SNAPSHOT.jar,
Processing JAR src\test\jars\plexus-utils-1.4.1.jar, We have a duplicate META-INF/MANIFEST.MF
in src\test\jars\plexus-utils-1.4.1.jar]
	at org.apache.maven.plugins.shade.DefaultShaderTest.testOverlappingResourcesAreLogged(DefaultShaderTest.java:122)




Build log:
[...truncated 4622 lines...]
Please refer to dump files (if any exist) [date]-jvmRun[N].dump, [date].dumpstream and [date]-jvmRun[N].dumpstream.
[INFO] 
[INFO] --- maven-jar-plugin:3.1.0:jar (default-jar) @ maven-shade-plugin ---
[INFO] Building jar: f:\jenkins\jenkins-slave\workspace\ox_maven-shade-plugin_MSHADE-306@2\windows-jdk11-m3.5.x_build\target\maven-shade-plugin-3.2.2-SNAPSHOT.jar
[INFO] 
[INFO] --- maven-plugin-plugin:3.5.2:addPluginArtifactMetadata (default-addPluginArtifactMetadata)
@ maven-shade-plugin ---
[INFO] 
[INFO] --- maven-site-plugin:3.7.1:attach-descriptor (attach-descriptor) @ maven-shade-plugin
---
[INFO] Skipping because packaging 'maven-plugin' is not pom.
[INFO] 
[INFO] --- maven-jar-plugin:3.1.0:test-jar (default) @ maven-shade-plugin ---
[INFO] Building jar: f:\jenkins\jenkins-slave\workspace\ox_maven-shade-plugin_MSHADE-306@2\windows-jdk11-m3.5.x_build\target\maven-shade-plugin-3.2.2-SNAPSHOT-tests.jar
[INFO] 
[INFO] --- maven-invoker-plugin:3.1.0:install (integration-test) @ maven-shade-plugin ---
[withMaven] Publishers: Generated Artifacts Publisher: 188 ms, Junit Publisher: 1140 ms, Open
Task Scanner Publisher: 148 ms, Invoker Publisher: 17045 ms, Pipeline Graph Publisher: 1 ms
[Pipeline] // withMaven
[Pipeline] }
[Pipeline] // stage
[Pipeline] }
[Pipeline] // ws
[Pipeline] }
[Pipeline] // node
[Pipeline] }
[INFO] Installing f:\jenkins\jenkins-slave\workspace\ox_maven-shade-plugin_MSHADE-306@2\windows-jdk11-m3.5.x_build\pom.xml
to f:\jenkins\jenkins-slave\workspace\ox_maven-shade-plugin_MSHADE-306@2\windows-jdk11-m3.5.x_build\target\local-repo\org\apache\maven\plugins\maven-shade-plugin\3.2.2-SNAPSHOT\maven-shade-plugin-3.2.2-SNAPSHOT.pom
[INFO] Installing f:\jenkins\jenkins-slave\workspace\ox_maven-shade-plugin_MSHADE-306@2\windows-jdk11-m3.5.x_build\target\maven-shade-plugin-3.2.2-SNAPSHOT.jar
to f:\jenkins\jenkins-slave\workspace\ox_maven-shade-plugin_MSHADE-306@2\windows-jdk11-m3.5.x_build\target\local-repo\org\apache\maven\plugins\maven-shade-plugin\3.2.2-SNAPSHOT\maven-shade-plugin-3.2.2-SNAPSHOT.jar
[INFO] Installing f:\jenkins\jenkins-slave\workspace\ox_maven-shade-plugin_MSHADE-306@2\windows-jdk11-m3.5.x_build\target\maven-shade-plugin-3.2.2-SNAPSHOT-tests.jar
to f:\jenkins\jenkins-slave\workspace\ox_maven-shade-plugin_MSHADE-306@2\windows-jdk11-m3.5.x_build\target\local-repo\org\apache\maven\plugins\maven-shade-plugin\3.2.2-SNAPSHOT\maven-shade-plugin-3.2.2-SNAPSHOT-tests.jar
[INFO] 
[INFO] --- maven-invoker-plugin:3.1.0:integration-test (integration-test) @ maven-shade-plugin
---
[INFO] Running 1 setup job:
[INFO] Building: setup-parent\pom.xml
[INFO]           setup-parent\pom.xml ............................. SUCCESS (4.4 s)
[INFO] Setup done.
[INFO] Building: artifact-includes-excludes\pom.xml
[INFO] run post-build script verify.bsh
[INFO]           artifact-includes-excludes\pom.xml ............... SUCCESS (10.0 s)
[INFO] Building: attach-after-lifecycle-fork\pom.xml
[INFO] run pre-build script setup.bsh
[INFO] run post-build script verify.bsh
[INFO]           attach-after-lifecycle-fork\pom.xml .............. SUCCESS (7.7 s)
[INFO] Building: attached-artifact-type\pom.xml
[INFO]           attached-artifact-type\pom.xml ................... SUCCESS (6.8 s)
[INFO] Building: component-descriptor-relocation\pom.xml
[INFO]           component-descriptor-relocation\pom.xml .......... SUCCESS (9.1 s)
[INFO] Building: dep-reduced-pom\pom.xml
[INFO] run post-build script verify.groovy
WARNING: An illegal reflective access operation has occurred
WARNING: Illegal reflective access by org.codehaus.groovy.reflection.CachedClass (file:/f:/jenkins/jenkins-slave/workspace/.maven_repositories/null/org/codehaus/groovy/groovy-all/2.4.8/groovy-all-2.4.8.jar)
to method java.lang.Object.finalize()
WARNING: Please consider reporting this to the maintainers of org.codehaus.groovy.reflection.CachedClass
WARNING: Use --illegal-access=warn to enable warnings of further illegal reflective access
operations
WARNING: All illegal access operations will be denied in a future release
[INFO]           dep-reduced-pom\pom.xml .......................... SUCCESS (7.7 s)
[INFO] Building: dep-reduced-pom-relocated-result\pom.xml
[INFO]           dep-reduced-pom-relocated-result\pom.xml ......... SUCCESS (5.2 s)
[INFO] Building: dep-reduced-pom-unique\pom.xml
[INFO] run post-build script verify.groovy
[INFO]           dep-reduced-pom-unique\pom.xml ................... SUCCESS (6.6 s)
[INFO] Building: dep-reduced-pom-use-base-version\pom.xml
[INFO] run post-build script verify.groovy
[INFO]           dep-reduced-pom-use-base-version\pom.xml ......... SUCCESS (6.4 s)
[INFO] Building: dep-reduced-pom-with-local-parent\pom.xml
[INFO]           dep-reduced-pom-with-local-parent\pom.xml ........ SUCCESS (5.8 s)
[INFO] Building: duplicate-classes-with-reloc\pom.xml
[INFO]           duplicate-classes-with-reloc\pom.xml ............. SUCCESS (5.8 s)
[INFO] Building: duplicate-classes-without-reloc\pom.xml
[INFO]           duplicate-classes-without-reloc\pom.xml .......... SUCCESS (5.3 s)
[INFO] Building: empty-apache-notice-transform\pom.xml
[INFO]           empty-apache-notice-transform\pom.xml ............ SUCCESS (6.5 s)
[INFO] Building: empty-relocation-pattern\pom.xml
[INFO]           empty-relocation-pattern\pom.xml ................. SUCCESS (6.9 s)
[INFO] Building: empty-relocation-shaded-pattern\pom.xml
[INFO]           empty-relocation-shaded-pattern\pom.xml .......... SUCCESS (6.4 s)
[INFO] Building: filter-artifact-contents\pom.xml
[INFO] run post-build script verify.bsh
[INFO]           filter-artifact-contents\pom.xml ................. SUCCESS (6.6 s)
[INFO] Building: finalNameBuild\pom.xml
[INFO] run pre-build script setup.bsh
[INFO] run post-build script verify.bsh
[INFO]           finalNameBuild\pom.xml ........................... SUCCESS (6.9 s)
[INFO] Building: finalNameBuild-attached\pom.xml
[INFO] run pre-build script setup.bsh
[INFO] run post-build script verify.bsh
[INFO]           finalNameBuild-attached\pom.xml .................. SUCCESS (6.4 s)
[INFO] Building: finalNameShade\pom.xml
[INFO] run pre-build script setup.bsh
[INFO] run post-build script verify.bsh
[INFO]           finalNameShade\pom.xml ........................... SUCCESS (6.3 s)
[INFO] Building: finalNameShade-attached\pom.xml
[INFO] run pre-build script setup.bsh
[INFO] run post-build script verify.bsh
[INFO]           finalNameShade-attached\pom.xml .................. SUCCESS (6.7 s)
[INFO] Building: implicit-inclusion-of-project-artifact\pom.xml
[INFO] run post-build script verify.bsh
[INFO]           implicit-inclusion-of-project-artifact\pom.xml ... SUCCESS (7.1 s)
[INFO] Building: manifest-retained\pom.xml
[INFO] run post-build script verify.bsh
[INFO]           manifest-retained\pom.xml ........................ SUCCESS (8.7 s)
[INFO] Building: manifest-transformed\pom.xml
[INFO] run post-build script verify.bsh
[INFO]           manifest-transformed\pom.xml ..................... SUCCESS (7.1 s)
[INFO] Building: mini-jar\pom.xml
[INFO] run post-build script verify.bsh
[INFO]           mini-jar\pom.xml ................................. SUCCESS (7.0 s)
[INFO] Building: mini-jar-jdk11\pom.xml
[INFO] run post-build script verify.bsh
[INFO]           mini-jar-jdk11\pom.xml ........................... SUCCESS (8.1 s)
[INFO] Building: mini-jar-malformed-dependencies\pom.xml
[INFO]           mini-jar-malformed-dependencies\pom.xml .......... SUCCESS (10.0 s)
[INFO] Building: mini-jar-package-info\pom.xml
[INFO] run post-build script verify.bsh
[INFO]           mini-jar-package-info\pom.xml .................... SUCCESS (8.7 s)
[INFO] Building: mini-jar-respect-includes\pom.xml
[INFO] run post-build script verify.bsh
[INFO]           mini-jar-respect-includes\pom.xml ................ SUCCESS (7.7 s)
[INFO] Building: MSHADE-105\pom.xml
[INFO] run post-build script verify.bsh
[INFO]           MSHADE-105\pom.xml ............................... SUCCESS (13.5 s)
[INFO] Building: MSHADE-114\pom.xml
[INFO]           MSHADE-114\pom.xml ............................... SUCCESS (6.2 s)
[INFO] Building: mshade-123\pom.xml
[INFO]           mshade-123\pom.xml ............................... SUCCESS (10.7 s)
[INFO] Building: MSHADE-133\pom.xml
[INFO] run post-build script verify.groovy
[INFO]           MSHADE-133\pom.xml ............................... SUCCESS (6.8 s)
[INFO] Building: MSHADE-155\pom.xml
[INFO] run post-build script verify.groovy
[INFO]           MSHADE-155\pom.xml ............................... SUCCESS (6.1 s)
[INFO] Building: MSHADE-182\pom.xml
[INFO] run post-build script verify.groovy
[INFO]           MSHADE-182\pom.xml ............................... SUCCESS (6.1 s)
[INFO] Building: MSHADE-183\pom.xml
[INFO] run post-build script verify.bsh
[INFO]           MSHADE-183\pom.xml ............................... SUCCESS (7.6 s)
[INFO] Building: MSHADE-185\pom.xml
[INFO]           MSHADE-185\pom.xml ............................... SKIPPED due to JRE version
[INFO] Building: MSHADE-232_ResourceBundleAppendingTransformer\pom.xml
[INFO] run post-build script verify.groovy
[INFO]           MSHADE-232_ResourceBundleAppendingTransformer\pom.xml SUCCESS (6.8 s)
[INFO] Building: MSHADE-239_finalName-attachments\pom.xml
[INFO] run post-build script verify.groovy
[INFO]           MSHADE-239_finalName-attachments\pom.xml ......... SUCCESS (6.0 s)
[INFO] Building: MSHADE-240_reloc-mavenfiles\pom.xml
[INFO] run post-build script verify.groovy
[INFO]           MSHADE-240_reloc-mavenfiles\pom.xml .............. SUCCESS (10.0 s)
[INFO] Building: MSHADE-247\pom.xml
[INFO]           MSHADE-247\pom.xml ............................... SUCCESS (7.5 s)
[INFO] Building: MSHADE-258_module_relocation\pom.xml
[INFO] run post-build script verify.groovy
[INFO]           MSHADE-258_module_relocation\pom.xml ............. SUCCESS (6.6 s)
[INFO] Building: non-runtime-scope-excluded\pom.xml
[INFO] run post-build script verify.bsh
[INFO]           non-runtime-scope-excluded\pom.xml ............... SUCCESS (7.0 s)
[INFO] Building: plugin-descriptor-relocation\pom.xml
[INFO] run post-build script verify.groovy
[INFO]           plugin-descriptor-relocation\pom.xml ............. SUCCESS (13.9 s)
[INFO] Building: pom-packaging\pom.xml
[INFO] run post-build script verify.bsh
[INFO]           pom-packaging\pom.xml ............................ SUCCESS (5.2 s)
[INFO] Building: project-with-reactors-included\pom.xml
[INFO] run post-build script verify.bsh
[INFO]           project-with-reactors-included\pom.xml ........... SUCCESS (9.4 s)
[INFO] Building: reloc-abs-resource-path\pom.xml
[INFO]           reloc-abs-resource-path\pom.xml .................. SUCCESS (7.7 s)
[INFO] Building: reloc-abs-resource-path-exclude\pom.xml
[INFO]           reloc-abs-resource-path-exclude\pom.xml .......... SUCCESS (9.2 s)
[INFO] Building: reloc-anno\pom.xml
[INFO]           reloc-anno\pom.xml ............................... SUCCESS (7.4 s)
[INFO] Building: reloc-class-from-string-pool\pom.xml
[INFO]           reloc-class-from-string-pool\pom.xml ............. SUCCESS (6.7 s)
[INFO] Building: reloc-enum-ref-from-anno\pom.xml
[INFO]           reloc-enum-ref-from-anno\pom.xml ................. SUCCESS (7.8 s)
[INFO] Building: reloc-includes-excludes\pom.xml
[INFO] run post-build script verify.bsh
[INFO]           reloc-includes-excludes\pom.xml .................. SUCCESS (7.5 s)
[INFO] Building: rerun-with-reloc\pom.xml
[INFO]           rerun-with-reloc\pom.xml ......................... SUCCESS (7.6 s)
[INFO] Building: rerun-without-reloc\pom.xml
[INFO]           rerun-without-reloc\pom.xml ...................... SUCCESS (7.0 s)
[INFO] Building: services-resource-transformer\pom.xml
[INFO] run post-build script verify.bsh
[INFO]           services-resource-transformer\pom.xml ............ SUCCESS (6.6 s)
[INFO] Building: services-resource-transformer-with-reloc-includes-excludes\pom.xml
[INFO] run post-build script verify.bsh
[INFO]           services-resource-transformer-with-reloc-includes-excludes\pom.xml SUCCESS
(6.6 s)
[INFO] Building: shadePomDependency\pom.xml
[INFO]           shadePomDependency\pom.xml ....................... SUCCESS (7.8 s)
[INFO] Building: shading-with-java-10-sources\pom.xml
[INFO] run post-build script verify.groovy
[INFO]           shading-with-java-10-sources\pom.xml ............. SUCCESS (9.6 s)
[INFO] Building: shading-with-java-11-sources\pom.xml
[INFO] run post-build script verify.groovy
[INFO]           shading-with-java-11-sources\pom.xml ............. SUCCESS (7.3 s)
[INFO] Building: shading-with-java-8-sources\pom.xml
[INFO] run post-build script verify.groovy
[INFO]           shading-with-java-8-sources\pom.xml .............. SUCCESS (7.3 s)
[INFO] Building: users-shader-impl\pom.xml
[INFO] run post-build script verify.groovy
[INFO]           users-shader-impl\pom.xml ........................ SUCCESS (7.4 s)
[INFO] Building: xml-transformer-ignores-dtd\pom.xml
[INFO] run post-build script verify.bsh
[INFO]           xml-transformer-ignores-dtd\pom.xml .............. SUCCESS (6.6 s)
[INFO] 
[INFO] --- maven-checkstyle-plugin:3.0.0:check (checkstyle-check) @ maven-shade-plugin ---
[INFO] There are 3 errors reported by Checkstyle 6.18 with config/maven_checks.xml ruleset.
[INFO] Ignored 3 errors, 0 violation remaining.
[INFO] 
[INFO] --- maven-invoker-plugin:3.1.0:verify (integration-test) @ maven-shade-plugin ---
[INFO] -------------------------------------------------
[INFO] Build Summary:
[INFO]   Passed: 60, Failed: 0, Errors: 0, Skipped: 1
[INFO] -------------------------------------------------
[INFO] ------------------------------------------------------------------------
[INFO] BUILD SUCCESS
[INFO] ------------------------------------------------------------------------
[INFO] Total time: 07:55 min
[INFO] Finished at: 2019-01-10T03:48:52Z
[INFO] Final Memory: 45M/160M
[INFO] ------------------------------------------------------------------------
[INFO] [jenkins-event-spy] Generated F:\jenkins\jenkins-slave\workspace\ox_maven-shade-plugin_MSHADE-306@2@tmp\withMavenc63760e6\maven-spy-20190110-034056-2010672311472844396754.log
[Pipeline] }
[Pipeline] // dir
[Pipeline] }
[withMaven] artifactsPublisher - Archive artifact windows-jdk11-m3.5.x_build\pom.xml under
org\apache\maven\plugins\maven-shade-plugin\3.2.2-SNAPSHOT\maven-shade-plugin-3.2.2-SNAPSHOT.pom
[withMaven] artifactsPublisher - Archive artifact windows-jdk11-m3.5.x_build\target\maven-shade-plugin-3.2.2-SNAPSHOT.jar
under org\apache\maven\plugins\maven-shade-plugin\3.2.2-SNAPSHOT\maven-shade-plugin-3.2.2-SNAPSHOT.jar
[withMaven] artifactsPublisher - Archive artifact windows-jdk11-m3.5.x_build\target\maven-shade-plugin-3.2.2-SNAPSHOT-tests.jar
under org\apache\maven\plugins\maven-shade-plugin\3.2.2-SNAPSHOT\maven-shade-plugin-3.2.2-SNAPSHOT-tests.jar
[withMaven] junitPublisher - Archive test results for Maven artifact org.apache.maven.plugins:maven-shade-plugin:maven-plugin:3.2.2-SNAPSHOT
generated by maven-surefire-plugin:test (default-test): windows-jdk11-m3.5.x_build\target\surefire-reports\*.xml
Recording test results
[withMaven] openTasksPublisher - Scan Tasks for Maven artifact org.apache.maven.plugins:maven-shade-plugin:maven-plugin:3.2.2-SNAPSHOT
in source directory windows-jdk11-m3.5.x_build\src\main\java
[TASKS] Scanning folder 'f:\jenkins\jenkins-slave\workspace\ox_maven-shade-plugin_MSHADE-306@2'
for files matching the pattern 'windows-jdk11-m3.5.x_build\src\main\java\**\*' - excludes:
null
[TASKS] Found 32 files to scan for tasks
[TASKS] Found 2 open tasks.
Skipping warnings blame since pipelines do not have an SCM link.%n
[TASKS] Computing warning deltas based on reference build #4
[withMaven] invokerPublisher - Archive invoker results for Maven artifact MavenArtifact{org.apache.maven.plugins:maven-shade-plugin:maven-plugin:3.2.2-SNAPSHOT(version:
3.2.2-SNAPSHOT, snapshot:false) } generated by PluginInvocation{org.apache.maven.plugins:maven-invoker-plugin:3.1.0@integration-test
 integration-test}: windows-jdk11-m3.5.x_build\target\invoker-reports\*.xml
[withMaven] Publishers: Generated Artifacts Publisher: 188 ms, Junit Publisher: 912 ms, Open
Task Scanner Publisher: 131 ms, Invoker Publisher: 33435 ms, Pipeline Graph Publisher: 1 ms
[Pipeline] // withMaven
[Pipeline] }
[Pipeline] // stage
[Pipeline] }
[Pipeline] // ws
[Pipeline] }
[Pipeline] // node
[Pipeline] }
[Pipeline] // parallel
[Pipeline] stage
[Pipeline] { (Notifications)
[Pipeline] echo
Build result: UNSTABLE
[Pipeline] jiraIssueSelector
[Pipeline] emailext
Mime
  • Unnamed multipart/mixed (inline, None, 0 bytes)
View raw message