maven-notifications mailing list archives

Site index · List index
Message view « Date » · « Thread »
Top « Date » · « Thread »
From Apache Jenkins Server <jenk...@builds.apache.org>
Subject Build failed in Jenkins: Maven TLP » maven-surefire » master #119
Date Wed, 02 Jan 2019 03:47:46 GMT
See https://builds.apache.org/job/maven-box/job/maven-surefire/job/master/119/

Changes:

* add mavenLinkerPublisher

All tests passed

Build log:
[...truncated 68904 lines...]
[INFO] Maven Surefire Plugin .............................. SUCCESS [  9.421 s]
[INFO] Maven Failsafe Plugin .............................. SUCCESS [01:09 min]
[INFO] Maven Surefire Report Plugin ....................... SUCCESS [ 14.043 s]
[INFO] Maven Surefire Integration Tests 3.0.0-M4-SNAPSHOT . SUCCESS [  01:09 h]
[INFO] ------------------------------------------------------------------------
[INFO] BUILD SUCCESS
[INFO] ------------------------------------------------------------------------
[INFO] Total time: 01:15 h
[INFO] Finished at: 2019-01-01T17:26:36Z
[INFO] ------------------------------------------------------------------------
[Pipeline] }
[Pipeline] // withEnv
[Pipeline] }
[Pipeline] // stage
[Pipeline] stage
[Pipeline] { (reporting linux-jdk11-maven3.5.x)
[Pipeline] }
[Pipeline] // stage
[Pipeline] stage
[Pipeline] { (cleanup linux-jdk11-maven3.5.x)
[Pipeline] cleanWs
[WS-CLEANUP] Deleting project workspace...
[WS-CLEANUP] Deferred wipeout is used...
[WS-CLEANUP] done
[Pipeline] }
[Pipeline] // stage
[Pipeline] }
[Pipeline] // ws
[Pipeline] }
[Pipeline] // timestamps
[Pipeline] }
[Pipeline] // node
[Pipeline] }
Terminated
[INFO] Tests run: 3, Failures: 0, Errors: 0, Skipped: 0, Time elapsed: 21.846 s - in org.apache.maven.surefire.its.jiras.Surefire946KillMainProcessInReusableForkIT
[INFO] Running org.apache.maven.surefire.its.jiras.Surefire972BizarreNoClassDefIT
[INFO] Tests run: 1, Failures: 0, Errors: 0, Skipped: 0, Time elapsed: 7.475 s - in org.apache.maven.surefire.its.jiras.Surefire972BizarreNoClassDefIT
[INFO] Running org.apache.maven.surefire.its.jiras.Surefire975DefaultVMEncodingIT
[INFO] Tests run: 2, Failures: 0, Errors: 0, Skipped: 0, Time elapsed: 23.624 s - in org.apache.maven.surefire.its.jiras.Surefire943ReportContentIT
[INFO] Running org.apache.maven.surefire.its.jiras.Surefire946KillMainProcessInReusableForkIT
[INFO] Tests run: 1, Failures: 0, Errors: 0, Skipped: 0, Time elapsed: 5.507 s - in org.apache.maven.surefire.its.jiras.Surefire975DefaultVMEncodingIT
[INFO] Running org.apache.maven.surefire.its.jiras.Surefire979WrongClassLoaderIT
[INFO] Tests run: 1, Failures: 0, Errors: 0, Skipped: 0, Time elapsed: 5.027 s - in org.apache.maven.surefire.its.jiras.Surefire979WrongClassLoaderIT
[INFO] Running org.apache.maven.surefire.its.jiras.Surefire985ParameterizedRunnerAndCategoriesIT
[INFO] Tests run: 1, Failures: 0, Errors: 0, Skipped: 0, Time elapsed: 4.419 s - in org.apache.maven.surefire.its.jiras.Surefire985ParameterizedRunnerAndCategoriesIT
[INFO] Running org.apache.maven.surefire.its.jiras.Surefire995CategoryInheritanceIT
[INFO] Tests run: 3, Failures: 0, Errors: 0, Skipped: 0, Time elapsed: 22.586 s - in org.apache.maven.surefire.its.jiras.Surefire946KillMainProcessInReusableForkIT
[INFO] Running org.apache.maven.surefire.its.jiras.Surefire972BizarreNoClassDefIT
[INFO] Tests run: 1, Failures: 0, Errors: 0, Skipped: 0, Time elapsed: 6.742 s - in org.apache.maven.surefire.its.jiras.Surefire972BizarreNoClassDefIT
[INFO] Running org.apache.maven.surefire.its.jiras.Surefire975DefaultVMEncodingIT
[INFO] Tests run: 1, Failures: 0, Errors: 0, Skipped: 0, Time elapsed: 7.106 s - in org.apache.maven.surefire.its.jiras.Surefire975DefaultVMEncodingIT
[INFO] Running org.apache.maven.surefire.its.jiras.Surefire979WrongClassLoaderIT
[INFO] Tests run: 5, Failures: 0, Errors: 0, Skipped: 0, Time elapsed: 20.553 s - in org.apache.maven.surefire.its.jiras.Surefire995CategoryInheritanceIT
[INFO] 
[INFO] Results:
[INFO] 
[WARNING] Tests run: 783, Failures: 0, Errors: 0, Skipped: 134
[INFO] 
[INFO] 
[INFO] --- maven-checkstyle-plugin:3.0.0:check (checkstyle-check) @ surefire-its ---
[INFO] 
[INFO] --- maven-failsafe-plugin:3.0.0-M2:verify (default) @ surefire-its ---
[INFO] Failsafe report directory: /home/jenkins/jenkins-slave/workspace/maven-box_maven-surefire_master@2/surefire-its/target/failsafe-reports
[INFO] 
[INFO] --- maven-install-plugin:2.5.2:install (default-install) @ surefire-its ---
[INFO] Skipping artifact installation
[INFO] 
[INFO] --- jacoco-maven-plugin:0.8.2:report (default-cli) @ surefire-its ---
[INFO] Skipping JaCoCo execution because property jacoco.skip is set.
[INFO] ------------------------------------------------------------------------
[INFO] Reactor Summary:
[INFO] 
[INFO] Apache Maven Surefire .............................. SUCCESS [ 18.786 s]
[INFO] SureFire Logger API ................................ SUCCESS [  4.110 s]
[INFO] SureFire API ....................................... SUCCESS [ 11.083 s]
[INFO] SureFire Booter .................................... SUCCESS [ 12.020 s]
[INFO] Maven Surefire Test-Grouping Support ............... SUCCESS [  5.862 s]
[INFO] SureFire Providers ................................. SUCCESS [  1.082 s]
[INFO] Shared JUnit3 Provider Code ........................ SUCCESS [  3.874 s]
[INFO] Shared Java 5 Provider Base ........................ SUCCESS [  4.719 s]
[INFO] Shared JUnit4 Provider Code ........................ SUCCESS [  4.851 s]
[INFO] Shared JUnit48 Provider Code ....................... SUCCESS [  5.472 s]
[INFO] SureFire JUnit Runner .............................. SUCCESS [  4.123 s]
[INFO] SureFire JUnit4 Runner ............................. SUCCESS [ 34.064 s]
[INFO] Maven Surefire Common .............................. SUCCESS [ 28.369 s]
[INFO] SureFire JUnitCore Runner .......................... SUCCESS [02:17 min]
[INFO] SureFire JUnit Platform Runner ..................... SUCCESS [  8.173 s]
[INFO] SureFire TestNG Utils .............................. SUCCESS [  4.633 s]
[INFO] SureFire TestNG Runner ............................. SUCCESS [  5.101 s]
[INFO] ShadeFire JUnit3 Provider .......................... SUCCESS [  1.483 s]
[INFO] Surefire Report Parser ............................. SUCCESS [  5.986 s]
[INFO] Maven Surefire Plugin .............................. SUCCESS [ 10.115 s]
[INFO] Maven Failsafe Plugin .............................. SUCCESS [ 56.643 s]
[INFO] Maven Surefire Report Plugin ....................... SUCCESS [ 14.207 s]
[INFO] Maven Surefire Integration Tests ................... SUCCESS [  01:06 h]
[INFO] ------------------------------------------------------------------------
[INFO] BUILD SUCCESS
[INFO] ------------------------------------------------------------------------
[INFO] Total time: 01:13 h
[INFO] Finished at: 2019-01-01T17:27:33+00:00
[INFO] Final Memory: 52M/173M
[INFO] ------------------------------------------------------------------------
[Pipeline] }
[Pipeline] // withEnv
[Pipeline] }
[Pipeline] // stage
[Pipeline] stage
[Pipeline] { (reporting linux-jdk11-maven3.2.x)
[Pipeline] }
[Pipeline] // stage
[Pipeline] stage
[Pipeline] { (cleanup linux-jdk11-maven3.2.x)
[Pipeline] cleanWs
[WS-CLEANUP] Deleting project workspace...
[WS-CLEANUP] Deferred wipeout is used...
[WS-CLEANUP] done
[Pipeline] }
[Pipeline] // stage
[Pipeline] }
[Pipeline] // ws
[Pipeline] }
[Pipeline] // timestamps
[Pipeline] }
[Pipeline] // node
[Pipeline] }
Terminated
[INFO] Tests run: 1, Failures: 0, Errors: 0, Skipped: 0, Time elapsed: 4.862 s - in org.apache.maven.surefire.its.jiras.Surefire979WrongClassLoaderIT
[INFO] Running org.apache.maven.surefire.its.jiras.Surefire985ParameterizedRunnerAndCategoriesIT
[INFO] Tests run: 1, Failures: 0, Errors: 0, Skipped: 0, Time elapsed: 4.298 s - in org.apache.maven.surefire.its.jiras.Surefire985ParameterizedRunnerAndCategoriesIT
[INFO] Running org.apache.maven.surefire.its.jiras.Surefire995CategoryInheritanceIT
[INFO] Tests run: 5, Failures: 0, Errors: 0, Skipped: 0, Time elapsed: 21.698 s - in org.apache.maven.surefire.its.jiras.Surefire995CategoryInheritanceIT
[INFO] 
[INFO] Results:
[INFO] 
[WARNING] Tests run: 783, Failures: 0, Errors: 0, Skipped: 157
[INFO] 
[INFO] 
[INFO] --- maven-checkstyle-plugin:3.0.0:check (checkstyle-check) @ surefire-its ---
[INFO] 
[INFO] --- maven-failsafe-plugin:3.0.0-M2:verify (default) @ surefire-its ---
[INFO] Failsafe report directory: /home/jenkins/jenkins-slave/workspace/maven-box_maven-surefire_master@2/surefire-its/target/failsafe-reports
[INFO] 
[INFO] --- maven-install-plugin:2.5.2:install (default-install) @ surefire-its ---
[INFO] Skipping artifact installation
[INFO] 
[INFO] --- jacoco-maven-plugin:0.8.2:report (default-cli) @ surefire-its ---
[INFO] Skipping JaCoCo execution because property jacoco.skip is set.
[INFO] ------------------------------------------------------------------------
[INFO] Reactor Summary:
[INFO] 
[INFO] Apache Maven Surefire .............................. SUCCESS [ 20.469 s]
[INFO] SureFire Logger API ................................ SUCCESS [  4.376 s]
[INFO] SureFire API ....................................... SUCCESS [ 12.179 s]
[INFO] SureFire Booter .................................... SUCCESS [ 12.158 s]
[INFO] Maven Surefire Test-Grouping Support ............... SUCCESS [  5.907 s]
[INFO] SureFire Providers ................................. SUCCESS [  1.122 s]
[INFO] Shared JUnit3 Provider Code ........................ SUCCESS [  3.779 s]
[INFO] Shared Java 5 Provider Base ........................ SUCCESS [  4.833 s]
[INFO] Shared JUnit4 Provider Code ........................ SUCCESS [  5.791 s]
[INFO] Shared JUnit48 Provider Code ....................... SUCCESS [  6.223 s]
[INFO] SureFire JUnit Runner .............................. SUCCESS [  4.238 s]
[INFO] SureFire JUnit4 Runner ............................. SUCCESS [ 34.251 s]
[INFO] Maven Surefire Common .............................. SUCCESS [ 29.840 s]
[INFO] SureFire JUnitCore Runner .......................... SUCCESS [02:16 min]
[INFO] SureFire JUnit Platform Runner ..................... SUCCESS [  8.076 s]
[INFO] SureFire TestNG Utils .............................. SUCCESS [  4.304 s]
[INFO] SureFire TestNG Runner ............................. SUCCESS [  5.060 s]
[INFO] ShadeFire JUnit3 Provider .......................... SUCCESS [  1.645 s]
[INFO] Surefire Report Parser ............................. SUCCESS [  5.712 s]
[INFO] Maven Surefire Plugin .............................. SUCCESS [ 10.288 s]
[INFO] Maven Failsafe Plugin .............................. SUCCESS [01:07 min]
[INFO] Maven Surefire Report Plugin ....................... SUCCESS [ 16.264 s]
[INFO] Maven Surefire Integration Tests ................... SUCCESS [  01:04 h]
[INFO] ------------------------------------------------------------------------
[INFO] BUILD SUCCESS
[INFO] ------------------------------------------------------------------------
[INFO] Total time: 01:10 h
[INFO] Finished at: 2019-01-01T17:28:04+00:00
[INFO] Final Memory: 52M/174M
[INFO] ------------------------------------------------------------------------
[Pipeline] }
[Pipeline] // withEnv
[Pipeline] }
[Pipeline] // stage
[Pipeline] stage
[Pipeline] { (reporting linux-jdk7-maven3.2.x)
[Pipeline] }
[Pipeline] // stage
[Pipeline] stage
[Pipeline] { (cleanup linux-jdk7-maven3.2.x)
[Pipeline] cleanWs
[WS-CLEANUP] Deleting project workspace...
[WS-CLEANUP] Deferred wipeout is used...
[WS-CLEANUP] done
[Pipeline] }
[Pipeline] // stage
[Pipeline] }
[Pipeline] // ws
[Pipeline] }
[Pipeline] // timestamps
[Pipeline] }
[Pipeline] // node
[Pipeline] }
Cancelling nested steps due to timeout
[Pipeline] // node
[Pipeline] // node
[Pipeline] // node
[Pipeline] // node
[Pipeline] // node
[Pipeline] // node
[Pipeline] // node
[Pipeline] // node
[Pipeline] // node
[Pipeline] // node
[Pipeline] // node
[Pipeline] // node
[Pipeline] }
Failed in branch windows-jdk12-maven3.5.x
[Pipeline] }
Failed in branch windows-jdk11-maven3.5.x
[Pipeline] }
Failed in branch windows-jdk8-maven3.5.x
[Pipeline] }
Failed in branch windows-jdk7-maven3.5.x
[Pipeline] }
Failed in branch windows-jdk12-maven3.3.x
[Pipeline] }
Failed in branch windows-jdk11-maven3.3.x
[Pipeline] }
Failed in branch windows-jdk8-maven3.3.x
[Pipeline] }
Failed in branch windows-jdk7-maven3.3.x
[Pipeline] }
Failed in branch windows-jdk12-maven3.2.x
[Pipeline] }
Failed in branch windows-jdk11-maven3.2.x
[Pipeline] }
Failed in branch windows-jdk8-maven3.2.x
[Pipeline] }
Failed in branch windows-jdk7-maven3.2.x
[Pipeline] // parallel
[Pipeline] echo
hudson.AbortException: hudson.AbortException: script returned exit code 1
[Pipeline] stage
[Pipeline] { (notifications)
[Pipeline] echo
Build result: FAILURE
[Pipeline] jiraIssueSelector
[Pipeline] emailext
Mime
  • Unnamed multipart/mixed (inline, None, 0 bytes)
View raw message