maven-notifications mailing list archives

Site index · List index
Message view « Date » · « Thread »
Top « Date » · « Thread »
From Apache Jenkins Server <jenk...@builds.apache.org>
Subject Build unstable in Jenkins: Maven TLP » maven-scm » SCM-318 #4
Date Tue, 01 Jan 2019 21:51:40 GMT
See https://builds.apache.org/job/maven-box/job/maven-scm/job/SCM-318/4/

Changes:

* add mavenLinkerPublisher

3 tests failed.
FAILED:  org.apache.maven.scm.plugin.UntagMojoTest.linux-jdk7 / Build linux-jdk7 / testUntag

Error Message:
Command failed.The git-tag command failed.

Stack Trace:
org.apache.maven.plugin.MojoExecutionException: Command failed.The git-tag command failed.
	at org.apache.maven.scm.plugin.UntagMojoTest.testUntag(UntagMojoTest.java:81)


FAILED:  org.apache.maven.scm.plugin.UntagMojoTest.linux-jdk8 / Build linux-jdk8 / testUntag

Error Message:
Command failed.The git-tag command failed.

Stack Trace:
org.apache.maven.plugin.MojoExecutionException: Command failed.The git-tag command failed.
	at org.apache.maven.scm.plugin.UntagMojoTest.testUntag(UntagMojoTest.java:81)


FAILED:  org.apache.maven.scm.plugin.UntagMojoTest.linux-jdk11 / Build linux-jdk11 / testUntag

Error Message:
Command failed.The git-tag command failed.

Stack Trace:
org.apache.maven.plugin.MojoExecutionException: Command failed.The git-tag command failed.
	at org.apache.maven.scm.plugin.UntagMojoTest.testUntag(UntagMojoTest.java:81)




Build log:
[...truncated 27286 lines...]
[INFO] Downloading from central: https://repo.maven.apache.org/maven2/org/apache/maven/doxia/doxia-site-renderer/1.7.4/doxia-site-renderer-1.7.4.pom
[INFO] Downloaded from central: https://repo.maven.apache.org/maven2/org/apache/maven/doxia/doxia-site-renderer/1.7.4/doxia-site-renderer-1.7.4.pom
(6.7 kB at 514 kB/s)
[INFO] Downloading from central: https://repo.maven.apache.org/maven2/org/apache/maven/doxia/doxia-sitetools/1.7.4/doxia-sitetools-1.7.4.pom
[INFO] Downloaded from central: https://repo.maven.apache.org/maven2/org/apache/maven/doxia/doxia-sitetools/1.7.4/doxia-sitetools-1.7.4.pom
(14 kB at 1.1 MB/s)
[INFO] Downloading from central: https://repo.maven.apache.org/maven2/org/apache/maven/doxia/doxia-core/1.7/doxia-core-1.7.pom
[INFO] Downloaded from central: https://repo.maven.apache.org/maven2/org/apache/maven/doxia/doxia-core/1.7/doxia-core-1.7.pom
(4.1 kB at 313 kB/s)
[INFO] Downloading from central: https://repo.maven.apache.org/maven2/org/apache/maven/doxia/doxia-decoration-model/1.7.4/doxia-decoration-model-1.7.4.pom
[INFO] Downloaded from central: https://repo.maven.apache.org/maven2/org/apache/maven/doxia/doxia-decoration-model/1.7.4/doxia-decoration-model-1.7.4.pom
(3.4 kB at 242 kB/s)
[INFO] Downloading from central: https://repo.maven.apache.org/maven2/org/apache/maven/doxia/doxia-skin-model/1.7.4/doxia-skin-model-1.7.4.pom
[INFO] Downloaded from central: https://repo.maven.apache.org/maven2/org/apache/maven/doxia/doxia-skin-model/1.7.4/doxia-skin-model-1.7.4.pom
(3.0 kB at 252 kB/s)
[INFO] Downloading from central: https://repo.maven.apache.org/maven2/org/apache/maven/doxia/doxia-module-xhtml/1.7/doxia-module-xhtml-1.7.pom
[INFO] Downloaded from central: https://repo.maven.apache.org/maven2/org/apache/maven/doxia/doxia-module-xhtml/1.7/doxia-module-xhtml-1.7.pom
(1.6 kB at 136 kB/s)
[INFO] Downloading from central: https://repo.maven.apache.org/maven2/org/apache/maven/doxia/doxia-modules/1.7/doxia-modules-1.7.pom
[INFO] Downloaded from central: https://repo.maven.apache.org/maven2/org/apache/maven/doxia/doxia-modules/1.7/doxia-modules-1.7.pom
(2.6 kB at 202 kB/s)
[INFO] Downloading from central: https://repo.maven.apache.org/maven2/org/codehaus/groovy/groovy-all/2.4.8/groovy-all-2.4.8.pom
[INFO] Downloaded from central: https://repo.maven.apache.org/maven2/org/codehaus/groovy/groovy-all/2.4.8/groovy-all-2.4.8.pom
(21 kB at 1.6 MB/s)
[INFO] Downloading from central: https://repo.maven.apache.org/maven2/org/apache/maven/shared/maven-invoker/3.0.1/maven-invoker-3.0.1.jar
[INFO] Downloading from central: https://repo.maven.apache.org/maven2/org/apache/maven/reporting/maven-reporting-impl/2.4/maven-reporting-impl-2.4.jar
[INFO] Downloading from central: https://repo.maven.apache.org/maven2/commons-digester/commons-digester/1.8.1/commons-digester-1.8.1.jar
[INFO] Downloading from central: https://repo.maven.apache.org/maven2/commons-beanutils/commons-beanutils/1.8.3/commons-beanutils-1.8.3.jar
[INFO] Downloading from central: https://repo.maven.apache.org/maven2/commons-validator/commons-validator/1.4.1/commons-validator-1.4.1.jar
[INFO] Downloaded from central: https://repo.maven.apache.org/maven2/org/apache/maven/shared/maven-invoker/3.0.1/maven-invoker-3.0.1.jar
(33 kB at 1.8 MB/s)
[INFO] Downloading from central: https://repo.maven.apache.org/maven2/commons-logging/commons-logging/1.2/commons-logging-1.2.jar
[INFO] Downloaded from central: https://repo.maven.apache.org/maven2/org/apache/maven/reporting/maven-reporting-impl/2.4/maven-reporting-impl-2.4.jar
(20 kB at 1.1 MB/s)
[INFO] Downloading from central: https://repo.maven.apache.org/maven2/org/apache/maven/shared/maven-script-interpreter/1.2/maven-script-interpreter-1.2.jar
[INFO] Downloaded from central: https://repo.maven.apache.org/maven2/commons-digester/commons-digester/1.8.1/commons-digester-1.8.1.jar
(146 kB at 7.0 MB/s)
[INFO] Downloading from central: https://repo.maven.apache.org/maven2/org/apache/ant/ant/1.8.1/ant-1.8.1.jar
[INFO] Downloaded from central: https://repo.maven.apache.org/maven2/commons-validator/commons-validator/1.4.1/commons-validator-1.4.1.jar
(190 kB at 7.0 MB/s)
[INFO] Downloading from central: https://repo.maven.apache.org/maven2/org/apache/maven/shared/maven-artifact-transfer/0.9.1/maven-artifact-transfer-0.9.1.jar
[INFO] Downloaded from central: https://repo.maven.apache.org/maven2/commons-beanutils/commons-beanutils/1.8.3/commons-beanutils-1.8.3.jar
(232 kB at 8.9 MB/s)
[INFO] Downloading from central: https://repo.maven.apache.org/maven2/org/apache/maven/doxia/doxia-sink-api/1.7/doxia-sink-api-1.7.jar
[INFO] Downloaded from central: https://repo.maven.apache.org/maven2/commons-logging/commons-logging/1.2/commons-logging-1.2.jar
(62 kB at 1.9 MB/s)
[INFO] Downloading from central: https://repo.maven.apache.org/maven2/org/apache/maven/doxia/doxia-logging-api/1.7/doxia-logging-api-1.7.jar
[INFO] Downloaded from central: https://repo.maven.apache.org/maven2/org/apache/maven/shared/maven-script-interpreter/1.2/maven-script-interpreter-1.2.jar
(22 kB at 649 kB/s)
[INFO] Downloading from central: https://repo.maven.apache.org/maven2/org/apache/maven/doxia/doxia-site-renderer/1.7.4/doxia-site-renderer-1.7.4.jar
[INFO] Downloaded from central: https://repo.maven.apache.org/maven2/org/apache/maven/doxia/doxia-sink-api/1.7/doxia-sink-api-1.7.jar
(11 kB at 265 kB/s)
[INFO] Downloading from central: https://repo.maven.apache.org/maven2/org/apache/maven/doxia/doxia-decoration-model/1.7.4/doxia-decoration-model-1.7.4.jar
[INFO] Downloaded from central: https://repo.maven.apache.org/maven2/org/apache/maven/doxia/doxia-logging-api/1.7/doxia-logging-api-1.7.jar
(12 kB at 251 kB/s)
[INFO] Downloading from central: https://repo.maven.apache.org/maven2/org/apache/maven/doxia/doxia-skin-model/1.7.4/doxia-skin-model-1.7.4.jar
[INFO] Downloaded from central: https://repo.maven.apache.org/maven2/org/apache/maven/shared/maven-artifact-transfer/0.9.1/maven-artifact-transfer-0.9.1.jar
(123 kB at 2.7 MB/s)
[INFO] Downloading from central: https://repo.maven.apache.org/maven2/org/apache/maven/doxia/doxia-module-xhtml/1.7/doxia-module-xhtml-1.7.jar
[INFO] Downloaded from central: https://repo.maven.apache.org/maven2/org/apache/maven/doxia/doxia-site-renderer/1.7.4/doxia-site-renderer-1.7.4.jar
(64 kB at 1.2 MB/s)
[INFO] Downloading from central: https://repo.maven.apache.org/maven2/org/codehaus/groovy/groovy-all/2.4.8/groovy-all-2.4.8.jar
[INFO] Downloaded from central: https://repo.maven.apache.org/maven2/org/apache/maven/doxia/doxia-decoration-model/1.7.4/doxia-decoration-model-1.7.4.jar
(61 kB at 1.1 MB/s)
[INFO] Downloaded from central: https://repo.maven.apache.org/maven2/org/apache/maven/doxia/doxia-skin-model/1.7.4/doxia-skin-model-1.7.4.jar
(16 kB at 276 kB/s)
[INFO] Downloaded from central: https://repo.maven.apache.org/maven2/org/apache/maven/doxia/doxia-module-xhtml/1.7/doxia-module-xhtml-1.7.jar
(17 kB at 291 kB/s)
[INFO] Downloaded from central: https://repo.maven.apache.org/maven2/org/apache/ant/ant/1.8.1/ant-1.8.1.jar
(1.5 MB at 16 MB/s)
[INFO] Downloaded from central: https://repo.maven.apache.org/maven2/org/codehaus/groovy/groovy-all/2.4.8/groovy-all-2.4.8.jar
(7.0 MB at 20 MB/s)
[INFO] Installing /home/jenkins/jenkins-slave/workspace/maven-box_maven-scm_SCM-318/m/maven-scm-managers/maven-scm-manager-plexus/pom.xml
to /home/jenkins/jenkins-slave/workspace/maven-box_maven-scm_SCM-318/m/maven-scm-plugin/target/local-repo/org/apache/maven/scm/maven-scm-manager-plexus/1.11.2-SNAPSHOT/maven-scm-manager-plexus-1.11.2-SNAPSHOT.pom
[INFO] Installing /home/jenkins/jenkins-slave/workspace/maven-box_maven-scm_SCM-318/m/maven-scm-managers/maven-scm-manager-plexus/target/maven-scm-manager-plexus-1.11.2-SNAPSHOT.jar
to /home/jenkins/jenkins-slave/workspace/maven-box_maven-scm_SCM-318/m/maven-scm-plugin/target/local-repo/org/apache/maven/scm/maven-scm-manager-plexus/1.11.2-SNAPSHOT/maven-scm-manager-plexus-1.11.2-SNAPSHOT.jar
[INFO] Installing /home/jenkins/jenkins-slave/workspace/maven-box_maven-scm_SCM-318/m/maven-scm-managers/pom.xml
to /home/jenkins/jenkins-slave/workspace/maven-box_maven-scm_SCM-318/m/maven-scm-plugin/target/local-repo/org/apache/maven/scm/maven-scm-managers/1.11.2-SNAPSHOT/maven-scm-managers-1.11.2-SNAPSHOT.pom
[INFO] Installing /home/jenkins/jenkins-slave/workspace/maven-box_maven-scm_SCM-318/m/pom.xml
to /home/jenkins/jenkins-slave/workspace/maven-box_maven-scm_SCM-318/m/maven-scm-plugin/target/local-repo/org/apache/maven/scm/maven-scm/1.11.2-SNAPSHOT/maven-scm-1.11.2-SNAPSHOT.pom
[INFO] Installing /home/jenkins/jenkins-slave/workspace/maven-box_maven-scm_SCM-318/m/maven-scm-providers/maven-scm-providers-git/maven-scm-provider-gittest/pom.xml
to /home/jenkins/jenkins-slave/workspace/maven-box_maven-scm_SCM-318/m/maven-scm-plugin/target/local-repo/org/apache/maven/scm/maven-scm-provider-gittest/1.11.2-SNAPSHOT/maven-scm-provider-gittest-1.11.2-SNAPSHOT.pom
[INFO] Installing /home/jenkins/jenkins-slave/workspace/maven-box_maven-scm_SCM-318/m/maven-scm-providers/maven-scm-providers-git/maven-scm-provider-gittest/target/maven-scm-provider-gittest-1.11.2-SNAPSHOT.jar
to /home/jenkins/jenkins-slave/workspace/maven-box_maven-scm_SCM-318/m/maven-scm-plugin/target/local-repo/org/apache/maven/scm/maven-scm-provider-gittest/1.11.2-SNAPSHOT/maven-scm-provider-gittest-1.11.2-SNAPSHOT.jar
[INFO] Installing /home/jenkins/jenkins-slave/workspace/maven-box_maven-scm_SCM-318/m/maven-scm-providers/maven-scm-providers-git/pom.xml
to /home/jenkins/jenkins-slave/workspace/maven-box_maven-scm_SCM-318/m/maven-scm-plugin/target/local-repo/org/apache/maven/scm/maven-scm-providers-git/1.11.2-SNAPSHOT/maven-scm-providers-git-1.11.2-SNAPSHOT.pom
[INFO] Installing /home/jenkins/jenkins-slave/workspace/maven-box_maven-scm_SCM-318/m/maven-scm-providers/pom.xml
to /home/jenkins/jenkins-slave/workspace/maven-box_maven-scm_SCM-318/m/maven-scm-plugin/target/local-repo/org/apache/maven/scm/maven-scm-providers/1.11.2-SNAPSHOT/maven-scm-providers-1.11.2-SNAPSHOT.pom
[INFO] Installing /home/jenkins/jenkins-slave/workspace/maven-box_maven-scm_SCM-318/m/maven-scm-providers/maven-scm-provider-local/pom.xml
to /home/jenkins/jenkins-slave/workspace/maven-box_maven-scm_SCM-318/m/maven-scm-plugin/target/local-repo/org/apache/maven/scm/maven-scm-provider-local/1.11.2-SNAPSHOT/maven-scm-provider-local-1.11.2-SNAPSHOT.pom
[INFO] Installing /home/jenkins/jenkins-slave/workspace/maven-box_maven-scm_SCM-318/m/maven-scm-providers/maven-scm-provider-local/target/maven-scm-provider-local-1.11.2-SNAPSHOT.jar
to /home/jenkins/jenkins-slave/workspace/maven-box_maven-scm_SCM-318/m/maven-scm-plugin/target/local-repo/org/apache/maven/scm/maven-scm-provider-local/1.11.2-SNAPSHOT/maven-scm-provider-local-1.11.2-SNAPSHOT.jar
[INFO] Installing /home/jenkins/jenkins-slave/workspace/maven-box_maven-scm_SCM-318/m/maven-scm-providers/maven-scm-providers-svn/maven-scm-provider-svn-commons/pom.xml
to /home/jenkins/jenkins-slave/workspace/maven-box_maven-scm_SCM-318/m/maven-scm-plugin/target/local-repo/org/apache/maven/scm/maven-scm-provider-svn-commons/1.11.2-SNAPSHOT/maven-scm-provider-svn-commons-1.11.2-SNAPSHOT.pom
[INFO] Installing /home/jenkins/jenkins-slave/workspace/maven-box_maven-scm_SCM-318/m/maven-scm-providers/maven-scm-providers-svn/maven-scm-provider-svn-commons/target/maven-scm-provider-svn-commons-1.11.2-SNAPSHOT.jar
to /home/jenkins/jenkins-slave/workspace/maven-box_maven-scm_SCM-318/m/maven-scm-plugin/target/local-repo/org/apache/maven/scm/maven-scm-provider-svn-commons/1.11.2-SNAPSHOT/maven-scm-provider-svn-commons-1.11.2-SNAPSHOT.jar
[INFO] Installing /home/jenkins/jenkins-slave/workspace/maven-box_maven-scm_SCM-318/m/maven-scm-providers/maven-scm-providers-svn/pom.xml
to /home/jenkins/jenkins-slave/workspace/maven-box_maven-scm_SCM-318/m/maven-scm-plugin/target/local-repo/org/apache/maven/scm/maven-scm-providers-svn/1.11.2-SNAPSHOT/maven-scm-providers-svn-1.11.2-SNAPSHOT.pom
[INFO] Installing /home/jenkins/jenkins-slave/workspace/maven-box_maven-scm_SCM-318/m/maven-scm-providers/maven-scm-providers-svn/maven-scm-provider-svntest/pom.xml
to /home/jenkins/jenkins-slave/workspace/maven-box_maven-scm_SCM-318/m/maven-scm-plugin/target/local-repo/org/apache/maven/scm/maven-scm-provider-svntest/1.11.2-SNAPSHOT/maven-scm-provider-svntest-1.11.2-SNAPSHOT.pom
[INFO] Installing /home/jenkins/jenkins-slave/workspace/maven-box_maven-scm_SCM-318/m/maven-scm-providers/maven-scm-providers-svn/maven-scm-provider-svntest/target/maven-scm-provider-svntest-1.11.2-SNAPSHOT.jar
to /home/jenkins/jenkins-slave/workspace/maven-box_maven-scm_SCM-318/m/maven-scm-plugin/target/local-repo/org/apache/maven/scm/maven-scm-provider-svntest/1.11.2-SNAPSHOT/maven-scm-provider-svntest-1.11.2-SNAPSHOT.jar
[INFO] Installing /home/jenkins/jenkins-slave/workspace/maven-box_maven-scm_SCM-318/m/maven-scm-providers/maven-scm-providers-standard/pom.xml
to /home/jenkins/jenkins-slave/workspace/maven-box_maven-scm_SCM-318/m/maven-scm-plugin/target/local-repo/org/apache/maven/scm/maven-scm-providers-standard/1.11.2-SNAPSHOT/maven-scm-providers-standard-1.11.2-SNAPSHOT.pom
[INFO] Installing /home/jenkins/jenkins-slave/workspace/maven-box_maven-scm_SCM-318/m/maven-scm-plugin/pom.xml
to /home/jenkins/jenkins-slave/workspace/maven-box_maven-scm_SCM-318/m/maven-scm-plugin/target/local-repo/org/apache/maven/plugins/maven-scm-plugin/1.11.2-SNAPSHOT/maven-scm-plugin-1.11.2-SNAPSHOT.pom
[INFO] Installing /home/jenkins/jenkins-slave/workspace/maven-box_maven-scm_SCM-318/m/maven-scm-plugin/target/maven-scm-plugin-1.11.2-SNAPSHOT.jar
to /home/jenkins/jenkins-slave/workspace/maven-box_maven-scm_SCM-318/m/maven-scm-plugin/target/local-repo/org/apache/maven/plugins/maven-scm-plugin/1.11.2-SNAPSHOT/maven-scm-plugin-1.11.2-SNAPSHOT.jar
[INFO] 
[INFO] --- maven-invoker-plugin:3.1.0:run (integration-test) @ maven-scm-plugin ---
[INFO] No projects were selected for execution.
[INFO] 
[INFO] --- maven-checkstyle-plugin:3.0.0:check (checkstyle-check) @ maven-scm-plugin ---
[INFO] ------------------------------------------------------------------------
[INFO] Reactor Summary:
[INFO] 
[INFO] Maven SCM 1.11.2-SNAPSHOT .......................... SUCCESS [ 16.498 s]
[INFO] Maven SCM API ...................................... SUCCESS [  7.890 s]
[INFO] Maven SCM Managers ................................. SUCCESS [  0.868 s]
[INFO] Maven SCM Manager for Plexus ....................... SUCCESS [  1.705 s]
[INFO] Maven SCM Test ..................................... SUCCESS [  2.966 s]
[INFO] Maven SCM Providers ................................ SUCCESS [  1.154 s]
[INFO] Maven SCM AccuRev Provider ......................... SUCCESS [  6.151 s]
[INFO] Maven SCM Bazaar Provider .......................... SUCCESS [  2.598 s]
[INFO] Maven SCM Clearcase Provider ....................... SUCCESS [  3.987 s]
[INFO] Maven SCM CVS Provider - Parent .................... SUCCESS [  0.762 s]
[INFO] Maven SCM CVS Provider TCK tests ................... SUCCESS [  1.126 s]
[INFO] Maven SCM CVS Provider - Common library ............ SUCCESS [  2.844 s]
[INFO] Maven SCM CVS Provider - CVS Executable Impl. ...... SUCCESS [  2.314 s]
[INFO] Maven SCM CVS Provider - CVS Java Impl. ............ SUCCESS [  2.712 s]
[INFO] Maven SCM Mercurial (Hg) Provider .................. SUCCESS [  2.403 s]
[INFO] Maven SCM Git Provider - Parent .................... SUCCESS [  0.839 s]
[INFO] Maven SCM Git Provider - Common library ............ SUCCESS [  2.591 s]
[INFO] Maven SCM Git Provider TCK Tests ................... SUCCESS [  1.305 s]
[INFO] Maven SCM Git Provider - Git Executable Impl. ...... SUCCESS [  5.141 s]
[INFO] Maven SCM Git Provider - JGit Impl. ................ SUCCESS [01:02 min]
[INFO] Maven SCM Local Provider ........................... SUCCESS [  2.389 s]
[INFO] Maven SCM Perforce Provider ........................ SUCCESS [  3.431 s]
[INFO] Maven SCM Starteam Provider ........................ SUCCESS [ 11.463 s]
[INFO] Maven SCM Subversion Provider - Parent ............. SUCCESS [  0.711 s]
[INFO] Maven SCM Subversion Provider - Common library ..... SUCCESS [  4.535 s]
[INFO] Maven SCM Subversion Provider TCK Tests ............ SUCCESS [  0.940 s]
[INFO] Maven SCM Subversion Provider - SVN Executable Impl. SUCCESS [  8.752 s]
[INFO] Maven SCM Synergy Provider ......................... SUCCESS [  5.028 s]
[INFO] Maven SCM Visual Source Safe Provider .............. SUCCESS [  2.855 s]
[INFO] Maven SCM TFS Provider ............................. SUCCESS [  2.711 s]
[INFO] Maven SCM MKS Integrity Provider ................... SUCCESS [  3.299 s]
[INFO] Maven SCM Jazz/Rational Team Concert Provider ...... SUCCESS [  3.717 s]
[INFO] Maven SCM Standard Providers ....................... SUCCESS [  2.439 s]
[INFO] Maven SCM Client ................................... SUCCESS [  4.842 s]
[INFO] Maven SCM Plugin 1.11.2-SNAPSHOT ................... SUCCESS [ 59.655 s]
[INFO] ------------------------------------------------------------------------
[INFO] BUILD SUCCESS
[INFO] ------------------------------------------------------------------------
[INFO] Total time: 04:07 min
[INFO] Finished at: 2019-01-01T17:29:27Z
[INFO] ------------------------------------------------------------------------
[WARNING] The requested profile "run-its" could not be activated because it does not exist.
[INFO] [jenkins-event-spy] Generated /home/jenkins/jenkins-slave/workspace/maven-box_maven-scm_SCM-318@tmp/withMavend31990fc/maven-spy-20190101-172519-89217768293015383419676.log
[Pipeline] }
[withMaven] junitPublisher - Archive test results for Maven artifact org.apache.maven.scm:maven-scm-provider-local:jar:1.11.2-SNAPSHOT
generated by maven-surefire-plugin:test (default-test): m/maven-scm-providers/maven-scm-provider-local/target/surefire-reports/*.xml
Recording test results
[Pipeline] // dir
[Pipeline] }
[withMaven] junitPublisher - Archive test results for Maven artifact org.apache.maven.scm:maven-scm-provider-perforce:jar:1.11.2-SNAPSHOT
generated by maven-surefire-plugin:test (default-test): m/maven-scm-providers/maven-scm-provider-perforce/target/surefire-reports/*.xml
Recording test results
[withMaven] invokerPublisher - Archive invoker results for Maven artifact MavenArtifact{org.apache.maven.plugins:maven-scm-plugin:maven-plugin:1.11.2-SNAPSHOT(version:
1.11.2-SNAPSHOT, snapshot:false) } generated by PluginInvocation{org.apache.maven.plugins:maven-invoker-plugin:3.1.0@run
 integration-test}: m/maven-scm-plugin/target/invoker-reports/*.xml
[withMaven] junitPublisher - Archive test results for Maven artifact org.apache.maven.scm:maven-scm-provider-starteam:jar:1.11.2-SNAPSHOT
generated by maven-surefire-plugin:test (default-test): m/maven-scm-providers/maven-scm-provider-starteam/target/surefire-reports/*.xml
Recording test results
[withMaven] junitPublisher - Archive test results for Maven artifact org.apache.maven.scm:maven-scm-api:jar:1.11.2-SNAPSHOT
generated by maven-surefire-plugin:test (default-test): m/maven-scm-api/target/surefire-reports/*.xml
Recording test results
[withMaven] junitPublisher - Archive test results for Maven artifact org.apache.maven.scm:maven-scm-provider-svn-commons:jar:1.11.2-SNAPSHOT
generated by maven-surefire-plugin:test (default-test): m/maven-scm-providers/maven-scm-providers-svn/maven-scm-provider-svn-commons/target/surefire-reports/*.xml
Recording test results
[withMaven] junitPublisher - Archive test results for Maven artifact org.apache.maven.scm:maven-scm-manager-plexus:jar:1.11.2-SNAPSHOT
generated by maven-surefire-plugin:test (default-test): m/maven-scm-managers/maven-scm-manager-plexus/target/surefire-reports/*.xml
Recording test results
[withMaven] junitPublisher - Archive test results for Maven artifact org.apache.maven.scm:maven-scm-provider-svntest:jar:1.11.2-SNAPSHOT
generated by maven-surefire-plugin:test (default-test): m/maven-scm-providers/maven-scm-providers-svn/maven-scm-provider-svntest/target/surefire-reports/*.xml
Recording test results
None of the test reports contained any result
[withMaven] junitPublisher - Archive test results for Maven artifact org.apache.maven.scm:maven-scm-test:jar:1.11.2-SNAPSHOT
generated by maven-surefire-plugin:test (default-test): m/maven-scm-test/target/surefire-reports/*.xml
Recording test results
None of the test reports contained any result
[withMaven] junitPublisher - Archive test results for Maven artifact org.apache.maven.scm:maven-scm-provider-svnexe:jar:1.11.2-SNAPSHOT
generated by maven-surefire-plugin:test (default-test): m/maven-scm-providers/maven-scm-providers-svn/maven-scm-provider-svnexe/target/surefire-reports/*.xml
Recording test results
[withMaven] junitPublisher - Archive test results for Maven artifact org.apache.maven.scm:maven-scm-provider-accurev:jar:1.11.2-SNAPSHOT
generated by maven-surefire-plugin:test (default-test): m/maven-scm-providers/maven-scm-provider-accurev/target/surefire-reports/*.xml
Recording test results
[withMaven] junitPublisher - Archive test results for Maven artifact org.apache.maven.scm:maven-scm-provider-synergy:jar:1.11.2-SNAPSHOT
generated by maven-surefire-plugin:test (default-test): m/maven-scm-providers/maven-scm-provider-synergy/target/surefire-reports/*.xml
Recording test results
[withMaven] junitPublisher - Archive test results for Maven artifact org.apache.maven.scm:maven-scm-provider-bazaar:jar:1.11.2-SNAPSHOT
generated by maven-surefire-plugin:test (default-test): m/maven-scm-providers/maven-scm-provider-bazaar/target/surefire-reports/*.xml
Recording test results
[withMaven] junitPublisher - Archive test results for Maven artifact org.apache.maven.scm:maven-scm-provider-vss:jar:1.11.2-SNAPSHOT
generated by maven-surefire-plugin:test (default-test): m/maven-scm-providers/maven-scm-provider-vss/target/surefire-reports/*.xml
Recording test results
[withMaven] junitPublisher - Archive test results for Maven artifact org.apache.maven.scm:maven-scm-provider-clearcase:jar:1.11.2-SNAPSHOT
generated by maven-surefire-plugin:test (default-test): m/maven-scm-providers/maven-scm-provider-clearcase/target/surefire-reports/*.xml
Recording test results
[withMaven] junitPublisher - Archive test results for Maven artifact org.apache.maven.scm:maven-scm-provider-tfs:jar:1.11.2-SNAPSHOT
generated by maven-surefire-plugin:test (default-test): m/maven-scm-providers/maven-scm-provider-tfs/target/surefire-reports/*.xml
Recording test results
[withMaven] junitPublisher - Archive test results for Maven artifact org.apache.maven.scm:maven-scm-provider-cvstest:jar:1.11.2-SNAPSHOT
generated by maven-surefire-plugin:test (default-test): m/maven-scm-providers/maven-scm-providers-cvs/maven-scm-provider-cvstest/target/surefire-reports/*.xml
Recording test results
[withMaven] junitPublisher - Archive test results for Maven artifact org.apache.maven.scm:maven-scm-provider-integrity:jar:1.11.2-SNAPSHOT
generated by maven-surefire-plugin:test (default-test): m/maven-scm-providers/maven-scm-provider-integrity/target/surefire-reports/*.xml
Recording test results
None of the test reports contained any result
[withMaven] junitPublisher - Archive test results for Maven artifact org.apache.maven.scm:maven-scm-provider-cvs-commons:jar:1.11.2-SNAPSHOT
generated by maven-surefire-plugin:test (default-test): m/maven-scm-providers/maven-scm-providers-cvs/maven-scm-provider-cvs-commons/target/surefire-reports/*.xml
Recording test results
[withMaven] junitPublisher - Archive test results for Maven artifact org.apache.maven.scm:maven-scm-provider-jazz:jar:1.11.2-SNAPSHOT
generated by maven-surefire-plugin:test (default-test): m/maven-scm-providers/maven-scm-provider-jazz/target/surefire-reports/*.xml
Recording test results
[withMaven] junitPublisher - Archive test results for Maven artifact org.apache.maven.scm:maven-scm-provider-cvsexe:jar:1.11.2-SNAPSHOT
generated by maven-surefire-plugin:test (default-test): m/maven-scm-providers/maven-scm-providers-cvs/maven-scm-provider-cvsexe/target/surefire-reports/*.xml
Recording test results
[withMaven] junitPublisher - Archive test results for Maven artifact org.apache.maven.scm:maven-scm-client:jar:1.11.2-SNAPSHOT
generated by maven-surefire-plugin:test (default-test): m/maven-scm-client/target/surefire-reports/*.xml
Recording test results
[withMaven] junitPublisher - Archive test results for Maven artifact org.apache.maven.scm:maven-scm-provider-cvsjava:jar:1.11.2-SNAPSHOT
generated by maven-surefire-plugin:test (default-test): m/maven-scm-providers/maven-scm-providers-cvs/maven-scm-provider-cvsjava/target/surefire-reports/*.xml
Recording test results
None of the test reports contained any result
[withMaven] junitPublisher - Archive test results for Maven artifact org.apache.maven.plugins:maven-scm-plugin:maven-plugin:1.11.2-SNAPSHOT
generated by maven-surefire-plugin:test (default-test): m/maven-scm-plugin/target/surefire-reports/*.xml
Recording test results
[withMaven] junitPublisher - Archive test results for Maven artifact org.apache.maven.scm:maven-scm-provider-hg:jar:1.11.2-SNAPSHOT
generated by maven-surefire-plugin:test (default-test): m/maven-scm-providers/maven-scm-provider-hg/target/surefire-reports/*.xml
Recording test results
[withMaven] junitPublisher - Archive test results for Maven artifact org.apache.maven.scm:maven-scm-provider-git-commons:jar:1.11.2-SNAPSHOT
generated by maven-surefire-plugin:test (default-test): m/maven-scm-providers/maven-scm-providers-git/maven-scm-provider-git-commons/target/surefire-reports/*.xml
Recording test results
[withMaven] junitPublisher - Archive test results for Maven artifact org.apache.maven.scm:maven-scm-provider-gittest:jar:1.11.2-SNAPSHOT
generated by maven-surefire-plugin:test (default-test): m/maven-scm-providers/maven-scm-providers-git/maven-scm-provider-gittest/target/surefire-reports/*.xml
Recording test results
None of the test reports contained any result
[withMaven] junitPublisher - Archive test results for Maven artifact org.apache.maven.scm:maven-scm-provider-gitexe:jar:1.11.2-SNAPSHOT
generated by maven-surefire-plugin:test (default-test): m/maven-scm-providers/maven-scm-providers-git/maven-scm-provider-gitexe/target/surefire-reports/*.xml
Recording test results
[withMaven] junitPublisher - Archive test results for Maven artifact org.apache.maven.scm:maven-scm-provider-jgit:jar:1.11.2-SNAPSHOT
generated by maven-surefire-plugin:test (default-test): m/maven-scm-providers/maven-scm-providers-git/maven-scm-provider-jgit/target/surefire-reports/*.xml
Recording test results
[withMaven] junitPublisher - Archive test results for Maven artifact org.apache.maven.scm:maven-scm-provider-local:jar:1.11.2-SNAPSHOT
generated by maven-surefire-plugin:test (default-test): m/maven-scm-providers/maven-scm-provider-local/target/surefire-reports/*.xml
Recording test results
[withMaven] junitPublisher - Archive test results for Maven artifact org.apache.maven.scm:maven-scm-provider-perforce:jar:1.11.2-SNAPSHOT
generated by maven-surefire-plugin:test (default-test): m/maven-scm-providers/maven-scm-provider-perforce/target/surefire-reports/*.xml
Recording test results
[withMaven] Publishers: Pipeline Graph Publisher: 20 ms, Invoker Publisher: 532 ms, Junit
Publisher: 142572 ms, Concordion Publisher: 3 ms, Dependencies Fingerprint Publisher: 21295
ms, JGiven Publisher: 1 ms, Jacoco Publisher: 1 ms, SpotBugs Publisher: 1 ms
[Pipeline] // withMaven
[withMaven] junitPublisher - Archive test results for Maven artifact org.apache.maven.scm:maven-scm-provider-starteam:jar:1.11.2-SNAPSHOT
generated by maven-surefire-plugin:test (default-test): m/maven-scm-providers/maven-scm-provider-starteam/target/surefire-reports/*.xml
Recording test results
[Pipeline] cleanWs
[WS-CLEANUP] Deleting project workspace...
[WS-CLEANUP] Deferred wipeout is used...
[WS-CLEANUP] done
[Pipeline] }
[withMaven] junitPublisher - Archive test results for Maven artifact org.apache.maven.scm:maven-scm-provider-svn-commons:jar:1.11.2-SNAPSHOT
generated by maven-surefire-plugin:test (default-test): m/maven-scm-providers/maven-scm-providers-svn/maven-scm-provider-svn-commons/target/surefire-reports/*.xml
Recording test results
[Pipeline] // stage
[Pipeline] }
[Pipeline] // node
[Pipeline] }
[withMaven] junitPublisher - Archive test results for Maven artifact org.apache.maven.scm:maven-scm-provider-svntest:jar:1.11.2-SNAPSHOT
generated by maven-surefire-plugin:test (default-test): m/maven-scm-providers/maven-scm-providers-svn/maven-scm-provider-svntest/target/surefire-reports/*.xml
Recording test results
None of the test reports contained any result
[withMaven] junitPublisher - Archive test results for Maven artifact org.apache.maven.scm:maven-scm-provider-svnexe:jar:1.11.2-SNAPSHOT
generated by maven-surefire-plugin:test (default-test): m/maven-scm-providers/maven-scm-providers-svn/maven-scm-provider-svnexe/target/surefire-reports/*.xml
Recording test results
[withMaven] junitPublisher - Archive test results for Maven artifact org.apache.maven.scm:maven-scm-provider-synergy:jar:1.11.2-SNAPSHOT
generated by maven-surefire-plugin:test (default-test): m/maven-scm-providers/maven-scm-provider-synergy/target/surefire-reports/*.xml
Recording test results
[withMaven] junitPublisher - Archive test results for Maven artifact org.apache.maven.scm:maven-scm-provider-vss:jar:1.11.2-SNAPSHOT
generated by maven-surefire-plugin:test (default-test): m/maven-scm-providers/maven-scm-provider-vss/target/surefire-reports/*.xml
Recording test results
[withMaven] junitPublisher - Archive test results for Maven artifact org.apache.maven.scm:maven-scm-provider-tfs:jar:1.11.2-SNAPSHOT
generated by maven-surefire-plugin:test (default-test): m/maven-scm-providers/maven-scm-provider-tfs/target/surefire-reports/*.xml
Recording test results
[withMaven] junitPublisher - Archive test results for Maven artifact org.apache.maven.scm:maven-scm-provider-integrity:jar:1.11.2-SNAPSHOT
generated by maven-surefire-plugin:test (default-test): m/maven-scm-providers/maven-scm-provider-integrity/target/surefire-reports/*.xml
Recording test results
[withMaven] junitPublisher - Archive test results for Maven artifact org.apache.maven.scm:maven-scm-provider-jazz:jar:1.11.2-SNAPSHOT
generated by maven-surefire-plugin:test (default-test): m/maven-scm-providers/maven-scm-provider-jazz/target/surefire-reports/*.xml
Recording test results
[withMaven] junitPublisher - Archive test results for Maven artifact org.apache.maven.scm:maven-scm-client:jar:1.11.2-SNAPSHOT
generated by maven-surefire-plugin:test (default-test): m/maven-scm-client/target/surefire-reports/*.xml
Recording test results
None of the test reports contained any result
[withMaven] junitPublisher - Archive test results for Maven artifact org.apache.maven.plugins:maven-scm-plugin:maven-plugin:1.11.2-SNAPSHOT
generated by maven-surefire-plugin:test (default-test): m/maven-scm-plugin/target/surefire-reports/*.xml
Recording test results
[withMaven] Publishers: Pipeline Graph Publisher: 19 ms, Invoker Publisher: 12060 ms, Junit
Publisher: 154617 ms, Concordion Publisher: 2 ms, Dependencies Fingerprint Publisher: 21347
ms, JGiven Publisher: 1 ms, Jacoco Publisher: 1 ms, SpotBugs Publisher: 1 ms
[Pipeline] // withMaven
[Pipeline] cleanWs
[WS-CLEANUP] Deleting project workspace...
[WS-CLEANUP] Deferred wipeout is used...
[WS-CLEANUP] done
[Pipeline] }
[Pipeline] // stage
[Pipeline] }
[Pipeline] // node
[Pipeline] }
Aborted by michaelo
[Pipeline] // node
[Pipeline] // node
[Pipeline] // node
[Pipeline] }
Failed in branch windows-jdk7
[Pipeline] }
Failed in branch windows-jdk8
[Pipeline] }
Failed in branch windows-jdk11
[Pipeline] // parallel
[Pipeline] stage
[Pipeline] { (Notifications)
[Pipeline] echo
Build result: UNSTABLE
[Pipeline] jiraIssueSelector
[Pipeline] emailext
Mime
  • Unnamed multipart/mixed (inline, None, 0 bytes)
View raw message