maven-notifications mailing list archives

Site index · List index
Message view « Date » · « Thread »
Top « Date » · « Thread »
From Apache Jenkins Server <jenk...@builds.apache.org>
Subject Build failed in Jenkins: Maven TLP » maven-enforcer » MENFORCER-276 #21
Date Thu, 10 Jan 2019 07:20:33 GMT
See https://builds.apache.org/job/maven-box/job/maven-enforcer/job/MENFORCER-276/21/

Changes:

* Disable cleanWs() due to issues with file handles on Windows
* added a link to asf-gitpubsub-jenkins-plugin
* fixed markup (asciidoc, not markdown...)

No tests ran.

Build log:
[...truncated 3189 lines...]
[ERROR] 
[ERROR] Re-run Maven using the -X switch to enable full debug logging.
[ERROR] 
[ERROR] For more information about the errors and possible solutions, please read the following
articles:
[ERROR] [Help 1] http://cwiki.apache.org/confluence/display/MAVEN/MojoFailureException
[ERROR] 
[ERROR] After correcting the problems, you can resume the build with the command
[ERROR]   mvn <goals> -rf :enforcer-rules
[INFO] Changes detected - recompiling the module!
[INFO] Compiling 5 source files to F:\jenkins\jenkins-slave\workspace\box_maven-enforcer_MENFORCER-276@2\windows-jdk11-m3.5.x_build\enforcer-api\target\classes
Picked up JAVA_TOOL_OPTIONS: -Dmaven.ext.class.path="f:\jenkins\jenkins-slave\workspace\box_maven-enforcer_MENFORCER-276@2@tmp\withMaven64d46418\pipeline-maven-spy.jar"
-Dorg.jenkinsci.plugins.pipeline.maven.reportsFolder="f:\jenkins\jenkins-slave\workspace\box_maven-enforcer_MENFORCER-276@2@tmp\withMaven64d46418"

[Pipeline] }
[Pipeline] // dir
[Pipeline] }
[withMaven] artifactsPublisher - Archive artifact windows-jdk8-m3.5.x_build\pom.xml under
org\apache\maven\enforcer\enforcer\3.0.0-SNAPSHOT\enforcer-3.0.0-SNAPSHOT.pom
[withMaven] artifactsPublisher - Archive artifact windows-jdk8-m3.5.x_build\target\enforcer-3.0.0-SNAPSHOT-site.xml
under org\apache\maven\enforcer\enforcer\3.0.0-SNAPSHOT\enforcer-3.0.0-SNAPSHOT-site.xml
[withMaven] artifactsPublisher - Archive artifact windows-jdk8-m3.5.x_build\enforcer-api\pom.xml
under org\apache\maven\enforcer\enforcer-api\3.0.0-SNAPSHOT\enforcer-api-3.0.0-SNAPSHOT.pom
[withMaven] artifactsPublisher - Archive artifact windows-jdk8-m3.5.x_build\enforcer-api\target\enforcer-api-3.0.0-SNAPSHOT.jar
under org\apache\maven\enforcer\enforcer-api\3.0.0-SNAPSHOT\enforcer-api-3.0.0-SNAPSHOT.jar
[Fast Archiver] No prior successful build to compare, so performing full copy of artifacts
[withMaven] junitPublisher - Archive test results for Maven artifact org.apache.maven.enforcer:enforcer-api:jar:3.0.0-SNAPSHOT
generated by maven-surefire-plugin:test (default-test): windows-jdk8-m3.5.x_build\enforcer-api\target\surefire-reports\*.xml
Recording test results
None of the test reports contained any result
[withMaven] openTasksPublisher - Scan Tasks for Maven artifact org.apache.maven.enforcer:enforcer-api:jar:3.0.0-SNAPSHOT
in source directory windows-jdk8-m3.5.x_build\enforcer-api\src\main\java
[withMaven] openTasksPublisher - Scan Tasks for Maven artifact org.apache.maven.enforcer:enforcer-rules:jar:3.0.0-SNAPSHOT
in source directory windows-jdk8-m3.5.x_build\enforcer-rules\src\main\java
[TASKS] Scanning folder 'f:\jenkins\jenkins-slave\workspace\box_maven-enforcer_MENFORCER-276@2'
for files matching the pattern 'windows-jdk8-m3.5.x_build\enforcer-api\src\main\java\**\*,windows-jdk8-m3.5.x_build\enforcer-rules\src\main\java\**\*'
- excludes: null
[TASKS] Found 48 files to scan for tasks
[TASKS] Found 5 open tasks.
Skipping warnings blame since pipelines do not have an SCM link.%n
[withMaven] Publishers: Generated Artifacts Publisher: 229 ms, Junit Publisher: 35 ms, Open
Task Scanner Publisher: 212 ms, Dependencies Fingerprint Publisher: 32 ms, Pipeline Graph
Publisher: 1 ms
[INFO] 
[INFO] --- maven-resources-plugin:3.1.0:testResources (default-testResources) @ enforcer-api
---
[INFO] Using 'UTF-8' encoding to copy filtered resources.
[INFO] skip non existing resourceDirectory F:\jenkins\jenkins-slave\workspace\box_maven-enforcer_MENFORCER-276@2\windows-jdk11-m3.5.x_build\enforcer-api\src\test\resources
[INFO] Copying 3 resources
[INFO] 
[INFO] --- maven-compiler-plugin:3.7.0:testCompile (default-testCompile) @ enforcer-api ---
[INFO] No sources to compile
[INFO] 
[INFO] --- maven-surefire-plugin:2.22.0:test (default-test) @ enforcer-api ---
[Pipeline] // withMaven
[Pipeline] }
[Pipeline] // stage
[Pipeline] }
[Pipeline] // ws
[Pipeline] }
[Pipeline] // node
[Pipeline] }
Failed in branch windows-jdk8-m3.5.x_build
[INFO] 
[INFO] --- maven-jar-plugin:3.1.0:jar (default-jar) @ enforcer-api ---
[INFO] Building jar: F:\jenkins\jenkins-slave\workspace\box_maven-enforcer_MENFORCER-276@2\windows-jdk11-m3.5.x_build\enforcer-api\target\enforcer-api-3.0.0-SNAPSHOT.jar
[INFO] 
[INFO] --- maven-site-plugin:3.7.1:attach-descriptor (attach-descriptor) @ enforcer-api ---
[INFO] Skipping because packaging 'jar' is not pom.
[INFO] 
[INFO] --- maven-checkstyle-plugin:3.0.0:check (checkstyle-check) @ enforcer-api ---
[INFO] 
[INFO] ------------------------------------------------------------------------
[INFO] Building Apache Maven Enforcer Built-In Rules 3.0.0-SNAPSHOT
[INFO] ------------------------------------------------------------------------
[INFO] 
[INFO] --- maven-clean-plugin:3.1.0:clean (default-clean) @ enforcer-rules ---
[INFO] 
[INFO] --- maven-enforcer-plugin:1.4.1:enforce (enforce-maven-version) @ enforcer-rules ---
[INFO] 
[INFO] --- maven-enforcer-plugin:1.4.1:enforce (enforce-bytecode-version) @ enforcer-rules
---
[INFO] 
[INFO] --- maven-enforcer-plugin:1.4.1:enforce (ban-known-bad-maven-versions) @ enforcer-rules
---
[INFO] 
[INFO] --- apache-rat-plugin:0.12:check (rat-check) @ enforcer-rules ---
[INFO] Enabled default license matchers.
[INFO] Will parse SCM ignores for exclusions...
[INFO] Finished adding exclusions from SCM ignore files.
[INFO] 61 implicit excludes (use -debug for more details).
[INFO] Exclude: .repository/**
[INFO] Exclude: .maven/spy.log
[INFO] Exclude: dependency-reduced-pom.xml
[INFO] Exclude: .java-version
[INFO] 129 resources included (use -debug for more details)
[INFO] Rat check: Summary over all files. Unapproved: 0, unknown: 0, generated: 0, approved:
123 licenses.
[INFO] 
[INFO] --- maven-remote-resources-plugin:1.5:process (process-resource-bundles) @ enforcer-rules
---
[INFO] 
[INFO] --- maven-resources-plugin:3.1.0:resources (default-resources) @ enforcer-rules ---
[INFO] Using 'UTF-8' encoding to copy filtered resources.
[INFO] skip non existing resourceDirectory F:\jenkins\jenkins-slave\workspace\box_maven-enforcer_MENFORCER-276@2\windows-jdk11-m3.5.x_build\enforcer-rules\src\main\resources
[INFO] Copying 3 resources
[INFO] 
[INFO] --- maven-compiler-plugin:3.7.0:compile (default-compile) @ enforcer-rules ---
[INFO] Changes detected - recompiling the module!
[INFO] Compiling 43 source files to F:\jenkins\jenkins-slave\workspace\box_maven-enforcer_MENFORCER-276@2\windows-jdk11-m3.5.x_build\enforcer-rules\target\classes
[INFO] /F:/jenkins/jenkins-slave/workspace/box_maven-enforcer_MENFORCER-276@2/windows-jdk11-m3.5.x_build/enforcer-rules/src/main/java/org/apache/maven/plugins/enforcer/RequireUpperBoundDeps.java:
Some input files use or override a deprecated API.
[INFO] /F:/jenkins/jenkins-slave/workspace/box_maven-enforcer_MENFORCER-276@2/windows-jdk11-m3.5.x_build/enforcer-rules/src/main/java/org/apache/maven/plugins/enforcer/RequireUpperBoundDeps.java:
Recompile with -Xlint:deprecation for details.
[INFO] /F:/jenkins/jenkins-slave/workspace/box_maven-enforcer_MENFORCER-276@2/windows-jdk11-m3.5.x_build/enforcer-rules/src/main/java/org/apache/maven/plugins/enforcer/RequirePluginVersions.java:
F:\jenkins\jenkins-slave\workspace\box_maven-enforcer_MENFORCER-276@2\windows-jdk11-m3.5.x_build\enforcer-rules\src\main\java\org\apache\maven\plugins\enforcer\RequirePluginVersions.java
uses unchecked or unsafe operations.
[INFO] /F:/jenkins/jenkins-slave/workspace/box_maven-enforcer_MENFORCER-276@2/windows-jdk11-m3.5.x_build/enforcer-rules/src/main/java/org/apache/maven/plugins/enforcer/RequirePluginVersions.java:
Recompile with -Xlint:unchecked for details.
[INFO] 
[INFO] --- maven-resources-plugin:3.1.0:testResources (default-testResources) @ enforcer-rules
---
[INFO] Using 'UTF-8' encoding to copy filtered resources.
[INFO] Copying 11 resources
[INFO] Copying 3 resources
[INFO] 
[INFO] --- maven-compiler-plugin:3.7.0:testCompile (default-testCompile) @ enforcer-rules
---
[INFO] Changes detected - recompiling the module!
[INFO] Compiling 34 source files to F:\jenkins\jenkins-slave\workspace\box_maven-enforcer_MENFORCER-276@2\windows-jdk11-m3.5.x_build\enforcer-rules\target\test-classes
[INFO] /F:/jenkins/jenkins-slave/workspace/box_maven-enforcer_MENFORCER-276@2/windows-jdk11-m3.5.x_build/enforcer-rules/src/test/java/org/apache/maven/plugins/enforcer/TestBannedRepositories.java:
Some input files use or override a deprecated API.
[INFO] /F:/jenkins/jenkins-slave/workspace/box_maven-enforcer_MENFORCER-276@2/windows-jdk11-m3.5.x_build/enforcer-rules/src/test/java/org/apache/maven/plugins/enforcer/TestBannedRepositories.java:
Recompile with -Xlint:deprecation for details.
[INFO] /F:/jenkins/jenkins-slave/workspace/box_maven-enforcer_MENFORCER-276@2/windows-jdk11-m3.5.x_build/enforcer-rules/src/test/java/org/apache/maven/plugins/enforcer/MockProject.java:
Some input files use unchecked or unsafe operations.
[INFO] /F:/jenkins/jenkins-slave/workspace/box_maven-enforcer_MENFORCER-276@2/windows-jdk11-m3.5.x_build/enforcer-rules/src/test/java/org/apache/maven/plugins/enforcer/MockProject.java:
Recompile with -Xlint:unchecked for details.
[INFO] -------------------------------------------------------------
[ERROR] COMPILATION ERROR : 
[INFO] -------------------------------------------------------------
[ERROR] /F:/jenkins/jenkins-slave/workspace/box_maven-enforcer_MENFORCER-276@2/windows-jdk11-m3.5.x_build/enforcer-rules/src/test/java/org/apache/maven/plugins/enforcer/TestRequireUpperBoundDeps.java:[14,47]
cannot find symbol
  symbol:   class TestEnforcerRuleUtils
  location: package org.apache.maven.plugins.enforcer.utils
[ERROR] /F:/jenkins/jenkins-slave/workspace/box_maven-enforcer_MENFORCER-276@2/windows-jdk11-m3.5.x_build/enforcer-rules/src/test/java/org/apache/maven/plugins/enforcer/TestRequireUpperBoundDeps.java:[87,9]
cannot find symbol
  symbol:   variable TestEnforcerRuleUtils
  location: class org.apache.maven.plugins.enforcer.TestRequireUpperBoundDeps
[ERROR] /F:/jenkins/jenkins-slave/workspace/box_maven-enforcer_MENFORCER-276@2/windows-jdk11-m3.5.x_build/enforcer-rules/src/test/java/org/apache/maven/plugins/enforcer/TestRequireUpperBoundDeps.java:[97,9]
cannot find symbol
  symbol:   variable TestEnforcerRuleUtils
  location: class org.apache.maven.plugins.enforcer.TestRequireUpperBoundDeps
[ERROR] /F:/jenkins/jenkins-slave/workspace/box_maven-enforcer_MENFORCER-276@2/windows-jdk11-m3.5.x_build/enforcer-rules/src/test/java/org/apache/maven/plugins/enforcer/TestRequireUpperBoundDeps.java:[107,9]
cannot find symbol
  symbol:   variable TestEnforcerRuleUtils
  location: class org.apache.maven.plugins.enforcer.TestRequireUpperBoundDeps
[ERROR] /F:/jenkins/jenkins-slave/workspace/box_maven-enforcer_MENFORCER-276@2/windows-jdk11-m3.5.x_build/enforcer-rules/src/test/java/org/apache/maven/plugins/enforcer/TestRequireUpperBoundDeps.java:[118,9]
cannot find symbol
  symbol:   variable TestEnforcerRuleUtils
  location: class org.apache.maven.plugins.enforcer.TestRequireUpperBoundDeps
[INFO] 5 errors 
[INFO] -------------------------------------------------------------
[INFO] ------------------------------------------------------------------------
[INFO] Reactor Summary:
[INFO] 
[INFO] Apache Maven Enforcer .............................. SUCCESS [  8.645 s]
[INFO] Apache Maven Enforcer API .......................... SUCCESS [  4.957 s]
[INFO] Apache Maven Enforcer Built-In Rules ............... FAILURE [  6.563 s]
[INFO] Apache Maven Enforcer Plugin ....................... SKIPPED
[INFO] ------------------------------------------------------------------------
[INFO] BUILD FAILURE
[INFO] ------------------------------------------------------------------------
[INFO] Total time: 20.711 s
[INFO] Finished at: 2019-01-10T07:20:32Z
[INFO] Final Memory: 36M/124M
[INFO] ------------------------------------------------------------------------
[INFO] [jenkins-event-spy] Generated F:\jenkins\jenkins-slave\workspace\box_maven-enforcer_MENFORCER-276@2@tmp\withMavena62c41a1\maven-spy-20190110-072011-18012239100662767662931.log
[ERROR] Failed to execute goal org.apache.maven.plugins:maven-compiler-plugin:3.7.0:testCompile
(default-testCompile) on project enforcer-rules: Compilation failure: Compilation failure:

[ERROR] /F:/jenkins/jenkins-slave/workspace/box_maven-enforcer_MENFORCER-276@2/windows-jdk11-m3.5.x_build/enforcer-rules/src/test/java/org/apache/maven/plugins/enforcer/TestRequireUpperBoundDeps.java:[14,47]
cannot find symbol
[ERROR]   symbol:   class TestEnforcerRuleUtils
[ERROR]   location: package org.apache.maven.plugins.enforcer.utils
[ERROR] /F:/jenkins/jenkins-slave/workspace/box_maven-enforcer_MENFORCER-276@2/windows-jdk11-m3.5.x_build/enforcer-rules/src/test/java/org/apache/maven/plugins/enforcer/TestRequireUpperBoundDeps.java:[87,9]
cannot find symbol
[ERROR]   symbol:   variable TestEnforcerRuleUtils
[ERROR]   location: class org.apache.maven.plugins.enforcer.TestRequireUpperBoundDeps
[ERROR] /F:/jenkins/jenkins-slave/workspace/box_maven-enforcer_MENFORCER-276@2/windows-jdk11-m3.5.x_build/enforcer-rules/src/test/java/org/apache/maven/plugins/enforcer/TestRequireUpperBoundDeps.java:[97,9]
cannot find symbol
[ERROR]   symbol:   variable TestEnforcerRuleUtils
[ERROR]   location: class org.apache.maven.plugins.enforcer.TestRequireUpperBoundDeps
[ERROR] /F:/jenkins/jenkins-slave/workspace/box_maven-enforcer_MENFORCER-276@2/windows-jdk11-m3.5.x_build/enforcer-rules/src/test/java/org/apache/maven/plugins/enforcer/TestRequireUpperBoundDeps.java:[107,9]
cannot find symbol
[ERROR]   symbol:   variable TestEnforcerRuleUtils
[ERROR]   location: class org.apache.maven.plugins.enforcer.TestRequireUpperBoundDeps
[ERROR] /F:/jenkins/jenkins-slave/workspace/box_maven-enforcer_MENFORCER-276@2/windows-jdk11-m3.5.x_build/enforcer-rules/src/test/java/org/apache/maven/plugins/enforcer/TestRequireUpperBoundDeps.java:[118,9]
cannot find symbol
[ERROR]   symbol:   variable TestEnforcerRuleUtils
[ERROR]   location: class org.apache.maven.plugins.enforcer.TestRequireUpperBoundDeps
[ERROR] -> [Help 1]
org.apache.maven.lifecycle.LifecycleExecutionException: Failed to execute goal org.apache.maven.plugins:maven-compiler-plugin:3.7.0:testCompile
(default-testCompile) on project enforcer-rules: Compilation failure
    at org.apache.maven.lifecycle.internal.MojoExecutor.execute (MojoExecutor.java:213)
    at org.apache.maven.lifecycle.internal.MojoExecutor.execute (MojoExecutor.java:154)
    at org.apache.maven.lifecycle.internal.MojoExecutor.execute (MojoExecutor.java:146)
    at org.apache.maven.lifecycle.internal.LifecycleModuleBuilder.buildProject (LifecycleModuleBuilder.java:117)
    at org.apache.maven.lifecycle.internal.LifecycleModuleBuilder.buildProject (LifecycleModuleBuilder.java:81)
    at org.apache.maven.lifecycle.internal.builder.singlethreaded.SingleThreadedBuilder.build
(SingleThreadedBuilder.java:51)
    at org.apache.maven.lifecycle.internal.LifecycleStarter.execute (LifecycleStarter.java:128)
    at org.apache.maven.DefaultMaven.doExecute (DefaultMaven.java:309)
    at org.apache.maven.DefaultMaven.doExecute (DefaultMaven.java:194)
    at org.apache.maven.DefaultMaven.execute (DefaultMaven.java:107)
    at org.apache.maven.cli.MavenCli.execute (MavenCli.java:955)
    at org.apache.maven.cli.MavenCli.doMain (MavenCli.java:290)
    at org.apache.maven.cli.MavenCli.main (MavenCli.java:194)
    at jdk.internal.reflect.NativeMethodAccessorImpl.invoke0 (Native Method)
    at jdk.internal.reflect.NativeMethodAccessorImpl.invoke (NativeMethodAccessorImpl.java:62)
    at jdk.internal.reflect.DelegatingMethodAccessorImpl.invoke (DelegatingMethodAccessorImpl.java:43)
    at java.lang.reflect.Method.invoke (Method.java:566)
    at org.codehaus.plexus.classworlds.launcher.Launcher.launchEnhanced (Launcher.java:289)
    at org.codehaus.plexus.classworlds.launcher.Launcher.launch (Launcher.java:229)
    at org.codehaus.plexus.classworlds.launcher.Launcher.mainWithExitCode (Launcher.java:415)
    at org.codehaus.plexus.classworlds.launcher.Launcher.main (Launcher.java:356)
Caused by: org.apache.maven.plugin.compiler.CompilationFailureException: Compilation failure
    at org.apache.maven.plugin.compiler.AbstractCompilerMojo.execute (AbstractCompilerMojo.java:1161)
    at org.apache.maven.plugin.compiler.TestCompilerMojo.execute (TestCompilerMojo.java:176)
    at org.apache.maven.plugin.DefaultBuildPluginManager.executeMojo (DefaultBuildPluginManager.java:134)
    at org.apache.maven.lifecycle.internal.MojoExecutor.execute (MojoExecutor.java:208)
    at org.apache.maven.lifecycle.internal.MojoExecutor.execute (MojoExecutor.java:154)
    at org.apache.maven.lifecycle.internal.MojoExecutor.execute (MojoExecutor.java:146)
    at org.apache.maven.lifecycle.internal.LifecycleModuleBuilder.buildProject (LifecycleModuleBuilder.java:117)
    at org.apache.maven.lifecycle.internal.LifecycleModuleBuilder.buildProject (LifecycleModuleBuilder.java:81)
    at org.apache.maven.lifecycle.internal.builder.singlethreaded.SingleThreadedBuilder.build
(SingleThreadedBuilder.java:51)
    at org.apache.maven.lifecycle.internal.LifecycleStarter.execute (LifecycleStarter.java:128)
    at org.apache.maven.DefaultMaven.doExecute (DefaultMaven.java:309)
    at org.apache.maven.DefaultMaven.doExecute (DefaultMaven.java:194)
    at org.apache.maven.DefaultMaven.execute (DefaultMaven.java:107)
    at org.apache.maven.cli.MavenCli.execute (MavenCli.java:955)
    at org.apache.maven.cli.MavenCli.doMain (MavenCli.java:290)
    at org.apache.maven.cli.MavenCli.main (MavenCli.java:194)
    at jdk.internal.reflect.NativeMethodAccessorImpl.invoke0 (Native Method)
    at jdk.internal.reflect.NativeMethodAccessorImpl.invoke (NativeMethodAccessorImpl.java:62)
    at jdk.internal.reflect.DelegatingMethodAccessorImpl.invoke (DelegatingMethodAccessorImpl.java:43)
    at java.lang.reflect.Method.invoke (Method.java:566)
    at org.codehaus.plexus.classworlds.launcher.Launcher.launchEnhanced (Launcher.java:289)
    at org.codehaus.plexus.classworlds.launcher.Launcher.launch (Launcher.java:229)
    at org.codehaus.plexus.classworlds.launcher.Launcher.mainWithExitCode (Launcher.java:415)
    at org.codehaus.plexus.classworlds.launcher.Launcher.main (Launcher.java:356)
[ERROR] 
[ERROR] Re-run Maven using the -X switch to enable full debug logging.
[ERROR] 
[ERROR] For more information about the errors and possible solutions, please read the following
articles:
[ERROR] [Help 1] http://cwiki.apache.org/confluence/display/MAVEN/MojoFailureException
[ERROR] 
[ERROR] After correcting the problems, you can resume the build with the command
[ERROR]   mvn <goals> -rf :enforcer-rules
[Pipeline] }
[Pipeline] // dir
[Pipeline] }
[withMaven] artifactsPublisher - Archive artifact windows-jdk11-m3.5.x_build\pom.xml under
org\apache\maven\enforcer\enforcer\3.0.0-SNAPSHOT\enforcer-3.0.0-SNAPSHOT.pom
[withMaven] artifactsPublisher - Archive artifact windows-jdk11-m3.5.x_build\target\enforcer-3.0.0-SNAPSHOT-site.xml
under org\apache\maven\enforcer\enforcer\3.0.0-SNAPSHOT\enforcer-3.0.0-SNAPSHOT-site.xml
[withMaven] artifactsPublisher - Archive artifact windows-jdk11-m3.5.x_build\enforcer-api\pom.xml
under org\apache\maven\enforcer\enforcer-api\3.0.0-SNAPSHOT\enforcer-api-3.0.0-SNAPSHOT.pom
[withMaven] artifactsPublisher - Archive artifact windows-jdk11-m3.5.x_build\enforcer-api\target\enforcer-api-3.0.0-SNAPSHOT.jar
under org\apache\maven\enforcer\enforcer-api\3.0.0-SNAPSHOT\enforcer-api-3.0.0-SNAPSHOT.jar
[Fast Archiver] No prior successful build to compare, so performing full copy of artifacts
[withMaven] junitPublisher - Archive test results for Maven artifact org.apache.maven.enforcer:enforcer-api:jar:3.0.0-SNAPSHOT
generated by maven-surefire-plugin:test (default-test): windows-jdk11-m3.5.x_build\enforcer-api\target\surefire-reports\*.xml
Recording test results
None of the test reports contained any result
[withMaven] openTasksPublisher - Scan Tasks for Maven artifact org.apache.maven.enforcer:enforcer-api:jar:3.0.0-SNAPSHOT
in source directory windows-jdk11-m3.5.x_build\enforcer-api\src\main\java
[withMaven] openTasksPublisher - Scan Tasks for Maven artifact org.apache.maven.enforcer:enforcer-rules:jar:3.0.0-SNAPSHOT
in source directory windows-jdk11-m3.5.x_build\enforcer-rules\src\main\java
[TASKS] Scanning folder 'f:\jenkins\jenkins-slave\workspace\box_maven-enforcer_MENFORCER-276@2'
for files matching the pattern 'windows-jdk11-m3.5.x_build\enforcer-api\src\main\java\**\*,windows-jdk11-m3.5.x_build\enforcer-rules\src\main\java\**\*'
- excludes: null
[TASKS] Found 48 files to scan for tasks
[TASKS] Found 5 open tasks.
Skipping warnings blame since pipelines do not have an SCM link.%n
[withMaven] Publishers: Generated Artifacts Publisher: 240 ms, Junit Publisher: 34 ms, Open
Task Scanner Publisher: 197 ms, Dependencies Fingerprint Publisher: 33 ms, Pipeline Graph
Publisher: 1 ms
[Pipeline] // withMaven
[Pipeline] }
[Pipeline] // stage
[Pipeline] }
[Pipeline] // ws
[Pipeline] }
[Pipeline] // node
[Pipeline] }
Failed in branch windows-jdk11-m3.5.x_build
[Pipeline] // parallel
[Pipeline] stage
[Pipeline] { (Notifications)
[Pipeline] echo
Build result: FAILURE
[Pipeline] jiraIssueSelector
[Pipeline] emailext
Mime
  • Unnamed multipart/mixed (inline, None, 0 bytes)
View raw message