maven-notifications mailing list archives

Site index · List index
Message view « Date » · « Thread »
Top « Date » · « Thread »
From Apache Jenkins Server <jenk...@builds.apache.org>
Subject Build failed in Jenkins: Maven TLP » maven-shade-plugin » MSHADE-291 #4
Date Mon, 31 Dec 2018 04:06:28 GMT
See https://builds.apache.org/job/maven-box/job/maven-shade-plugin/job/MSHADE-291/4/

Changes:

* Removed exclusion for problematic node cause the node is back online.
* reduce the history archiving
* reduce the history archiving
* increase a bit archiving
* increase a bit archiving
* Activate sonarqube on first project
* Disable sonar:sonar for now
* use publisherStrategy: 'EXPLICIT' to avoid non used publishers
* [INFRA-17514] Fix file separator + add other locations for workspaces
* fix indent
* use a special local repo to have a bit of caching

All tests passed

Build log:
[...truncated 570.87 KB...]
[windows-jdk7-m3.3.x_build] [withMaven] artifactsPublisher - Archive artifact windows-jdk7-m3.3.x_build\pom.xml
under org\apache\maven\plugins\maven-shade-plugin\3.2.2-SNAPSHOT\maven-shade-plugin-3.2.2-SNAPSHOT.pom
[windows-jdk7-m3.3.x_build] [withMaven] artifactsPublisher - Archive artifact windows-jdk7-m3.3.x_build\target\maven-shade-plugin-3.2.2-SNAPSHOT.jar
under org\apache\maven\plugins\maven-shade-plugin\3.2.2-SNAPSHOT\maven-shade-plugin-3.2.2-SNAPSHOT.jar
[windows-jdk7-m3.3.x_build] [withMaven] artifactsPublisher - Archive artifact windows-jdk7-m3.3.x_build\target\maven-shade-plugin-3.2.2-SNAPSHOT-tests.jar
under org\apache\maven\plugins\maven-shade-plugin\3.2.2-SNAPSHOT\maven-shade-plugin-3.2.2-SNAPSHOT-tests.jar
[windows-jdk7-m3.3.x_build] [withMaven] junitPublisher - Archive test results for Maven artifact
org.apache.maven.plugins:maven-shade-plugin:3.2.2-SNAPSHOT generated by maven-surefire-plugin:test
(default-test): windows-jdk7-m3.3.x_build\target\surefire-reports\*.xml
[windows-jdk7-m3.3.x_build] Recording test results
[windows-jdk7-m3.3.x_build] [withMaven] openTasksPublisher - Scan Tasks for Maven artifact
org.apache.maven.plugins:maven-shade-plugin:3.2.2-SNAPSHOT in source directory windows-jdk7-m3.3.x_build\src\main\java
[windows-jdk7-m3.3.x_build] [TASKS] Scanning folder 'f:\jenkins\jenkins-slave\workspace\ven-shade-plugin_MSHADE-291-KVKTLKLWYKZ6EFRSCOSZT7CEVTWY4URM6BN2UAFLW66UEXJ3KESQ@2'
for files matching the pattern 'windows-jdk7-m3.3.x_build\src\main\java\**\*' - excludes:
null
[windows-jdk7-m3.3.x_build] [TASKS] Found 32 files to scan for tasks
[windows-jdk7-m3.3.x_build] [TASKS] Found 2 open tasks.
[windows-jdk7-m3.3.x_build] Skipping warnings blame since pipelines do not have an SCM link.%n
[windows-jdk7-m3.3.x_build] [TASKS] Computing warning deltas based on reference build #3
[windows-jdk7-m3.3.x_build] [withMaven] invokerPublisher - Archive invoker results for Maven
artifact MavenArtifact{org.apache.maven.plugins:maven-shade-plugin::3.2.2-SNAPSHOT(version:
3.2.2-SNAPSHOT, snapshot:false) } generated by PluginInvocation{org.apache.maven.plugins:maven-invoker-plugin:3.1.0@integration-test
 integration-test}: windows-jdk7-m3.3.x_build\target\invoker-reports\*.xml
[Pipeline] [windows-jdk7-m3.3.x_build] // withMaven
[Pipeline] [windows-jdk7-m3.3.x_build] cleanWs
[windows-jdk7-m3.3.x_build] [WS-CLEANUP] Deleting project workspace...Cannot delete workspace
:remote file operation failed: f:\jenkins\jenkins-slave\workspace\ven-shade-plugin_MSHADE-291-KVKTLKLWYKZ6EFRSCOSZT7CEVTWY4URM6BN2UAFLW66UEXJ3KESQ@2
at hudson.remoting.Channel@6cb8ec07:JNLP4-connect connection from 37.48.69.226/37.48.69.226:60168:
java.nio.file.AccessDeniedException: f:\jenkins\jenkins-slave\workspace\ven-shade-plugin_MSHADE-291-KVKTLKLWYKZ6EFRSCOSZT7CEVTWY4URM6BN2UAFLW66UEXJ3KESQ@2
-> f:\jenkins\jenkins-slave\workspace\ven-shade-plugin_MSHADE-291-KVKTLKLWYKZ6EFRSCOSZT7CEVTWY4URM6BN2UAFLW66UEXJ3KESQ@2_ws-cleanup_1546228362882
[Pipeline] [windows-jdk7-m3.3.x_build] }
[Pipeline] [windows-jdk7-m3.3.x_build] // stage
[Pipeline] [windows-jdk7-m3.3.x_build] }
[Pipeline] [windows-jdk7-m3.3.x_build] // ws
[Pipeline] [windows-jdk7-m3.3.x_build] }
[Pipeline] [windows-jdk7-m3.3.x_build] // node
[Pipeline] [windows-jdk7-m3.3.x_build] }
[windows-jdk8-m3.5.x_build] [INFO] run post-build script verify.bsh
[windows-jdk8-m3.5.x_build] [INFO]           xml-transformer-ignores-dtd\pom.xml ..............
SUCCESS (9.6 s)
[windows-jdk8-m3.5.x_build] [INFO] 
[windows-jdk8-m3.5.x_build] [INFO] --- maven-checkstyle-plugin:3.0.0:check (checkstyle-check)
@ maven-shade-plugin ---
[windows-jdk8-m3.5.x_build] [INFO] There are 3 errors reported by Checkstyle 6.18 with config/maven_checks.xml
ruleset.
[windows-jdk8-m3.5.x_build] [INFO] Ignored 3 errors, 0 violation remaining.
[windows-jdk8-m3.5.x_build] [INFO] 
[windows-jdk8-m3.5.x_build] [INFO] --- maven-invoker-plugin:3.1.0:verify (integration-test)
@ maven-shade-plugin ---
[windows-jdk8-m3.5.x_build] [INFO] -------------------------------------------------
[windows-jdk8-m3.5.x_build] [INFO] Build Summary:
[windows-jdk8-m3.5.x_build] [INFO]   Passed: 58, Failed: 0, Errors: 0, Skipped: 3
[windows-jdk8-m3.5.x_build] [INFO] -------------------------------------------------
[windows-jdk8-m3.5.x_build] [INFO] ------------------------------------------------------------------------
[windows-jdk8-m3.5.x_build] [INFO] BUILD SUCCESS
[windows-jdk8-m3.5.x_build] [INFO] ------------------------------------------------------------------------
[windows-jdk8-m3.5.x_build] [INFO] Total time: 08:26 min
[windows-jdk8-m3.5.x_build] [INFO] Finished at: 2018-12-31T03:52:49Z
[windows-jdk8-m3.5.x_build] [INFO] Final Memory: 57M/951M
[windows-jdk8-m3.5.x_build] [INFO] ------------------------------------------------------------------------
[windows-jdk8-m3.5.x_build] [INFO] [jenkins-event-spy] Generated F:\jenkins\jenkins-slave\workspace\ven-shade-plugin_MSHADE-291-KVKTLKLWYKZ6EFRSCOSZT7CEVTWY4URM6BN2UAFLW66UEXJ3KESQ@2@tmp\withMaven5aa9299d\maven-spy-20181231-034422-2607606482800803287198.log
[windows-jdk8-m3.5.x_build] Picked up JAVA_TOOL_OPTIONS: -Dmaven.ext.class.path="f:\jenkins\jenkins-slave\workspace\ven-shade-plugin_MSHADE-291-KVKTLKLWYKZ6EFRSCOSZT7CEVTWY4URM6BN2UAFLW66UEXJ3KESQ@2@tmp\withMaven5aa9299d\pipeline-maven-spy.jar"
-Dorg.jenkinsci.plugins.pipeline.maven.reportsFolder="f:\jenkins\jenkins-slave\workspace\ven-shade-plugin_MSHADE-291-KVKTLKLWYKZ6EFRSCOSZT7CEVTWY4URM6BN2UAFLW66UEXJ3KESQ@2@tmp\withMaven5aa9299d"

[windows-jdk11-m3.5.x_build] [INFO] run post-build script verify.bsh
[windows-jdk11-m3.5.x_build] [INFO]           filter-artifact-contents\pom.xml .................
SUCCESS (23.8 s)
[windows-jdk11-m3.5.x_build] [INFO] Building: finalNameBuild\pom.xml
[windows-jdk11-m3.5.x_build] [INFO] run pre-build script setup.bsh
[windows-jdk7-m3.3.x_build] Failed in branch windows-jdk7-m3.3.x_build
[Pipeline] [windows-jdk8-m3.5.x_build] }
[Pipeline] [windows-jdk8-m3.5.x_build] // dir
[Pipeline] [windows-jdk8-m3.5.x_build] }
[windows-jdk8-m3.5.x_build] [withMaven] artifactsPublisher - Archive artifact windows-jdk8-m3.5.x_build\pom.xml
under org\apache\maven\plugins\maven-shade-plugin\3.2.2-SNAPSHOT\maven-shade-plugin-3.2.2-SNAPSHOT.pom
[windows-jdk8-m3.5.x_build] [withMaven] artifactsPublisher - Archive artifact windows-jdk8-m3.5.x_build\target\maven-shade-plugin-3.2.2-SNAPSHOT.jar
under org\apache\maven\plugins\maven-shade-plugin\3.2.2-SNAPSHOT\maven-shade-plugin-3.2.2-SNAPSHOT.jar
[windows-jdk8-m3.5.x_build] [withMaven] artifactsPublisher - Archive artifact windows-jdk8-m3.5.x_build\target\maven-shade-plugin-3.2.2-SNAPSHOT-tests.jar
under org\apache\maven\plugins\maven-shade-plugin\3.2.2-SNAPSHOT\maven-shade-plugin-3.2.2-SNAPSHOT-tests.jar
[windows-jdk8-m3.5.x_build] [withMaven] junitPublisher - Archive test results for Maven artifact
org.apache.maven.plugins:maven-shade-plugin:3.2.2-SNAPSHOT generated by maven-surefire-plugin:test
(default-test): windows-jdk8-m3.5.x_build\target\surefire-reports\*.xml
[windows-jdk8-m3.5.x_build] Recording test results
[windows-jdk8-m3.5.x_build] [withMaven] openTasksPublisher - Scan Tasks for Maven artifact
org.apache.maven.plugins:maven-shade-plugin:3.2.2-SNAPSHOT in source directory windows-jdk8-m3.5.x_build\src\main\java
[windows-jdk8-m3.5.x_build] [TASKS] Scanning folder 'f:\jenkins\jenkins-slave\workspace\ven-shade-plugin_MSHADE-291-KVKTLKLWYKZ6EFRSCOSZT7CEVTWY4URM6BN2UAFLW66UEXJ3KESQ@2'
for files matching the pattern 'windows-jdk8-m3.5.x_build\src\main\java\**\*' - excludes:
null
[windows-jdk8-m3.5.x_build] [TASKS] Found 32 files to scan for tasks
[windows-jdk8-m3.5.x_build] [TASKS] Found 2 open tasks.
[windows-jdk8-m3.5.x_build] Skipping warnings blame since pipelines do not have an SCM link.%n
[windows-jdk8-m3.5.x_build] [TASKS] Computing warning deltas based on reference build #3
[windows-jdk8-m3.5.x_build] [withMaven] invokerPublisher - Archive invoker results for Maven
artifact MavenArtifact{org.apache.maven.plugins:maven-shade-plugin::3.2.2-SNAPSHOT(version:
3.2.2-SNAPSHOT, snapshot:false) } generated by PluginInvocation{org.apache.maven.plugins:maven-invoker-plugin:3.1.0@integration-test
 integration-test}: windows-jdk8-m3.5.x_build\target\invoker-reports\*.xml
[Pipeline] [windows-jdk8-m3.5.x_build] // withMaven
[Pipeline] [windows-jdk8-m3.5.x_build] cleanWs
[windows-jdk8-m3.5.x_build] [WS-CLEANUP] Deleting project workspace...Cannot delete workspace
:remote file operation failed: f:\jenkins\jenkins-slave\workspace\ven-shade-plugin_MSHADE-291-KVKTLKLWYKZ6EFRSCOSZT7CEVTWY4URM6BN2UAFLW66UEXJ3KESQ@2
at hudson.remoting.Channel@7f96cc69:JNLP4-connect connection from 37.48.69.226/37.48.69.226:63010:
java.nio.file.AccessDeniedException: f:\jenkins\jenkins-slave\workspace\ven-shade-plugin_MSHADE-291-KVKTLKLWYKZ6EFRSCOSZT7CEVTWY4URM6BN2UAFLW66UEXJ3KESQ@2
-> f:\jenkins\jenkins-slave\workspace\ven-shade-plugin_MSHADE-291-KVKTLKLWYKZ6EFRSCOSZT7CEVTWY4URM6BN2UAFLW66UEXJ3KESQ@2_ws-cleanup_1546228389900
[Pipeline] [windows-jdk8-m3.5.x_build] }
[Pipeline] [windows-jdk8-m3.5.x_build] // stage
[Pipeline] [windows-jdk8-m3.5.x_build] }
[Pipeline] [windows-jdk8-m3.5.x_build] // ws
[Pipeline] [windows-jdk8-m3.5.x_build] }
[Pipeline] [windows-jdk8-m3.5.x_build] // node
[Pipeline] [windows-jdk8-m3.5.x_build] }
[windows-jdk11-m3.5.x_build] [INFO] run post-build script verify.bsh
[windows-jdk11-m3.5.x_build] [INFO]           finalNameBuild\pom.xml ...........................
SUCCESS (22.2 s)
[windows-jdk11-m3.5.x_build] [INFO] Building: finalNameBuild-attached\pom.xml
[windows-jdk11-m3.5.x_build] [INFO] run pre-build script setup.bsh
[windows-jdk11-m3.5.x_build] [INFO] run post-build script verify.bsh
[windows-jdk11-m3.5.x_build] [INFO]           finalNameBuild-attached\pom.xml ..................
SUCCESS (21.5 s)
[windows-jdk11-m3.5.x_build] [INFO] Building: finalNameShade\pom.xml
[windows-jdk11-m3.5.x_build] [INFO] run pre-build script setup.bsh
[windows-jdk11-m3.5.x_build] [INFO] run post-build script verify.bsh
[windows-jdk11-m3.5.x_build] [INFO]           finalNameShade\pom.xml ...........................
SUCCESS (26.9 s)
[windows-jdk11-m3.5.x_build] [INFO] Building: finalNameShade-attached\pom.xml
[windows-jdk11-m3.5.x_build] [INFO] run pre-build script setup.bsh
[windows-jdk8-m3.5.x_build] Failed in branch windows-jdk8-m3.5.x_build
[windows-jdk11-m3.5.x_build] [INFO] run post-build script verify.bsh
[windows-jdk11-m3.5.x_build] [INFO]           finalNameShade-attached\pom.xml ..................
SUCCESS (23.8 s)
[windows-jdk11-m3.5.x_build] [INFO] Building: implicit-inclusion-of-project-artifact\pom.xml
[windows-jdk11-m3.5.x_build] [INFO] run post-build script verify.bsh
[windows-jdk11-m3.5.x_build] [INFO]           implicit-inclusion-of-project-artifact\pom.xml
... SUCCESS (23.8 s)
[windows-jdk11-m3.5.x_build] [INFO] Building: manifest-retained\pom.xml
[windows-jdk11-m3.5.x_build] [INFO] run post-build script verify.bsh
[windows-jdk11-m3.5.x_build] [INFO]           manifest-retained\pom.xml ........................
SUCCESS (25.6 s)
[windows-jdk11-m3.5.x_build] [INFO] Building: manifest-transformed\pom.xml
[windows-jdk11-m3.5.x_build] [INFO] run post-build script verify.bsh
[windows-jdk11-m3.5.x_build] [INFO]           manifest-transformed\pom.xml .....................
SUCCESS (3.7 s)
[windows-jdk11-m3.5.x_build] [INFO] Building: mini-jar\pom.xml
[windows-jdk11-m3.5.x_build] [INFO] run post-build script verify.bsh
[windows-jdk11-m3.5.x_build] [INFO]           mini-jar\pom.xml .................................
SUCCESS (3.7 s)
[windows-jdk11-m3.5.x_build] [INFO] Building: mini-jar-jdk11\pom.xml
[windows-jdk11-m3.5.x_build] [INFO] run post-build script verify.bsh
[windows-jdk11-m3.5.x_build] [INFO]           mini-jar-jdk11\pom.xml ...........................
SUCCESS (5.4 s)
[windows-jdk11-m3.5.x_build] [INFO] Building: mini-jar-malformed-dependencies\pom.xml
[windows-jdk11-m3.5.x_build] [INFO]           mini-jar-malformed-dependencies\pom.xml ..........
SUCCESS (5.7 s)
[windows-jdk11-m3.5.x_build] [INFO] Building: mini-jar-package-info\pom.xml
[windows-jdk11-m3.5.x_build] [INFO] run post-build script verify.bsh
[windows-jdk11-m3.5.x_build] [INFO]           mini-jar-package-info\pom.xml ....................
SUCCESS (4.8 s)
[windows-jdk11-m3.5.x_build] [INFO] Building: mini-jar-respect-includes\pom.xml
[windows-jdk11-m3.5.x_build] [INFO] run post-build script verify.bsh
[windows-jdk11-m3.5.x_build] [INFO]           mini-jar-respect-includes\pom.xml ................
SUCCESS (4.2 s)
[windows-jdk11-m3.5.x_build] [INFO] Building: MSHADE-105\pom.xml
[windows-jdk11-m3.5.x_build] [INFO] run post-build script verify.bsh
[windows-jdk11-m3.5.x_build] [INFO]           MSHADE-105\pom.xml ...............................
SUCCESS (9.0 s)
[windows-jdk11-m3.5.x_build] [INFO] Building: MSHADE-114\pom.xml
[windows-jdk11-m3.5.x_build] [INFO]           MSHADE-114\pom.xml ...............................
SUCCESS (3.0 s)
[windows-jdk11-m3.5.x_build] [INFO] Building: mshade-123\pom.xml
[windows-jdk11-m3.5.x_build] [INFO]           mshade-123\pom.xml ...............................
SUCCESS (16.6 s)
[windows-jdk11-m3.5.x_build] [INFO] Building: MSHADE-133\pom.xml
[windows-jdk11-m3.5.x_build] [INFO] run post-build script verify.groovy
[windows-jdk11-m3.5.x_build] [INFO]           MSHADE-133\pom.xml ...............................
SUCCESS (24.0 s)
[windows-jdk11-m3.5.x_build] [INFO] Building: MSHADE-155\pom.xml
[windows-jdk11-m3.5.x_build] [INFO] run post-build script verify.groovy
[windows-jdk11-m3.5.x_build] [INFO]           MSHADE-155\pom.xml ...............................
SUCCESS (25.6 s)
[windows-jdk11-m3.5.x_build] [INFO] Building: MSHADE-182\pom.xml
[windows-jdk11-m3.5.x_build] [INFO] run post-build script verify.groovy
[windows-jdk11-m3.5.x_build] [INFO]           MSHADE-182\pom.xml ...............................
SUCCESS (22.4 s)
[windows-jdk11-m3.5.x_build] [INFO] Building: MSHADE-183\pom.xml
[windows-jdk11-m3.5.x_build] [INFO] run post-build script verify.bsh
[windows-jdk11-m3.5.x_build] [INFO]           MSHADE-183\pom.xml ...............................
SUCCESS (26.4 s)
[windows-jdk11-m3.5.x_build] [INFO] Building: MSHADE-185\pom.xml
[windows-jdk11-m3.5.x_build] [INFO]           MSHADE-185\pom.xml ...............................
SKIPPED due to JRE version
[windows-jdk11-m3.5.x_build] [INFO] Building: MSHADE-232_ResourceBundleAppendingTransformer\pom.xml
[windows-jdk11-m3.5.x_build] [INFO] run post-build script verify.groovy
[windows-jdk11-m3.5.x_build] [INFO]           MSHADE-232_ResourceBundleAppendingTransformer\pom.xml
SUCCESS (22.0 s)
[windows-jdk11-m3.5.x_build] [INFO] Building: MSHADE-239_finalName-attachments\pom.xml
[windows-jdk11-m3.5.x_build] [INFO] run post-build script verify.groovy
[windows-jdk11-m3.5.x_build] [INFO]           MSHADE-239_finalName-attachments\pom.xml .........
SUCCESS (25.1 s)
[windows-jdk11-m3.5.x_build] [INFO] Building: MSHADE-240_reloc-mavenfiles\pom.xml
[windows-jdk11-m3.5.x_build] [INFO] run post-build script verify.groovy
[windows-jdk11-m3.5.x_build] [INFO]           MSHADE-240_reloc-mavenfiles\pom.xml ..............
SUCCESS (32.6 s)
[windows-jdk11-m3.5.x_build] [INFO] Building: MSHADE-247\pom.xml
[windows-jdk11-m3.5.x_build] [INFO]           MSHADE-247\pom.xml ...............................
SUCCESS (28.5 s)
[windows-jdk11-m3.5.x_build] [INFO] Building: MSHADE-258_module_relocation\pom.xml
[windows-jdk11-m3.5.x_build] [INFO] run post-build script verify.groovy
[windows-jdk11-m3.5.x_build] [INFO]           MSHADE-258_module_relocation\pom.xml .............
SUCCESS (33.2 s)
[windows-jdk11-m3.5.x_build] [INFO] Building: non-runtime-scope-excluded\pom.xml
[windows-jdk11-m3.5.x_build] [INFO] run post-build script verify.bsh
[windows-jdk11-m3.5.x_build] [INFO]           non-runtime-scope-excluded\pom.xml ...............
SUCCESS (3.3 s)
[windows-jdk11-m3.5.x_build] [INFO] Building: plugin-descriptor-relocation\pom.xml
[windows-jdk11-m3.5.x_build] [INFO] run post-build script verify.groovy
[windows-jdk11-m3.5.x_build] [INFO]           plugin-descriptor-relocation\pom.xml .............
SUCCESS (9.3 s)
[windows-jdk11-m3.5.x_build] [INFO] Building: pom-packaging\pom.xml
[windows-jdk11-m3.5.x_build] [INFO] run post-build script verify.bsh
[windows-jdk11-m3.5.x_build] [INFO]           pom-packaging\pom.xml ............................
SUCCESS (2.3 s)
[windows-jdk11-m3.5.x_build] [INFO] Building: project-with-reactors-included\pom.xml
[windows-jdk11-m3.5.x_build] [INFO] run post-build script verify.bsh
[windows-jdk11-m3.5.x_build] [INFO]           project-with-reactors-included\pom.xml ...........
SUCCESS (5.8 s)
[windows-jdk11-m3.5.x_build] [INFO] Building: reloc-abs-resource-path\pom.xml
[windows-jdk11-m3.5.x_build] [INFO]           reloc-abs-resource-path\pom.xml ..................
SUCCESS (3.9 s)
[windows-jdk11-m3.5.x_build] [INFO] Building: reloc-abs-resource-path-exclude\pom.xml
[windows-jdk11-m3.5.x_build] [INFO]           reloc-abs-resource-path-exclude\pom.xml ..........
SUCCESS (3.9 s)
[windows-jdk11-m3.5.x_build] [INFO] Building: reloc-anno\pom.xml
[windows-jdk11-m3.5.x_build] [INFO]           reloc-anno\pom.xml ...............................
SUCCESS (3.5 s)
[windows-jdk11-m3.5.x_build] [INFO] Building: reloc-class-from-string-pool\pom.xml
[windows-jdk11-m3.5.x_build] [INFO]           reloc-class-from-string-pool\pom.xml .............
SUCCESS (3.6 s)
[windows-jdk11-m3.5.x_build] [INFO] Building: reloc-enum-ref-from-anno\pom.xml
[windows-jdk11-m3.5.x_build] [INFO]           reloc-enum-ref-from-anno\pom.xml .................
SUCCESS (4.7 s)
[windows-jdk11-m3.5.x_build] [INFO] Building: reloc-includes-excludes\pom.xml
[windows-jdk11-m3.5.x_build] [INFO] run post-build script verify.bsh
[windows-jdk11-m3.5.x_build] [INFO]           reloc-includes-excludes\pom.xml ..................
SUCCESS (20.5 s)
[windows-jdk11-m3.5.x_build] [INFO] Building: rerun-with-reloc\pom.xml
[windows-jdk11-m3.5.x_build] [INFO]           rerun-with-reloc\pom.xml .........................
SUCCESS (42.5 s)
[windows-jdk11-m3.5.x_build] [INFO] Building: rerun-without-reloc\pom.xml
[windows-jdk11-m3.5.x_build] [INFO]           rerun-without-reloc\pom.xml ......................
SUCCESS (21.9 s)
[windows-jdk11-m3.5.x_build] [INFO] Building: services-resource-transformer\pom.xml
[windows-jdk11-m3.5.x_build] [INFO] run post-build script verify.bsh
[windows-jdk11-m3.5.x_build] [INFO]           services-resource-transformer\pom.xml ............
SUCCESS (26.0 s)
[windows-jdk11-m3.5.x_build] [INFO] Building: services-resource-transformer-with-reloc-includes-excludes\pom.xml
[windows-jdk11-m3.5.x_build] [INFO] run post-build script verify.bsh
[windows-jdk11-m3.5.x_build] [INFO]           services-resource-transformer-with-reloc-includes-excludes\pom.xml
SUCCESS (23.9 s)
[windows-jdk11-m3.5.x_build] [INFO] Building: shadePomDependency\pom.xml
[windows-jdk11-m3.5.x_build] [INFO]           shadePomDependency\pom.xml .......................
SUCCESS (31.7 s)
[windows-jdk11-m3.5.x_build] [INFO] Building: shading-with-java-10-sources\pom.xml
[windows-jdk11-m3.5.x_build] [INFO] run post-build script verify.groovy
[windows-jdk11-m3.5.x_build] [INFO]           shading-with-java-10-sources\pom.xml .............
SUCCESS (38.0 s)
[windows-jdk11-m3.5.x_build] [INFO] Building: shading-with-java-11-sources\pom.xml
[windows-jdk11-m3.5.x_build] [INFO] run post-build script verify.groovy
[windows-jdk11-m3.5.x_build] [INFO]           shading-with-java-11-sources\pom.xml .............
SUCCESS (25.6 s)
[windows-jdk11-m3.5.x_build] [INFO] Building: shading-with-java-8-sources\pom.xml
[windows-jdk11-m3.5.x_build] [INFO] run post-build script verify.groovy
[windows-jdk11-m3.5.x_build] [INFO]           shading-with-java-8-sources\pom.xml ..............
SUCCESS (29.1 s)
[windows-jdk11-m3.5.x_build] [INFO] Building: users-shader-impl\pom.xml
[windows-jdk11-m3.5.x_build] [INFO] run post-build script verify.groovy
[windows-jdk11-m3.5.x_build] [INFO]           users-shader-impl\pom.xml ........................
SUCCESS (4.0 s)
[windows-jdk11-m3.5.x_build] [INFO] Building: xml-transformer-ignores-dtd\pom.xml
[windows-jdk11-m3.5.x_build] [INFO] run post-build script verify.bsh
[windows-jdk11-m3.5.x_build] [INFO]           xml-transformer-ignores-dtd\pom.xml ..............
SUCCESS (3.1 s)
[windows-jdk11-m3.5.x_build] [INFO] 
[windows-jdk11-m3.5.x_build] [INFO] --- maven-checkstyle-plugin:3.0.0:check (checkstyle-check)
@ maven-shade-plugin ---
[windows-jdk11-m3.5.x_build] [INFO] There are 3 errors reported by Checkstyle 6.18 with config/maven_checks.xml
ruleset.
[windows-jdk11-m3.5.x_build] [INFO] Ignored 3 errors, 0 violation remaining.
[windows-jdk11-m3.5.x_build] [INFO] 
[windows-jdk11-m3.5.x_build] [INFO] --- maven-invoker-plugin:3.1.0:verify (integration-test)
@ maven-shade-plugin ---
[windows-jdk11-m3.5.x_build] [INFO] -------------------------------------------------
[windows-jdk11-m3.5.x_build] [INFO] Build Summary:
[windows-jdk11-m3.5.x_build] [INFO]   Passed: 60, Failed: 0, Errors: 0, Skipped: 1
[windows-jdk11-m3.5.x_build] [INFO] -------------------------------------------------
[windows-jdk11-m3.5.x_build] [INFO] ------------------------------------------------------------------------
[windows-jdk11-m3.5.x_build] [INFO] BUILD SUCCESS
[windows-jdk11-m3.5.x_build] [INFO] ------------------------------------------------------------------------
[windows-jdk11-m3.5.x_build] [INFO] Total time: 17:28 min
[windows-jdk11-m3.5.x_build] [INFO] Finished at: 2018-12-31T04:05:15Z
[windows-jdk11-m3.5.x_build] [INFO] Final Memory: 45M/160M
[windows-jdk11-m3.5.x_build] [INFO] ------------------------------------------------------------------------
[windows-jdk11-m3.5.x_build] [INFO] [jenkins-event-spy] Generated F:\jenkins\jenkins-slave\workspace\ven-shade-plugin_MSHADE-291-KVKTLKLWYKZ6EFRSCOSZT7CEVTWY4URM6BN2UAFLW66UEXJ3KESQ@2@tmp\withMavenbebe3240\maven-spy-20181231-034745-2453283171439077336680.log
[Pipeline] [windows-jdk11-m3.5.x_build] }
[Pipeline] [windows-jdk11-m3.5.x_build] // dir
[Pipeline] [windows-jdk11-m3.5.x_build] }
[windows-jdk11-m3.5.x_build] [withMaven] artifactsPublisher - Archive artifact windows-jdk11-m3.5.x_build\pom.xml
under org\apache\maven\plugins\maven-shade-plugin\3.2.2-SNAPSHOT\maven-shade-plugin-3.2.2-SNAPSHOT.pom
[windows-jdk11-m3.5.x_build] [withMaven] artifactsPublisher - Archive artifact windows-jdk11-m3.5.x_build\target\maven-shade-plugin-3.2.2-SNAPSHOT.jar
under org\apache\maven\plugins\maven-shade-plugin\3.2.2-SNAPSHOT\maven-shade-plugin-3.2.2-SNAPSHOT.jar
[windows-jdk11-m3.5.x_build] [withMaven] artifactsPublisher - Archive artifact windows-jdk11-m3.5.x_build\target\maven-shade-plugin-3.2.2-SNAPSHOT-tests.jar
under org\apache\maven\plugins\maven-shade-plugin\3.2.2-SNAPSHOT\maven-shade-plugin-3.2.2-SNAPSHOT-tests.jar
[windows-jdk11-m3.5.x_build] [withMaven] junitPublisher - Archive test results for Maven artifact
org.apache.maven.plugins:maven-shade-plugin:3.2.2-SNAPSHOT generated by maven-surefire-plugin:test
(default-test): windows-jdk11-m3.5.x_build\target\surefire-reports\*.xml
[windows-jdk11-m3.5.x_build] Recording test results
[windows-jdk11-m3.5.x_build] [withMaven] openTasksPublisher - Scan Tasks for Maven artifact
org.apache.maven.plugins:maven-shade-plugin:3.2.2-SNAPSHOT in source directory windows-jdk11-m3.5.x_build\src\main\java
[windows-jdk11-m3.5.x_build] [TASKS] Scanning folder 'f:\jenkins\jenkins-slave\workspace\ven-shade-plugin_MSHADE-291-KVKTLKLWYKZ6EFRSCOSZT7CEVTWY4URM6BN2UAFLW66UEXJ3KESQ@2'
for files matching the pattern 'windows-jdk11-m3.5.x_build\src\main\java\**\*' - excludes:
null
[windows-jdk11-m3.5.x_build] [TASKS] Found 32 files to scan for tasks
[windows-jdk11-m3.5.x_build] [TASKS] Found 2 open tasks.
[windows-jdk11-m3.5.x_build] Skipping warnings blame since pipelines do not have an SCM link.%n
[windows-jdk11-m3.5.x_build] [TASKS] Computing warning deltas based on reference build #3
[windows-jdk11-m3.5.x_build] [withMaven] invokerPublisher - Archive invoker results for Maven
artifact MavenArtifact{org.apache.maven.plugins:maven-shade-plugin::3.2.2-SNAPSHOT(version:
3.2.2-SNAPSHOT, snapshot:false) } generated by PluginInvocation{org.apache.maven.plugins:maven-invoker-plugin:3.1.0@integration-test
 integration-test}: windows-jdk11-m3.5.x_build\target\invoker-reports\*.xml
[Pipeline] [windows-jdk11-m3.5.x_build] // withMaven
[Pipeline] [windows-jdk11-m3.5.x_build] cleanWs
[windows-jdk11-m3.5.x_build] [WS-CLEANUP] Deleting project workspace...Cannot delete workspace
:remote file operation failed: f:\jenkins\jenkins-slave\workspace\ven-shade-plugin_MSHADE-291-KVKTLKLWYKZ6EFRSCOSZT7CEVTWY4URM6BN2UAFLW66UEXJ3KESQ@2
at hudson.remoting.Channel@398d98d3:JNLP4-connect connection from ec2-34-228-168-168.compute-1.amazonaws.com/34.228.168.168:51626:
java.nio.file.AccessDeniedException: f:\jenkins\jenkins-slave\workspace\ven-shade-plugin_MSHADE-291-KVKTLKLWYKZ6EFRSCOSZT7CEVTWY4URM6BN2UAFLW66UEXJ3KESQ@2
-> f:\jenkins\jenkins-slave\workspace\ven-shade-plugin_MSHADE-291-KVKTLKLWYKZ6EFRSCOSZT7CEVTWY4URM6BN2UAFLW66UEXJ3KESQ@2_ws-cleanup_1546229188054
[Pipeline] [windows-jdk11-m3.5.x_build] }
[Pipeline] [windows-jdk11-m3.5.x_build] // stage
[Pipeline] [windows-jdk11-m3.5.x_build] }
[Pipeline] [windows-jdk11-m3.5.x_build] // ws
[Pipeline] [windows-jdk11-m3.5.x_build] }
[Pipeline] [windows-jdk11-m3.5.x_build] // node
[Pipeline] [windows-jdk11-m3.5.x_build] }
[windows-jdk11-m3.5.x_build] Failed in branch windows-jdk11-m3.5.x_build
[Pipeline] // parallel
[Pipeline] stage
[Pipeline] { (Notifications)
[Pipeline] echo
Build result: FAILURE
[Pipeline] jiraIssueSelector
[Pipeline] emailext
Mime
  • Unnamed multipart/mixed (inline, None, 0 bytes)
View raw message