maven-notifications mailing list archives

Site index · List index
Message view « Date » · « Thread »
Top « Date » · « Thread »
From Apache Jenkins Server <jenk...@builds.apache.org>
Subject Build failed in Jenkins: Maven TLP » maven-jdeps-plugin » master #46
Date Sun, 30 Dec 2018 05:55:38 GMT
See https://builds.apache.org/job/maven-box/job/maven-jdeps-plugin/job/master/46/

Changes:

* Removed exclusion for problematic node cause the node is back online.
* reduce the history archiving
* reduce the history archiving
* increase a bit archiving
* increase a bit archiving
* Activate sonarqube on first project
* Disable sonar:sonar for now
* use publisherStrategy: 'EXPLICIT' to avoid non used publishers
* [INFRA-17514] Fix file separator + add other locations for workspaces
* fix indent
* use a special local repo to have a bit of caching

All tests passed

Build log:
[...truncated 2.09 MB...]
[windows-jdk11-m3.5.x_build] [INFO] Downloading from central: https://repo.maven.apache.org/maven2/org/sonatype/oss/oss-parent/7/oss-parent-7.pom
[windows-jdk11-m3.5.x_build] [INFO] Downloaded from central: https://repo.maven.apache.org/maven2/org/sonatype/oss/oss-parent/7/oss-parent-7.pom
(4.8 kB at 284 kB/s)
[windows-jdk11-m3.5.x_build] [INFO] Downloading from central: https://repo.maven.apache.org/maven2/javax/xml/bind/jaxb-api/2.3.0/jaxb-api-2.3.0.pom
[windows-jdk11-m3.5.x_build] [INFO] Downloaded from central: https://repo.maven.apache.org/maven2/javax/xml/bind/jaxb-api/2.3.0/jaxb-api-2.3.0.pom
(23 kB at 1.5 MB/s)
[windows-jdk11-m3.5.x_build] [INFO] Downloading from central: https://repo.maven.apache.org/maven2/javax/xml/bind/jaxb-api-parent/2.3.0/jaxb-api-parent-2.3.0.pom
[windows-jdk11-m3.5.x_build] [INFO] Downloaded from central: https://repo.maven.apache.org/maven2/javax/xml/bind/jaxb-api-parent/2.3.0/jaxb-api-parent-2.3.0.pom
(5.6 kB at 376 kB/s)
[windows-jdk11-m3.5.x_build] [INFO] Downloading from central: https://repo.maven.apache.org/maven2/net/java/jvnet-parent/5/jvnet-parent-5.pom
[windows-jdk11-m3.5.x_build] [INFO] Downloaded from central: https://repo.maven.apache.org/maven2/net/java/jvnet-parent/5/jvnet-parent-5.pom
(8.9 kB at 682 kB/s)
[windows-jdk11-m3.5.x_build] [INFO] Downloading from central: https://repo.maven.apache.org/maven2/commons-logging/commons-logging/1.0.4/commons-logging-1.0.4.jar
[windows-jdk11-m3.5.x_build] [INFO] Downloading from central: https://repo.maven.apache.org/maven2/org/apache/maven/shared/maven-shared-resources/2/maven-shared-resources-2.jar
[windows-jdk11-m3.5.x_build] [INFO] Downloading from central: https://repo.maven.apache.org/maven2/org/apache/maven/doxia/doxia-integration-tools/1.6/doxia-integration-tools-1.6.jar
[windows-jdk11-m3.5.x_build] [INFO] Downloading from central: https://repo.maven.apache.org/maven2/org/apache/maven/doxia/doxia-core/1.2/doxia-core-1.2.jar
[windows-jdk11-m3.5.x_build] [INFO] Downloading from central: https://repo.maven.apache.org/maven2/commons-digester/commons-digester/1.6/commons-digester-1.6.jar
[windows-jdk11-m3.5.x_build] [INFO] Downloaded from central: https://repo.maven.apache.org/maven2/commons-logging/commons-logging/1.0.4/commons-logging-1.0.4.jar
(38 kB at 1.7 MB/s)
[windows-jdk11-m3.5.x_build] [INFO] Downloading from central: https://repo.maven.apache.org/maven2/commons-io/commons-io/1.4/commons-io-1.4.jar
[windows-jdk11-m3.5.x_build] [INFO] Downloaded from central: https://repo.maven.apache.org/maven2/commons-digester/commons-digester/1.6/commons-digester-1.6.jar
(168 kB at 5.1 MB/s)
[windows-jdk11-m3.5.x_build] [INFO] Downloading from central: https://repo.maven.apache.org/maven2/org/codehaus/plexus/plexus-resources/1.1.0/plexus-resources-1.1.0.jar
[windows-jdk11-m3.5.x_build] [INFO] Downloaded from central: https://repo.maven.apache.org/maven2/org/apache/maven/doxia/doxia-core/1.2/doxia-core-1.2.jar
(154 kB at 4.2 MB/s)
[windows-jdk11-m3.5.x_build] [INFO] Downloading from central: https://repo.maven.apache.org/maven2/com/puppycrawl/tools/checkstyle/6.18/checkstyle-6.18.jar
[windows-jdk11-m3.5.x_build] [INFO] Downloaded from central: https://repo.maven.apache.org/maven2/commons-io/commons-io/1.4/commons-io-1.4.jar
(109 kB at 1.2 MB/s)
[windows-jdk11-m3.5.x_build] [INFO] Downloading from central: https://repo.maven.apache.org/maven2/antlr/antlr/2.7.7/antlr-2.7.7.jar
[windows-jdk11-m3.5.x_build] [INFO] Downloaded from central: https://repo.maven.apache.org/maven2/com/puppycrawl/tools/checkstyle/6.18/checkstyle-6.18.jar
(1.2 MB at 10 MB/s)
[windows-jdk11-m3.5.x_build] [INFO] Downloading from central: https://repo.maven.apache.org/maven2/org/antlr/antlr4-runtime/4.5.3/antlr4-runtime-4.5.3.jar
[windows-jdk11-m3.5.x_build] [INFO] Downloaded from central: https://repo.maven.apache.org/maven2/org/apache/maven/shared/maven-shared-resources/2/maven-shared-resources-2.jar
(13 kB at 116 kB/s)
[windows-jdk11-m3.5.x_build] [INFO] Downloading from central: https://repo.maven.apache.org/maven2/commons-beanutils/commons-beanutils/1.9.2/commons-beanutils-1.9.2.jar
[windows-jdk11-m3.5.x_build] [INFO] Downloaded from central: https://repo.maven.apache.org/maven2/antlr/antlr/2.7.7/antlr-2.7.7.jar
(445 kB at 3.7 MB/s)
[windows-jdk11-m3.5.x_build] [INFO] Downloading from central: https://repo.maven.apache.org/maven2/commons-cli/commons-cli/1.3.1/commons-cli-1.3.1.jar
[windows-jdk11-m3.5.x_build] [INFO] Downloaded from central: https://repo.maven.apache.org/maven2/commons-beanutils/commons-beanutils/1.9.2/commons-beanutils-1.9.2.jar
(234 kB at 1.6 MB/s)
[windows-jdk11-m3.5.x_build] [INFO] Downloading from central: https://repo.maven.apache.org/maven2/com/google/guava/guava/19.0/guava-19.0.jar
[windows-jdk11-m3.5.x_build] [INFO] Downloaded from central: https://repo.maven.apache.org/maven2/org/codehaus/plexus/plexus-resources/1.1.0/plexus-resources-1.1.0.jar
(23 kB at 121 kB/s)
[windows-jdk11-m3.5.x_build] [INFO] Downloading from central: https://repo.maven.apache.org/maven2/commons-lang/commons-lang/2.1/commons-lang-2.1.jar
[windows-jdk11-m3.5.x_build] [INFO] Downloaded from central: https://repo.maven.apache.org/maven2/commons-cli/commons-cli/1.3.1/commons-cli-1.3.1.jar
(53 kB at 260 kB/s)
[windows-jdk11-m3.5.x_build] [INFO] Downloading from central: https://repo.maven.apache.org/maven2/javax/xml/bind/jaxb-api/2.3.0/jaxb-api-2.3.0.jar
[windows-jdk11-m3.5.x_build] [INFO] Downloaded from central: https://repo.maven.apache.org/maven2/org/antlr/antlr4-runtime/4.5.3/antlr4-runtime-4.5.3.jar
(302 kB at 1.4 MB/s)
[windows-jdk11-m3.5.x_build] [INFO] Downloaded from central: https://repo.maven.apache.org/maven2/org/apache/maven/doxia/doxia-integration-tools/1.6/doxia-integration-tools-1.6.jar
(45 kB at 206 kB/s)
[windows-jdk11-m3.5.x_build] [INFO] Downloaded from central: https://repo.maven.apache.org/maven2/com/google/guava/guava/19.0/guava-19.0.jar
(2.3 MB at 10 MB/s)
[windows-jdk11-m3.5.x_build] [INFO] Downloaded from central: https://repo.maven.apache.org/maven2/commons-lang/commons-lang/2.1/commons-lang-2.1.jar
(208 kB at 931 kB/s)
[windows-jdk11-m3.5.x_build] [INFO] Downloaded from central: https://repo.maven.apache.org/maven2/javax/xml/bind/jaxb-api/2.3.0/jaxb-api-2.3.0.jar
(126 kB at 553 kB/s)
[windows-jdk11-m3.5.x_build] [INFO] 
[windows-jdk11-m3.5.x_build] [INFO] --- maven-invoker-plugin:3.1.0:verify (integration-test)
@ maven-jdeps-plugin ---
[windows-jdk11-m3.5.x_build] [INFO] -------------------------------------------------
[windows-jdk11-m3.5.x_build] [INFO] Build Summary:
[windows-jdk11-m3.5.x_build] [INFO]   Passed: 5, Failed: 0, Errors: 0, Skipped: 2
[windows-jdk11-m3.5.x_build] [INFO] -------------------------------------------------
[windows-jdk11-m3.5.x_build] [INFO] ------------------------------------------------------------------------
[windows-jdk11-m3.5.x_build] [INFO] BUILD SUCCESS
[windows-jdk11-m3.5.x_build] [INFO] ------------------------------------------------------------------------
[windows-jdk11-m3.5.x_build] [INFO] Total time: 01:02 min
[windows-jdk11-m3.5.x_build] [INFO] Finished at: 2018-12-30T05:41:23Z
[Pipeline] [windows-jdk8-m3.2.x_build] }
[windows-jdk8-m3.2.x_build] [withMaven] artifactsPublisher - Archive artifact windows-jdk8-m3.2.x_build\pom.xml
under org\apache\maven\plugins\maven-jdeps-plugin\3.1.2-SNAPSHOT\maven-jdeps-plugin-3.1.2-SNAPSHOT.pom
[windows-jdk8-m3.2.x_build] [withMaven] artifactsPublisher - Archive artifact windows-jdk8-m3.2.x_build\target\maven-jdeps-plugin-3.1.2-SNAPSHOT.jar
under org\apache\maven\plugins\maven-jdeps-plugin\3.1.2-SNAPSHOT\maven-jdeps-plugin-3.1.2-SNAPSHOT.jar
[windows-jdk8-m3.2.x_build] [withMaven] junitPublisher - Archive test results for Maven artifact
org.apache.maven.plugins:maven-jdeps-plugin:3.1.2-SNAPSHOT generated by maven-surefire-plugin:test
(default-test): windows-jdk8-m3.2.x_build\target\surefire-reports\*.xml
[windows-jdk8-m3.2.x_build] Recording test results
[windows-jdk8-m3.2.x_build] [withMaven] openTasksPublisher - Scan Tasks for Maven artifact
org.apache.maven.plugins:maven-jdeps-plugin:3.1.2-SNAPSHOT in source directory windows-jdk8-m3.2.x_build\src\main\java
[windows-jdk8-m3.2.x_build] [TASKS] Scanning folder 'f:\jenkins\jenkins-slave\workspace\x_maven-jdeps-plugin_master-NK4576UNJJCYQVC667D46I6VDU64O3SNLDEXNWG3R2K63JIOVMYA@2'
for files matching the pattern 'windows-jdk8-m3.2.x_build\src\main\java\**\*' - excludes:
null
[windows-jdk8-m3.2.x_build] [TASKS] Found 5 files to scan for tasks
[windows-jdk8-m3.2.x_build] [TASKS] Found 1 open tasks.
[windows-jdk8-m3.2.x_build] Skipping warnings blame since pipelines do not have an SCM link.%n
[windows-jdk8-m3.2.x_build] [TASKS] Computing warning deltas based on reference build #45
[windows-jdk8-m3.2.x_build] [withMaven] invokerPublisher - Archive invoker results for Maven
artifact MavenArtifact{org.apache.maven.plugins:maven-jdeps-plugin::3.1.2-SNAPSHOT(version:
3.1.2-SNAPSHOT, snapshot:false) } generated by PluginInvocation{org.apache.maven.plugins:maven-invoker-plugin:3.1.0@integration-test
 integration-test}: windows-jdk8-m3.2.x_build\target\invoker-reports\*.xml
[Pipeline] [windows-jdk8-m3.2.x_build] // withMaven
[Pipeline] [windows-jdk8-m3.2.x_build] cleanWs
[windows-jdk8-m3.2.x_build] [WS-CLEANUP] Deleting project workspace...Cannot delete workspace
:remote file operation failed: f:\jenkins\jenkins-slave\workspace\x_maven-jdeps-plugin_master-NK4576UNJJCYQVC667D46I6VDU64O3SNLDEXNWG3R2K63JIOVMYA@2
at hudson.remoting.Channel@4ee2423:JNLP4-connect connection from 37.48.69.226/37.48.69.226:64887:
java.nio.file.AccessDeniedException: f:\jenkins\jenkins-slave\workspace\x_maven-jdeps-plugin_master-NK4576UNJJCYQVC667D46I6VDU64O3SNLDEXNWG3R2K63JIOVMYA@2
-> f:\jenkins\jenkins-slave\workspace\x_maven-jdeps-plugin_master-NK4576UNJJCYQVC667D46I6VDU64O3SNLDEXNWG3R2K63JIOVMYA@2_ws-cleanup_1546148483582
[Pipeline] [windows-jdk8-m3.2.x_build] }
[Pipeline] [windows-jdk8-m3.2.x_build] // stage
[Pipeline] [windows-jdk8-m3.2.x_build] }
[Pipeline] [windows-jdk8-m3.2.x_build] // ws
[Pipeline] [windows-jdk8-m3.2.x_build] }
[Pipeline] [windows-jdk8-m3.2.x_build] // node
[Pipeline] [windows-jdk8-m3.2.x_build] }
[windows-jdk8-m3.2.x_build] Failed in branch windows-jdk8-m3.2.x_build
[windows-jdk11-m3.5.x_build] [INFO] Final Memory: 43M/154M
[windows-jdk11-m3.5.x_build] [INFO] ------------------------------------------------------------------------
[windows-jdk11-m3.5.x_build] [INFO] [jenkins-event-spy] Generated F:\jenkins\jenkins-slave\workspace\x_maven-jdeps-plugin_master-NK4576UNJJCYQVC667D46I6VDU64O3SNLDEXNWG3R2K63JIOVMYA@2@tmp\withMavenb438e6c2\maven-spy-20181230-054021-1301030285892195700057.log
[Pipeline] [windows-jdk11-m3.5.x_build] }
[Pipeline] [windows-jdk11-m3.5.x_build] // dir
[Pipeline] [windows-jdk11-m3.5.x_build] }
[windows-jdk11-m3.5.x_build] [withMaven] artifactsPublisher - Archive artifact windows-jdk11-m3.5.x_build\pom.xml
under org\apache\maven\plugins\maven-jdeps-plugin\3.1.2-SNAPSHOT\maven-jdeps-plugin-3.1.2-SNAPSHOT.pom
[windows-jdk11-m3.5.x_build] [withMaven] artifactsPublisher - Archive artifact windows-jdk11-m3.5.x_build\target\maven-jdeps-plugin-3.1.2-SNAPSHOT.jar
under org\apache\maven\plugins\maven-jdeps-plugin\3.1.2-SNAPSHOT\maven-jdeps-plugin-3.1.2-SNAPSHOT.jar
[windows-jdk11-m3.5.x_build] [withMaven] junitPublisher - Archive test results for Maven artifact
org.apache.maven.plugins:maven-jdeps-plugin:3.1.2-SNAPSHOT generated by maven-surefire-plugin:test
(default-test): windows-jdk11-m3.5.x_build\target\surefire-reports\*.xml
[windows-jdk11-m3.5.x_build] Recording test results
[windows-jdk11-m3.5.x_build] [withMaven] openTasksPublisher - Scan Tasks for Maven artifact
org.apache.maven.plugins:maven-jdeps-plugin:3.1.2-SNAPSHOT in source directory windows-jdk11-m3.5.x_build\src\main\java
[windows-jdk11-m3.5.x_build] [TASKS] Scanning folder 'f:\jenkins\jenkins-slave\workspace\x_maven-jdeps-plugin_master-NK4576UNJJCYQVC667D46I6VDU64O3SNLDEXNWG3R2K63JIOVMYA@2'
for files matching the pattern 'windows-jdk11-m3.5.x_build\src\main\java\**\*' - excludes:
null
[windows-jdk11-m3.5.x_build] [TASKS] Found 5 files to scan for tasks
[windows-jdk11-m3.5.x_build] [TASKS] Found 1 open tasks.
[windows-jdk11-m3.5.x_build] Skipping warnings blame since pipelines do not have an SCM link.%n
[windows-jdk11-m3.5.x_build] [TASKS] Computing warning deltas based on reference build #45
[windows-jdk11-m3.5.x_build] [withMaven] invokerPublisher - Archive invoker results for Maven
artifact MavenArtifact{org.apache.maven.plugins:maven-jdeps-plugin::3.1.2-SNAPSHOT(version:
3.1.2-SNAPSHOT, snapshot:false) } generated by PluginInvocation{org.apache.maven.plugins:maven-invoker-plugin:3.1.0@integration-test
 integration-test}: windows-jdk11-m3.5.x_build\target\invoker-reports\*.xml
[Pipeline] [windows-jdk11-m3.5.x_build] // withMaven
[Pipeline] [windows-jdk11-m3.5.x_build] cleanWs
[windows-jdk11-m3.5.x_build] [WS-CLEANUP] Deleting project workspace...Cannot delete workspace
:remote file operation failed: f:\jenkins\jenkins-slave\workspace\x_maven-jdeps-plugin_master-NK4576UNJJCYQVC667D46I6VDU64O3SNLDEXNWG3R2K63JIOVMYA@2
at hudson.remoting.Channel@398d98d3:JNLP4-connect connection from ec2-34-228-168-168.compute-1.amazonaws.com/34.228.168.168:51626:
java.nio.file.AccessDeniedException: f:\jenkins\jenkins-slave\workspace\x_maven-jdeps-plugin_master-NK4576UNJJCYQVC667D46I6VDU64O3SNLDEXNWG3R2K63JIOVMYA@2
-> f:\jenkins\jenkins-slave\workspace\x_maven-jdeps-plugin_master-NK4576UNJJCYQVC667D46I6VDU64O3SNLDEXNWG3R2K63JIOVMYA@2_ws-cleanup_1546148491327
[Pipeline] [windows-jdk11-m3.5.x_build] }
[Pipeline] [windows-jdk11-m3.5.x_build] // stage
[Pipeline] [windows-jdk11-m3.5.x_build] }
[Pipeline] [windows-jdk11-m3.5.x_build] // ws
[Pipeline] [windows-jdk11-m3.5.x_build] }
[Pipeline] [windows-jdk11-m3.5.x_build] // node
[Pipeline] [windows-jdk11-m3.5.x_build] }
[windows-jdk11-m3.5.x_build] Failed in branch windows-jdk11-m3.5.x_build
[windows-jdk8-m3.5.x_build] [INFO] Downloaded from central: https://repo.maven.apache.org/maven2/org/apache/maven/maven-artifact/3.0/maven-artifact-3.0.pom
(0 B at 0 B/s)
[windows-jdk8-m3.5.x_build] [INFO] 
[windows-jdk8-m3.5.x_build] [INFO] --- maven-clean-plugin:3.1.0:clean (default-clean) @ maven-jdeps-plugin
---
[windows-jdk8-m3.5.x_build] [INFO] 
[windows-jdk8-m3.5.x_build] [INFO] --- maven-enforcer-plugin:1.4.1:enforce (enforce-maven-version)
@ maven-jdeps-plugin ---
[windows-jdk8-m3.5.x_build] [INFO] 
[windows-jdk8-m3.5.x_build] [INFO] --- maven-enforcer-plugin:1.4.1:enforce (enforce-bytecode-version)
@ maven-jdeps-plugin ---
[windows-jdk8-m3.5.x_build] [INFO] 
[windows-jdk8-m3.5.x_build] [INFO] --- maven-enforcer-plugin:1.4.1:enforce (ban-known-bad-maven-versions)
@ maven-jdeps-plugin ---
[windows-jdk8-m3.5.x_build] [INFO] 
[windows-jdk8-m3.5.x_build] [INFO] --- maven-enforcer-plugin:1.4.1:enforce (ensure-no-container-api)
@ maven-jdeps-plugin ---
[windows-jdk8-m3.5.x_build] [INFO] 
[windows-jdk8-m3.5.x_build] [INFO] --- apache-rat-plugin:0.12:check (rat-check) @ maven-jdeps-plugin
---
[windows-jdk8-m3.5.x_build] [INFO] Enabled default license matchers.
[windows-jdk8-m3.5.x_build] [INFO] Will parse SCM ignores for exclusions...
[windows-jdk8-m3.5.x_build] [INFO] Parsing exclusions from f:\jenkins\jenkins-slave\workspace\x_maven-jdeps-plugin_master-NK4576UNJJCYQVC667D46I6VDU64O3SNLDEXNWG3R2K63JIOVMYA@3@2\windows-jdk8-m3.5.x_build\.gitignore
[windows-jdk8-m3.5.x_build] [INFO] Finished adding exclusions from SCM ignore files.
[windows-jdk8-m3.5.x_build] [INFO] 71 implicit excludes (use -debug for more details).
[windows-jdk8-m3.5.x_build] [INFO] Exclude: .repository/**
[windows-jdk8-m3.5.x_build] [INFO] Exclude: .maven/spy.log
[windows-jdk8-m3.5.x_build] [INFO] Exclude: dependency-reduced-pom.xml
[windows-jdk8-m3.5.x_build] [INFO] Exclude: .java-version
[windows-jdk8-m3.5.x_build] [INFO] 41 resources included (use -debug for more details)
[windows-jdk8-m3.5.x_build] [INFO] Rat check: Summary over all files. Unapproved: 0, unknown:
0, generated: 0, approved: 41 licenses.
[windows-jdk8-m3.5.x_build] [INFO] 
[windows-jdk8-m3.5.x_build] [INFO] --- maven-plugin-plugin:3.5.2:helpmojo (generate-helpmojo)
@ maven-jdeps-plugin ---
[windows-jdk8-m3.5.x_build] [INFO] Using 'UTF-8' encoding to read mojo source files.
[windows-jdk8-m3.5.x_build] [INFO] java-javadoc mojo extractor found 0 mojo descriptor.
[windows-jdk8-m3.5.x_build] [INFO] java-annotations mojo extractor found 0 mojo descriptor.
[windows-jdk8-m3.5.x_build] [INFO] 
[windows-jdk8-m3.5.x_build] [INFO] --- maven-remote-resources-plugin:1.5:process (process-resource-bundles)
@ maven-jdeps-plugin ---
[windows-jdk8-m3.5.x_build] [INFO] 
[windows-jdk8-m3.5.x_build] [INFO] --- maven-resources-plugin:3.1.0:resources (default-resources)
@ maven-jdeps-plugin ---
[windows-jdk8-m3.5.x_build] [INFO] Using 'UTF-8' encoding to copy filtered resources.
[windows-jdk8-m3.5.x_build] [INFO] skip non existing resourceDirectory f:\jenkins\jenkins-slave\workspace\x_maven-jdeps-plugin_master-NK4576UNJJCYQVC667D46I6VDU64O3SNLDEXNWG3R2K63JIOVMYA@3@2\windows-jdk8-m3.5.x_build\src\main\resources
[windows-jdk8-m3.5.x_build] [INFO] Copying 3 resources
[windows-jdk8-m3.5.x_build] [INFO] 
[windows-jdk8-m3.5.x_build] [INFO] --- maven-compiler-plugin:3.7.0:compile (default-compile)
@ maven-jdeps-plugin ---
[windows-jdk8-m3.5.x_build] [INFO] Changes detected - recompiling the module!
[windows-jdk8-m3.5.x_build] [INFO] Compiling 6 source files to f:\jenkins\jenkins-slave\workspace\x_maven-jdeps-plugin_master-NK4576UNJJCYQVC667D46I6VDU64O3SNLDEXNWG3R2K63JIOVMYA@3@2\windows-jdk8-m3.5.x_build\target\classes
[windows-jdk8-m3.5.x_build] [INFO] 
[windows-jdk8-m3.5.x_build] [INFO] --- maven-plugin-plugin:3.5.2:descriptor (default-descriptor)
@ maven-jdeps-plugin ---
[windows-jdk8-m3.5.x_build] [INFO] Using 'UTF-8' encoding to read mojo source files.
[windows-jdk8-m3.5.x_build] [INFO] java-javadoc mojo extractor found 0 mojo descriptor.
[windows-jdk8-m3.5.x_build] [INFO] java-annotations mojo extractor found 3 mojo descriptors.
[windows-jdk8-m3.5.x_build] [INFO] 
[windows-jdk8-m3.5.x_build] [INFO] --- maven-resources-plugin:3.1.0:testResources (default-testResources)
@ maven-jdeps-plugin ---
[windows-jdk8-m3.5.x_build] [INFO] Using 'UTF-8' encoding to copy filtered resources.
[windows-jdk8-m3.5.x_build] [INFO] skip non existing resourceDirectory f:\jenkins\jenkins-slave\workspace\x_maven-jdeps-plugin_master-NK4576UNJJCYQVC667D46I6VDU64O3SNLDEXNWG3R2K63JIOVMYA@3@2\windows-jdk8-m3.5.x_build\src\test\resources
[windows-jdk8-m3.5.x_build] [INFO] Copying 3 resources
[windows-jdk8-m3.5.x_build] [INFO] 
[windows-jdk8-m3.5.x_build] [INFO] --- maven-compiler-plugin:3.7.0:testCompile (default-testCompile)
@ maven-jdeps-plugin ---
[windows-jdk8-m3.5.x_build] [INFO] Changes detected - recompiling the module!
[windows-jdk8-m3.5.x_build] [INFO] Compiling 1 source file to f:\jenkins\jenkins-slave\workspace\x_maven-jdeps-plugin_master-NK4576UNJJCYQVC667D46I6VDU64O3SNLDEXNWG3R2K63JIOVMYA@3@2\windows-jdk8-m3.5.x_build\target\test-classes
[windows-jdk8-m3.5.x_build] [INFO] 
[windows-jdk8-m3.5.x_build] [INFO] --- maven-surefire-plugin:2.22.0:test (default-test) @
maven-jdeps-plugin ---
[windows-jdk8-m3.5.x_build] [INFO] Surefire report directory: f:\jenkins\jenkins-slave\workspace\x_maven-jdeps-plugin_master-NK4576UNJJCYQVC667D46I6VDU64O3SNLDEXNWG3R2K63JIOVMYA@3@2\windows-jdk8-m3.5.x_build\target\surefire-reports
[windows-jdk8-m3.5.x_build] [INFO] 
[windows-jdk8-m3.5.x_build] [INFO] -------------------------------------------------------
[windows-jdk8-m3.5.x_build] [INFO]  T E S T S
[windows-jdk8-m3.5.x_build] [INFO] -------------------------------------------------------
[windows-jdk8-m3.5.x_build] [INFO] Running org.apache.maven.plugins.jdeps.consumers.JDepsConsumerTest
[windows-jdk8-m3.5.x_build] [INFO] Tests run: 3, Failures: 0, Errors: 0, Skipped: 0, Time
elapsed: 0.06 s - in org.apache.maven.plugins.jdeps.consumers.JDepsConsumerTest
[windows-jdk8-m3.5.x_build] [INFO] 
[windows-jdk8-m3.5.x_build] [INFO] Results:
[windows-jdk8-m3.5.x_build] [INFO] 
[windows-jdk8-m3.5.x_build] [INFO] Tests run: 3, Failures: 0, Errors: 0, Skipped: 0
[windows-jdk8-m3.5.x_build] [INFO] 
[windows-jdk8-m3.5.x_build] [INFO] 
[windows-jdk8-m3.5.x_build] [INFO] --- maven-jar-plugin:3.1.0:jar (default-jar) @ maven-jdeps-plugin
---
[windows-jdk8-m3.5.x_build] [INFO] Building jar: f:\jenkins\jenkins-slave\workspace\x_maven-jdeps-plugin_master-NK4576UNJJCYQVC667D46I6VDU64O3SNLDEXNWG3R2K63JIOVMYA@3@2\windows-jdk8-m3.5.x_build\target\maven-jdeps-plugin-3.1.2-SNAPSHOT.jar
[windows-jdk8-m3.5.x_build] [INFO] 
[windows-jdk8-m3.5.x_build] [INFO] --- maven-plugin-plugin:3.5.2:addPluginArtifactMetadata
(default-addPluginArtifactMetadata) @ maven-jdeps-plugin ---
[windows-jdk8-m3.5.x_build] [INFO] 
[windows-jdk8-m3.5.x_build] [INFO] --- maven-site-plugin:3.7.1:attach-descriptor (attach-descriptor)
@ maven-jdeps-plugin ---
[windows-jdk8-m3.5.x_build] [INFO] Skipping because packaging 'maven-plugin' is not pom.
[windows-jdk8-m3.5.x_build] [INFO] 
[windows-jdk8-m3.5.x_build] [INFO] --- maven-invoker-plugin:3.1.0:install (integration-test)
@ maven-jdeps-plugin ---
[windows-jdk8-m3.5.x_build] [INFO] Installing f:\jenkins\jenkins-slave\workspace\x_maven-jdeps-plugin_master-NK4576UNJJCYQVC667D46I6VDU64O3SNLDEXNWG3R2K63JIOVMYA@3@2\windows-jdk8-m3.5.x_build\pom.xml
to f:\jenkins\jenkins-slave\workspace\x_maven-jdeps-plugin_master-NK4576UNJJCYQVC667D46I6VDU64O3SNLDEXNWG3R2K63JIOVMYA@3@2\windows-jdk8-m3.5.x_build\target\local-repo\org\apache\maven\plugins\maven-jdeps-plugin\3.1.2-SNAPSHOT\maven-jdeps-plugin-3.1.2-SNAPSHOT.pom
[windows-jdk8-m3.5.x_build] [INFO] Installing f:\jenkins\jenkins-slave\workspace\x_maven-jdeps-plugin_master-NK4576UNJJCYQVC667D46I6VDU64O3SNLDEXNWG3R2K63JIOVMYA@3@2\windows-jdk8-m3.5.x_build\target\maven-jdeps-plugin-3.1.2-SNAPSHOT.jar
to f:\jenkins\jenkins-slave\workspace\x_maven-jdeps-plugin_master-NK4576UNJJCYQVC667D46I6VDU64O3SNLDEXNWG3R2K63JIOVMYA@3@2\windows-jdk8-m3.5.x_build\target\local-repo\org\apache\maven\plugins\maven-jdeps-plugin\3.1.2-SNAPSHOT\maven-jdeps-plugin-3.1.2-SNAPSHOT.jar
[windows-jdk8-m3.5.x_build] [INFO] 
[windows-jdk8-m3.5.x_build] [INFO] --- maven-invoker-plugin:3.1.0:integration-test (integration-test)
@ maven-jdeps-plugin ---
[windows-jdk8-m3.5.x_build] [INFO] Building: basic\pom.xml
[windows-jdk8-m3.5.x_build] [INFO]           basic\pom.xml ....................................
SUCCESS (9.4 s)
[windows-jdk8-m3.5.x_build] [INFO] Building: dependenciesToAnalyze\pom.xml
[windows-jdk8-m3.5.x_build] [INFO] run post-build script verify.groovy
[windows-jdk8-m3.5.x_build] [INFO]           dependenciesToAnalyze\pom.xml ....................
SUCCESS (7.2 s)
[windows-jdk8-m3.5.x_build] [INFO] Building: module\pom.xml
[windows-jdk8-m3.5.x_build] [INFO]           module\pom.xml ...................................
SKIPPED due to JRE version
[windows-jdk8-m3.5.x_build] [INFO] Building: multirelease\pom.xml
[windows-jdk8-m3.5.x_build] [INFO]           multirelease\pom.xml .............................
SKIPPED due to JRE version
[windows-jdk8-m3.5.x_build] [INFO] Building: package\pom.xml
[windows-jdk8-m3.5.x_build] [INFO] run post-build script verify.groovy
[windows-jdk8-m3.5.x_build] [INFO]           package\pom.xml ..................................
SUCCESS (6.1 s)
[windows-jdk8-m3.5.x_build] [INFO] Building: unsupported-api_main\pom.xml
[windows-jdk8-m3.5.x_build] [INFO] run post-build script verify.groovy
[windows-jdk8-m3.5.x_build] [INFO]           unsupported-api_main\pom.xml .....................
SUCCESS (6.2 s)
[windows-jdk8-m3.5.x_build] [INFO] Building: unsupported-api_test\pom.xml
[windows-jdk8-m3.5.x_build] [INFO] run post-build script verify.groovy
[windows-jdk8-m3.5.x_build] [INFO]           unsupported-api_test\pom.xml .....................
SUCCESS (14.0 s)
[windows-jdk8-m3.5.x_build] [INFO] 
[windows-jdk8-m3.5.x_build] [INFO] --- maven-checkstyle-plugin:3.0.0:check (checkstyle-check)
@ maven-jdeps-plugin ---
[windows-jdk8-m3.5.x_build] [INFO] 
[windows-jdk8-m3.5.x_build] [INFO] --- maven-invoker-plugin:3.1.0:verify (integration-test)
@ maven-jdeps-plugin ---
[windows-jdk8-m3.5.x_build] [INFO] -------------------------------------------------
[windows-jdk8-m3.5.x_build] [INFO] Build Summary:
[windows-jdk8-m3.5.x_build] [INFO]   Passed: 5, Failed: 0, Errors: 0, Skipped: 2
[windows-jdk8-m3.5.x_build] [INFO] -------------------------------------------------
[windows-jdk8-m3.5.x_build] [INFO] ------------------------------------------------------------------------
[windows-jdk8-m3.5.x_build] [INFO] BUILD SUCCESS
[windows-jdk8-m3.5.x_build] [INFO] ------------------------------------------------------------------------
[windows-jdk8-m3.5.x_build] [INFO] Total time: 15:57 min
[windows-jdk8-m3.5.x_build] [INFO] Finished at: 2018-12-30T05:55:36Z
[windows-jdk8-m3.5.x_build] [INFO] Final Memory: 50M/667M
[windows-jdk8-m3.5.x_build] [INFO] ------------------------------------------------------------------------
[windows-jdk8-m3.5.x_build] [INFO] [jenkins-event-spy] Generated F:\jenkins\jenkins-slave\workspace\x_maven-jdeps-plugin_master-NK4576UNJJCYQVC667D46I6VDU64O3SNLDEXNWG3R2K63JIOVMYA@3@2@tmp\withMaven82de602d\maven-spy-20181230-053938-4014371145073813535086.log
[windows-jdk8-m3.5.x_build] Picked up JAVA_TOOL_OPTIONS: -Dmaven.ext.class.path="f:\jenkins\jenkins-slave\workspace\x_maven-jdeps-plugin_master-NK4576UNJJCYQVC667D46I6VDU64O3SNLDEXNWG3R2K63JIOVMYA@3@2@tmp\withMaven82de602d\pipeline-maven-spy.jar"
-Dorg.jenkinsci.plugins.pipeline.maven.reportsFolder="f:\jenkins\jenkins-slave\workspace\x_maven-jdeps-plugin_master-NK4576UNJJCYQVC667D46I6VDU64O3SNLDEXNWG3R2K63JIOVMYA@3@2@tmp\withMaven82de602d"

[Pipeline] [windows-jdk8-m3.5.x_build] }
[Pipeline] [windows-jdk8-m3.5.x_build] // dir
[Pipeline] [windows-jdk8-m3.5.x_build] }
[windows-jdk8-m3.5.x_build] [withMaven] artifactsPublisher - Archive artifact windows-jdk8-m3.5.x_build\pom.xml
under org\apache\maven\plugins\maven-jdeps-plugin\3.1.2-SNAPSHOT\maven-jdeps-plugin-3.1.2-SNAPSHOT.pom
[windows-jdk8-m3.5.x_build] [withMaven] artifactsPublisher - Archive artifact windows-jdk8-m3.5.x_build\target\maven-jdeps-plugin-3.1.2-SNAPSHOT.jar
under org\apache\maven\plugins\maven-jdeps-plugin\3.1.2-SNAPSHOT\maven-jdeps-plugin-3.1.2-SNAPSHOT.jar
[windows-jdk8-m3.5.x_build] [withMaven] junitPublisher - Archive test results for Maven artifact
org.apache.maven.plugins:maven-jdeps-plugin:3.1.2-SNAPSHOT generated by maven-surefire-plugin:test
(default-test): windows-jdk8-m3.5.x_build\target\surefire-reports\*.xml
[windows-jdk8-m3.5.x_build] Recording test results
[windows-jdk8-m3.5.x_build] [withMaven] openTasksPublisher - Scan Tasks for Maven artifact
org.apache.maven.plugins:maven-jdeps-plugin:3.1.2-SNAPSHOT in source directory windows-jdk8-m3.5.x_build\src\main\java
[windows-jdk8-m3.5.x_build] [TASKS] Scanning folder 'f:\jenkins\jenkins-slave\workspace\x_maven-jdeps-plugin_master-NK4576UNJJCYQVC667D46I6VDU64O3SNLDEXNWG3R2K63JIOVMYA@3@2'
for files matching the pattern 'windows-jdk8-m3.5.x_build\src\main\java\**\*' - excludes:
null
[windows-jdk8-m3.5.x_build] [TASKS] Found 5 files to scan for tasks
[windows-jdk8-m3.5.x_build] [TASKS] Found 1 open tasks.
[windows-jdk8-m3.5.x_build] Skipping warnings blame since pipelines do not have an SCM link.%n
[windows-jdk8-m3.5.x_build] [TASKS] Computing warning deltas based on reference build #45
[windows-jdk8-m3.5.x_build] [withMaven] invokerPublisher - Archive invoker results for Maven
artifact MavenArtifact{org.apache.maven.plugins:maven-jdeps-plugin::3.1.2-SNAPSHOT(version:
3.1.2-SNAPSHOT, snapshot:false) } generated by PluginInvocation{org.apache.maven.plugins:maven-invoker-plugin:3.1.0@integration-test
 integration-test}: windows-jdk8-m3.5.x_build\target\invoker-reports\*.xml
[Pipeline] [windows-jdk8-m3.5.x_build] // withMaven
[Pipeline] [windows-jdk8-m3.5.x_build] cleanWs
[windows-jdk8-m3.5.x_build] [WS-CLEANUP] Deleting project workspace...Cannot delete workspace
:remote file operation failed: f:\jenkins\jenkins-slave\workspace\x_maven-jdeps-plugin_master-NK4576UNJJCYQVC667D46I6VDU64O3SNLDEXNWG3R2K63JIOVMYA@3@2
at hudson.remoting.Channel@41afa848:JNLP4-connect connection from 37.48.69.226/37.48.69.226:49574:
java.nio.file.AccessDeniedException: f:\jenkins\jenkins-slave\workspace\x_maven-jdeps-plugin_master-NK4576UNJJCYQVC667D46I6VDU64O3SNLDEXNWG3R2K63JIOVMYA@3@2
-> f:\jenkins\jenkins-slave\workspace\x_maven-jdeps-plugin_master-NK4576UNJJCYQVC667D46I6VDU64O3SNLDEXNWG3R2K63JIOVMYA@3@2_ws-cleanup_1546149338455
[Pipeline] [windows-jdk8-m3.5.x_build] }
[Pipeline] [windows-jdk8-m3.5.x_build] // stage
[Pipeline] [windows-jdk8-m3.5.x_build] }
[Pipeline] [windows-jdk8-m3.5.x_build] // ws
[Pipeline] [windows-jdk8-m3.5.x_build] }
[Pipeline] [windows-jdk8-m3.5.x_build] // node
[Pipeline] [windows-jdk8-m3.5.x_build] }
[windows-jdk8-m3.5.x_build] Failed in branch windows-jdk8-m3.5.x_build
[Pipeline] // parallel
[Pipeline] stage
[Pipeline] { (Notifications)
[Pipeline] echo
Build result: FAILURE
[Pipeline] jiraIssueSelector
[Pipeline] emailext
Mime
  • Unnamed multipart/mixed (inline, None, 0 bytes)
View raw message