maven-notifications mailing list archives

Site index · List index
Message view « Date » · « Thread »
Top « Date » · « Thread »
From Apache Jenkins Server <jenk...@builds.apache.org>
Subject Build failed in Jenkins: Maven TLP » maven-war-plugin » MWAR-371 #1
Date Fri, 28 Dec 2018 11:41:02 GMT
See https://builds.apache.org/job/maven-box/job/maven-war-plugin/job/MWAR-371/1/

No changes.

All tests passed

Build log:
[...truncated 3.85 MB...]
[linux-jdk11-m3.5.x_build] [INFO] Downloaded from central: https://repo.maven.apache.org/maven2/commons-cli/commons-cli/1.3.1/commons-cli-1.3.1.jar
(53 kB at 946 kB/s)
[linux-jdk11-m3.5.x_build] [INFO] Downloaded from central: https://repo.maven.apache.org/maven2/com/puppycrawl/tools/checkstyle/6.18/checkstyle-6.18.jar
(1.2 MB at 19 MB/s)
[linux-jdk11-m3.5.x_build] [INFO] Downloaded from central: https://repo.maven.apache.org/maven2/commons-lang/commons-lang/2.1/commons-lang-2.1.jar
(208 kB at 3.2 MB/s)
[linux-jdk11-m3.5.x_build] [INFO] Downloaded from central: https://repo.maven.apache.org/maven2/javax/xml/bind/jaxb-api/2.3.0/jaxb-api-2.3.0.jar
(126 kB at 1.8 MB/s)
[linux-jdk11-m3.5.x_build] [INFO] Downloaded from central: https://repo.maven.apache.org/maven2/com/google/guava/guava/19.0/guava-19.0.jar
(2.3 MB at 17 MB/s)
[linux-jdk11-m3.5.x_build] [INFO] There is 1 error reported by Checkstyle 6.18 with config/maven_checks.xml
ruleset.
[linux-jdk11-m3.5.x_build] [INFO] Ignored 1 error, 0 violation remaining.
[linux-jdk11-m3.5.x_build] [INFO] 
[linux-jdk11-m3.5.x_build] [INFO] --- maven-invoker-plugin:3.1.0:verify (integration-test)
@ maven-war-plugin ---
[linux-jdk11-m3.5.x_build] [INFO] -------------------------------------------------
[linux-jdk11-m3.5.x_build] [INFO] Build Summary:
[linux-jdk11-m3.5.x_build] [INFO]   Passed: 26, Failed: 0, Errors: 0, Skipped: 0
[linux-jdk11-m3.5.x_build] [INFO] -------------------------------------------------
[linux-jdk11-m3.5.x_build] [INFO] ------------------------------------------------------------------------
[linux-jdk11-m3.5.x_build] [INFO] BUILD SUCCESS
[linux-jdk11-m3.5.x_build] [INFO] ------------------------------------------------------------------------
[linux-jdk11-m3.5.x_build] [INFO] Total time: 02:49 min
[linux-jdk11-m3.5.x_build] [INFO] Finished at: 2018-12-28T11:36:43Z
[linux-jdk11-m3.5.x_build] [INFO] ------------------------------------------------------------------------
[linux-jdk11-m3.5.x_build] [INFO] [jenkins-event-spy] Generated /home/jenkins/jenkins-slave/workspace/x_maven-war-plugin_MWAR-371-A2TGFFIOP6EYAINTDUT6BI4C24UCDLISOPQ5LHY6YOAV7C5HBHCA@2@tmp/withMaven224f3958/maven-spy-20181228-113353-91014893214574504031484.log
[Pipeline] [linux-jdk7-m3.3.x_build] }
[linux-jdk7-m3.3.x_build] [withMaven] artifactsPublisher - Archive artifact linux-jdk7-m3.3.x_build/pom.xml
under org/apache/maven/plugins/maven-war-plugin/3.2.3-SNAPSHOT/maven-war-plugin-3.2.3-SNAPSHOT.pom
[linux-jdk7-m3.3.x_build] [withMaven] artifactsPublisher - Archive artifact linux-jdk7-m3.3.x_build/target/maven-war-plugin-3.2.3-SNAPSHOT.jar
under org/apache/maven/plugins/maven-war-plugin/3.2.3-SNAPSHOT/maven-war-plugin-3.2.3-SNAPSHOT.jar
[linux-jdk7-m3.3.x_build] [Fast Archiver] No prior successful build to compare, so performing
full copy of artifacts
[linux-jdk7-m3.3.x_build] [withMaven] invokerPublisher - Archive invoker results for Maven
artifact MavenArtifact{org.apache.maven.plugins:maven-war-plugin::3.2.3-SNAPSHOT(version:
3.2.3-SNAPSHOT, snapshot:false) } generated by PluginInvocation{org.apache.maven.plugins:maven-invoker-plugin:3.1.0@integration-test
 integration-test}: linux-jdk7-m3.3.x_build/target/invoker-reports/*.xml
[linux-jdk7-m3.3.x_build] [withMaven] junitPublisher - Archive test results for Maven artifact
org.apache.maven.plugins:maven-war-plugin:3.2.3-SNAPSHOT generated by maven-surefire-plugin:test
(default-test): linux-jdk7-m3.3.x_build/target/surefire-reports/*.xml
[linux-jdk7-m3.3.x_build] Recording test results
[linux-jdk7-m3.3.x_build] [withMaven] openTasksPublisher - Scan Tasks for Maven artifact org.apache.maven.plugins:maven-war-plugin:3.2.3-SNAPSHOT
in source directory linux-jdk7-m3.3.x_build/src/main/java
[linux-jdk7-m3.3.x_build] [TASKS] Scanning folder '/home/jenkins/jenkins-slave/workspace/x_maven-war-plugin_MWAR-371-A2TGFFIOP6EYAINTDUT6BI4C24UCDLISOPQ5LHY6YOAV7C5HBHCA@2'
for files matching the pattern 'linux-jdk7-m3.3.x_build/src/main/java/**/*' - excludes: null
[linux-jdk7-m3.3.x_build] [TASKS] Found 25 files to scan for tasks
[linux-jdk7-m3.3.x_build] [TASKS] Found 3 open tasks.
[linux-jdk7-m3.3.x_build] Skipping warnings blame since pipelines do not have an SCM link.%n
[Pipeline] [linux-jdk7-m3.5.x_build] }
[linux-jdk7-m3.5.x_build] [withMaven] artifactsPublisher - Archive artifact linux-jdk7-m3.5.x_build/pom.xml
under org/apache/maven/plugins/maven-war-plugin/3.2.3-SNAPSHOT/maven-war-plugin-3.2.3-SNAPSHOT.pom
[linux-jdk7-m3.5.x_build] [withMaven] artifactsPublisher - Archive artifact linux-jdk7-m3.5.x_build/target/maven-war-plugin-3.2.3-SNAPSHOT.jar
under org/apache/maven/plugins/maven-war-plugin/3.2.3-SNAPSHOT/maven-war-plugin-3.2.3-SNAPSHOT.jar
[linux-jdk7-m3.5.x_build] [Fast Archiver] No prior successful build to compare, so performing
full copy of artifacts
[linux-jdk7-m3.5.x_build] [withMaven] invokerPublisher - Archive invoker results for Maven
artifact MavenArtifact{org.apache.maven.plugins:maven-war-plugin::3.2.3-SNAPSHOT(version:
3.2.3-SNAPSHOT, snapshot:false) } generated by PluginInvocation{org.apache.maven.plugins:maven-invoker-plugin:3.1.0@integration-test
 integration-test}: linux-jdk7-m3.5.x_build/target/invoker-reports/*.xml
[linux-jdk7-m3.5.x_build] [withMaven] junitPublisher - Archive test results for Maven artifact
org.apache.maven.plugins:maven-war-plugin:3.2.3-SNAPSHOT generated by maven-surefire-plugin:test
(default-test): linux-jdk7-m3.5.x_build/target/surefire-reports/*.xml
[linux-jdk7-m3.5.x_build] Recording test results
[linux-jdk7-m3.5.x_build] [withMaven] openTasksPublisher - Scan Tasks for Maven artifact org.apache.maven.plugins:maven-war-plugin:3.2.3-SNAPSHOT
in source directory linux-jdk7-m3.5.x_build/src/main/java
[linux-jdk7-m3.5.x_build] [TASKS] Scanning folder '/home/jenkins/jenkins-slave/workspace/x_maven-war-plugin_MWAR-371-A2TGFFIOP6EYAINTDUT6BI4C24UCDLISOPQ5LHY6YOAV7C5HBHCA@2'
for files matching the pattern 'linux-jdk7-m3.5.x_build/src/main/java/**/*' - excludes: null
[linux-jdk7-m3.5.x_build] [TASKS] Found 25 files to scan for tasks
[linux-jdk7-m3.5.x_build] [TASKS] Found 3 open tasks.
[linux-jdk7-m3.5.x_build] Skipping warnings blame since pipelines do not have an SCM link.%n
[Pipeline] [linux-jdk8-m3.5.x_build] }
[linux-jdk8-m3.5.x_build] [withMaven] artifactsPublisher - Archive artifact linux-jdk8-m3.5.x_build/pom.xml
under org/apache/maven/plugins/maven-war-plugin/3.2.3-SNAPSHOT/maven-war-plugin-3.2.3-SNAPSHOT.pom
[linux-jdk8-m3.5.x_build] [withMaven] artifactsPublisher - Archive artifact linux-jdk8-m3.5.x_build/target/maven-war-plugin-3.2.3-SNAPSHOT.jar
under org/apache/maven/plugins/maven-war-plugin/3.2.3-SNAPSHOT/maven-war-plugin-3.2.3-SNAPSHOT.jar
[linux-jdk8-m3.5.x_build] [Fast Archiver] No prior successful build to compare, so performing
full copy of artifacts
[linux-jdk8-m3.5.x_build] [withMaven] invokerPublisher - Archive invoker results for Maven
artifact MavenArtifact{org.apache.maven.plugins:maven-war-plugin::3.2.3-SNAPSHOT(version:
3.2.3-SNAPSHOT, snapshot:false) } generated by PluginInvocation{org.apache.maven.plugins:maven-invoker-plugin:3.1.0@integration-test
 integration-test}: linux-jdk8-m3.5.x_build/target/invoker-reports/*.xml
[linux-jdk8-m3.5.x_build] [withMaven] junitPublisher - Archive test results for Maven artifact
org.apache.maven.plugins:maven-war-plugin:3.2.3-SNAPSHOT generated by maven-surefire-plugin:test
(default-test): linux-jdk8-m3.5.x_build/target/surefire-reports/*.xml
[linux-jdk8-m3.5.x_build] Recording test results
[linux-jdk8-m3.5.x_build] [withMaven] openTasksPublisher - Scan Tasks for Maven artifact org.apache.maven.plugins:maven-war-plugin:3.2.3-SNAPSHOT
in source directory linux-jdk8-m3.5.x_build/src/main/java
[linux-jdk8-m3.5.x_build] [TASKS] Scanning folder '/home/jenkins/jenkins-slave/workspace/x_maven-war-plugin_MWAR-371-A2TGFFIOP6EYAINTDUT6BI4C24UCDLISOPQ5LHY6YOAV7C5HBHCA@2'
for files matching the pattern 'linux-jdk8-m3.5.x_build/src/main/java/**/*' - excludes: null
[linux-jdk8-m3.5.x_build] [TASKS] Found 25 files to scan for tasks
[linux-jdk8-m3.5.x_build] [TASKS] Found 3 open tasks.
[linux-jdk8-m3.5.x_build] Skipping warnings blame since pipelines do not have an SCM link.%n
[Pipeline] [linux-jdk7-m3.3.x_build] // withMaven
[Pipeline] [linux-jdk7-m3.5.x_build] // withMaven
[Pipeline] [linux-jdk8-m3.5.x_build] // withMaven
[Pipeline] [linux-jdk7-m3.2.x_build] }
[Pipeline] [windows-jdk7-m3.2.x_build] }
[Pipeline] [windows-jdk7-m3.3.x_build] }
[Pipeline] [windows-jdk7-m3.5.x_build] }
[Pipeline] [linux-jdk7-m3.3.x_build] cleanWs
[Pipeline] [linux-jdk7-m3.5.x_build] cleanWs
[Pipeline] [windows-jdk11-m3.5.x_build] }
[Pipeline] [windows-jdk8-m3.5.x_build] }
[Pipeline] [linux-jdk8-m3.5.x_build] cleanWs
[Pipeline] [linux-jdk11-m3.5.x_build] }
[Pipeline] [linux-jdk7-m3.2.x_build] // stage
[Pipeline] [windows-jdk7-m3.2.x_build] // dir
[Pipeline] [windows-jdk7-m3.3.x_build] // dir
[Pipeline] [windows-jdk7-m3.5.x_build] // dir
[Pipeline] [windows-jdk11-m3.5.x_build] // dir
[Pipeline] [windows-jdk8-m3.5.x_build] // dir
[Pipeline] [linux-jdk11-m3.5.x_build] // dir
[linux-jdk7-m3.3.x_build] [WS-CLEANUP] Deleting project workspace...[WS-CLEANUP] done
[linux-jdk7-m3.5.x_build] [WS-CLEANUP] Deleting project workspace...[WS-CLEANUP] done
[linux-jdk8-m3.5.x_build] [WS-CLEANUP] Deleting project workspace...[WS-CLEANUP] done
[Pipeline] [linux-jdk7-m3.2.x_build] }
[Pipeline] [windows-jdk7-m3.2.x_build] }
[windows-jdk7-m3.2.x_build] [withMaven] artifactsPublisher - Archive artifact windows-jdk7-m3.2.x_build\pom.xml
under org\apache\maven\plugins\maven-war-plugin\3.2.3-SNAPSHOT\maven-war-plugin-3.2.3-SNAPSHOT.pom
[windows-jdk7-m3.2.x_build] [withMaven] artifactsPublisher - Archive artifact windows-jdk7-m3.2.x_build\target\maven-war-plugin-3.2.3-SNAPSHOT.jar
under org\apache\maven\plugins\maven-war-plugin\3.2.3-SNAPSHOT\maven-war-plugin-3.2.3-SNAPSHOT.jar
[windows-jdk7-m3.2.x_build] [Fast Archiver] No prior successful build to compare, so performing
full copy of artifacts
[windows-jdk7-m3.2.x_build] [withMaven] invokerPublisher - Archive invoker results for Maven
artifact MavenArtifact{org.apache.maven.plugins:maven-war-plugin::3.2.3-SNAPSHOT(version:
3.2.3-SNAPSHOT, snapshot:false) } generated by PluginInvocation{org.apache.maven.plugins:maven-invoker-plugin:3.1.0@integration-test
 integration-test}: windows-jdk7-m3.2.x_build\target\invoker-reports\*.xml
[windows-jdk7-m3.2.x_build] [withMaven] junitPublisher - Archive test results for Maven artifact
org.apache.maven.plugins:maven-war-plugin:3.2.3-SNAPSHOT generated by maven-surefire-plugin:test
(default-test): windows-jdk7-m3.2.x_build\target\surefire-reports\*.xml
[windows-jdk7-m3.2.x_build] Recording test results
[windows-jdk7-m3.2.x_build] [withMaven] openTasksPublisher - Scan Tasks for Maven artifact
org.apache.maven.plugins:maven-war-plugin:3.2.3-SNAPSHOT in source directory windows-jdk7-m3.2.x_build\src\main\java
[windows-jdk7-m3.2.x_build] [TASKS] Scanning folder 'f:\jenkins\jenkins-slave\workspace\x_maven-war-plugin_MWAR-371-A2TGFFIOP6EYAINTDUT6BI4C24UCDLISOPQ5LHY6YOAV7C5HBHCA@2'
for files matching the pattern 'windows-jdk7-m3.2.x_build\src\main\java\**\*' - excludes:
null
[windows-jdk7-m3.2.x_build] [TASKS] Found 25 files to scan for tasks
[windows-jdk7-m3.2.x_build] [TASKS] Found 3 open tasks.
[windows-jdk7-m3.2.x_build] Skipping warnings blame since pipelines do not have an SCM link.%n
[Pipeline] [windows-jdk7-m3.3.x_build] }
[windows-jdk7-m3.3.x_build] [withMaven] artifactsPublisher - Archive artifact windows-jdk7-m3.3.x_build\pom.xml
under org\apache\maven\plugins\maven-war-plugin\3.2.3-SNAPSHOT\maven-war-plugin-3.2.3-SNAPSHOT.pom
[windows-jdk7-m3.3.x_build] [withMaven] artifactsPublisher - Archive artifact windows-jdk7-m3.3.x_build\target\maven-war-plugin-3.2.3-SNAPSHOT.jar
under org\apache\maven\plugins\maven-war-plugin\3.2.3-SNAPSHOT\maven-war-plugin-3.2.3-SNAPSHOT.jar
[windows-jdk7-m3.3.x_build] [Fast Archiver] No prior successful build to compare, so performing
full copy of artifacts
[windows-jdk7-m3.3.x_build] [withMaven] invokerPublisher - Archive invoker results for Maven
artifact MavenArtifact{org.apache.maven.plugins:maven-war-plugin::3.2.3-SNAPSHOT(version:
3.2.3-SNAPSHOT, snapshot:false) } generated by PluginInvocation{org.apache.maven.plugins:maven-invoker-plugin:3.1.0@integration-test
 integration-test}: windows-jdk7-m3.3.x_build\target\invoker-reports\*.xml
[windows-jdk7-m3.3.x_build] [withMaven] junitPublisher - Archive test results for Maven artifact
org.apache.maven.plugins:maven-war-plugin:3.2.3-SNAPSHOT generated by maven-surefire-plugin:test
(default-test): windows-jdk7-m3.3.x_build\target\surefire-reports\*.xml
[windows-jdk7-m3.3.x_build] Recording test results
[windows-jdk7-m3.3.x_build] [withMaven] openTasksPublisher - Scan Tasks for Maven artifact
org.apache.maven.plugins:maven-war-plugin:3.2.3-SNAPSHOT in source directory windows-jdk7-m3.3.x_build\src\main\java
[windows-jdk7-m3.3.x_build] [TASKS] Scanning folder 'f:\jenkins\jenkins-slave\workspace\x_maven-war-plugin_MWAR-371-A2TGFFIOP6EYAINTDUT6BI4C24UCDLISOPQ5LHY6YOAV7C5HBHCA@3@2'
for files matching the pattern 'windows-jdk7-m3.3.x_build\src\main\java\**\*' - excludes:
null
[windows-jdk7-m3.3.x_build] [TASKS] Found 25 files to scan for tasks
[windows-jdk7-m3.3.x_build] [TASKS] Found 3 open tasks.
[windows-jdk7-m3.3.x_build] Skipping warnings blame since pipelines do not have an SCM link.%n
[Pipeline] [windows-jdk7-m3.5.x_build] }
[windows-jdk7-m3.5.x_build] [withMaven] artifactsPublisher - Archive artifact windows-jdk7-m3.5.x_build\pom.xml
under org\apache\maven\plugins\maven-war-plugin\3.2.3-SNAPSHOT\maven-war-plugin-3.2.3-SNAPSHOT.pom
[windows-jdk7-m3.5.x_build] [withMaven] artifactsPublisher - Archive artifact windows-jdk7-m3.5.x_build\target\maven-war-plugin-3.2.3-SNAPSHOT.jar
under org\apache\maven\plugins\maven-war-plugin\3.2.3-SNAPSHOT\maven-war-plugin-3.2.3-SNAPSHOT.jar
[windows-jdk7-m3.5.x_build] [Fast Archiver] No prior successful build to compare, so performing
full copy of artifacts
[windows-jdk7-m3.5.x_build] [withMaven] invokerPublisher - Archive invoker results for Maven
artifact MavenArtifact{org.apache.maven.plugins:maven-war-plugin::3.2.3-SNAPSHOT(version:
3.2.3-SNAPSHOT, snapshot:false) } generated by PluginInvocation{org.apache.maven.plugins:maven-invoker-plugin:3.1.0@integration-test
 integration-test}: windows-jdk7-m3.5.x_build\target\invoker-reports\*.xml
[windows-jdk7-m3.5.x_build] [withMaven] junitPublisher - Archive test results for Maven artifact
org.apache.maven.plugins:maven-war-plugin:3.2.3-SNAPSHOT generated by maven-surefire-plugin:test
(default-test): windows-jdk7-m3.5.x_build\target\surefire-reports\*.xml
[windows-jdk7-m3.5.x_build] Recording test results
[windows-jdk7-m3.5.x_build] [withMaven] openTasksPublisher - Scan Tasks for Maven artifact
org.apache.maven.plugins:maven-war-plugin:3.2.3-SNAPSHOT in source directory windows-jdk7-m3.5.x_build\src\main\java
[windows-jdk7-m3.5.x_build] [TASKS] Scanning folder 'f:\jenkins\jenkins-slave\workspace\x_maven-war-plugin_MWAR-371-A2TGFFIOP6EYAINTDUT6BI4C24UCDLISOPQ5LHY6YOAV7C5HBHCA@2'
for files matching the pattern 'windows-jdk7-m3.5.x_build\src\main\java\**\*' - excludes:
null
[windows-jdk7-m3.5.x_build] [TASKS] Found 25 files to scan for tasks
[windows-jdk7-m3.5.x_build] [TASKS] Found 3 open tasks.
[windows-jdk7-m3.5.x_build] Skipping warnings blame since pipelines do not have an SCM link.%n
[Pipeline] [windows-jdk11-m3.5.x_build] }
[windows-jdk11-m3.5.x_build] [withMaven] artifactsPublisher - Archive artifact windows-jdk11-m3.5.x_build\pom.xml
under org\apache\maven\plugins\maven-war-plugin\3.2.3-SNAPSHOT\maven-war-plugin-3.2.3-SNAPSHOT.pom
[windows-jdk11-m3.5.x_build] [withMaven] artifactsPublisher - Archive artifact windows-jdk11-m3.5.x_build\target\maven-war-plugin-3.2.3-SNAPSHOT.jar
under org\apache\maven\plugins\maven-war-plugin\3.2.3-SNAPSHOT\maven-war-plugin-3.2.3-SNAPSHOT.jar
[windows-jdk11-m3.5.x_build] [Fast Archiver] No prior successful build to compare, so performing
full copy of artifacts
[windows-jdk11-m3.5.x_build] [withMaven] invokerPublisher - Archive invoker results for Maven
artifact MavenArtifact{org.apache.maven.plugins:maven-war-plugin::3.2.3-SNAPSHOT(version:
3.2.3-SNAPSHOT, snapshot:false) } generated by PluginInvocation{org.apache.maven.plugins:maven-invoker-plugin:3.1.0@integration-test
 integration-test}: windows-jdk11-m3.5.x_build\target\invoker-reports\*.xml
[windows-jdk11-m3.5.x_build] [withMaven] junitPublisher - Archive test results for Maven artifact
org.apache.maven.plugins:maven-war-plugin:3.2.3-SNAPSHOT generated by maven-surefire-plugin:test
(default-test): windows-jdk11-m3.5.x_build\target\surefire-reports\*.xml
[windows-jdk11-m3.5.x_build] Recording test results
[windows-jdk11-m3.5.x_build] [withMaven] openTasksPublisher - Scan Tasks for Maven artifact
org.apache.maven.plugins:maven-war-plugin:3.2.3-SNAPSHOT in source directory windows-jdk11-m3.5.x_build\src\main\java
[windows-jdk11-m3.5.x_build] [TASKS] Scanning folder 'f:\jenkins\jenkins-slave\workspace\x_maven-war-plugin_MWAR-371-A2TGFFIOP6EYAINTDUT6BI4C24UCDLISOPQ5LHY6YOAV7C5HBHCA@3@2'
for files matching the pattern 'windows-jdk11-m3.5.x_build\src\main\java\**\*' - excludes:
null
[windows-jdk11-m3.5.x_build] [TASKS] Found 25 files to scan for tasks
[windows-jdk11-m3.5.x_build] [TASKS] Found 3 open tasks.
[windows-jdk11-m3.5.x_build] Skipping warnings blame since pipelines do not have an SCM link.%n
[Pipeline] [windows-jdk8-m3.5.x_build] }
[windows-jdk8-m3.5.x_build] [withMaven] artifactsPublisher - Archive artifact windows-jdk8-m3.5.x_build\pom.xml
under org\apache\maven\plugins\maven-war-plugin\3.2.3-SNAPSHOT\maven-war-plugin-3.2.3-SNAPSHOT.pom
[windows-jdk8-m3.5.x_build] [withMaven] artifactsPublisher - Archive artifact windows-jdk8-m3.5.x_build\target\maven-war-plugin-3.2.3-SNAPSHOT.jar
under org\apache\maven\plugins\maven-war-plugin\3.2.3-SNAPSHOT\maven-war-plugin-3.2.3-SNAPSHOT.jar
[windows-jdk8-m3.5.x_build] [Fast Archiver] No prior successful build to compare, so performing
full copy of artifacts
[windows-jdk8-m3.5.x_build] [withMaven] invokerPublisher - Archive invoker results for Maven
artifact MavenArtifact{org.apache.maven.plugins:maven-war-plugin::3.2.3-SNAPSHOT(version:
3.2.3-SNAPSHOT, snapshot:false) } generated by PluginInvocation{org.apache.maven.plugins:maven-invoker-plugin:3.1.0@integration-test
 integration-test}: windows-jdk8-m3.5.x_build\target\invoker-reports\*.xml
[windows-jdk8-m3.5.x_build] [withMaven] junitPublisher - Archive test results for Maven artifact
org.apache.maven.plugins:maven-war-plugin:3.2.3-SNAPSHOT generated by maven-surefire-plugin:test
(default-test): windows-jdk8-m3.5.x_build\target\surefire-reports\*.xml
[windows-jdk8-m3.5.x_build] Recording test results
[windows-jdk8-m3.5.x_build] [withMaven] openTasksPublisher - Scan Tasks for Maven artifact
org.apache.maven.plugins:maven-war-plugin:3.2.3-SNAPSHOT in source directory windows-jdk8-m3.5.x_build\src\main\java
[windows-jdk8-m3.5.x_build] [TASKS] Scanning folder 'f:\jenkins\jenkins-slave\workspace\x_maven-war-plugin_MWAR-371-A2TGFFIOP6EYAINTDUT6BI4C24UCDLISOPQ5LHY6YOAV7C5HBHCA@2'
for files matching the pattern 'windows-jdk8-m3.5.x_build\src\main\java\**\*' - excludes:
null
[windows-jdk8-m3.5.x_build] [TASKS] Found 25 files to scan for tasks
[windows-jdk8-m3.5.x_build] [TASKS] Found 3 open tasks.
[windows-jdk8-m3.5.x_build] Skipping warnings blame since pipelines do not have an SCM link.%n
[Pipeline] [linux-jdk11-m3.5.x_build] }
[linux-jdk11-m3.5.x_build] [withMaven] artifactsPublisher - Archive artifact linux-jdk11-m3.5.x_build/pom.xml
under org/apache/maven/plugins/maven-war-plugin/3.2.3-SNAPSHOT/maven-war-plugin-3.2.3-SNAPSHOT.pom
[linux-jdk11-m3.5.x_build] [withMaven] artifactsPublisher - Archive artifact linux-jdk11-m3.5.x_build/target/maven-war-plugin-3.2.3-SNAPSHOT.jar
under org/apache/maven/plugins/maven-war-plugin/3.2.3-SNAPSHOT/maven-war-plugin-3.2.3-SNAPSHOT.jar
[linux-jdk11-m3.5.x_build] [Fast Archiver] No prior successful build to compare, so performing
full copy of artifacts
[linux-jdk11-m3.5.x_build] [withMaven] invokerPublisher - Archive invoker results for Maven
artifact MavenArtifact{org.apache.maven.plugins:maven-war-plugin::3.2.3-SNAPSHOT(version:
3.2.3-SNAPSHOT, snapshot:false) } generated by PluginInvocation{org.apache.maven.plugins:maven-invoker-plugin:3.1.0@integration-test
 integration-test}: linux-jdk11-m3.5.x_build/target/invoker-reports/*.xml
[linux-jdk11-m3.5.x_build] [withMaven] junitPublisher - Archive test results for Maven artifact
org.apache.maven.plugins:maven-war-plugin:3.2.3-SNAPSHOT generated by maven-surefire-plugin:test
(default-test): linux-jdk11-m3.5.x_build/target/surefire-reports/*.xml
[linux-jdk11-m3.5.x_build] Recording test results
[linux-jdk11-m3.5.x_build] [withMaven] openTasksPublisher - Scan Tasks for Maven artifact
org.apache.maven.plugins:maven-war-plugin:3.2.3-SNAPSHOT in source directory linux-jdk11-m3.5.x_build/src/main/java
[linux-jdk11-m3.5.x_build] [TASKS] Scanning folder '/home/jenkins/jenkins-slave/workspace/x_maven-war-plugin_MWAR-371-A2TGFFIOP6EYAINTDUT6BI4C24UCDLISOPQ5LHY6YOAV7C5HBHCA@2'
for files matching the pattern 'linux-jdk11-m3.5.x_build/src/main/java/**/*' - excludes: null
[linux-jdk11-m3.5.x_build] [TASKS] Found 25 files to scan for tasks
[linux-jdk11-m3.5.x_build] [TASKS] Found 3 open tasks.
[linux-jdk11-m3.5.x_build] Skipping warnings blame since pipelines do not have an SCM link.%n
[Pipeline] [linux-jdk7-m3.2.x_build] // ws
[Pipeline] [windows-jdk7-m3.2.x_build] // withMaven
[Pipeline] [windows-jdk7-m3.3.x_build] // withMaven
[Pipeline] [windows-jdk7-m3.5.x_build] // withMaven
[Pipeline] [windows-jdk11-m3.5.x_build] // withMaven
[Pipeline] [windows-jdk8-m3.5.x_build] // withMaven
[Pipeline] [linux-jdk11-m3.5.x_build] // withMaven
[Pipeline] [linux-jdk7-m3.2.x_build] }
[Pipeline] [windows-jdk7-m3.2.x_build] cleanWs
[windows-jdk7-m3.2.x_build] [WS-CLEANUP] Deleting project workspace...Cannot delete workspace
:remote file operation failed: f:\jenkins\jenkins-slave\workspace\x_maven-war-plugin_MWAR-371-A2TGFFIOP6EYAINTDUT6BI4C24UCDLISOPQ5LHY6YOAV7C5HBHCA@2
at hudson.remoting.Channel@121270d5:JNLP4-connect connection from 37.48.69.226/37.48.69.226:54213:
java.nio.file.AccessDeniedException: f:\jenkins\jenkins-slave\workspace\x_maven-war-plugin_MWAR-371-A2TGFFIOP6EYAINTDUT6BI4C24UCDLISOPQ5LHY6YOAV7C5HBHCA@2
-> f:\jenkins\jenkins-slave\workspace\x_maven-war-plugin_MWAR-371-A2TGFFIOP6EYAINTDUT6BI4C24UCDLISOPQ5LHY6YOAV7C5HBHCA@2_ws-cleanup_1545997260813
[Pipeline] [windows-jdk7-m3.3.x_build] cleanWs
[windows-jdk7-m3.3.x_build] [WS-CLEANUP] Deleting project workspace...Cannot delete workspace
:remote file operation failed: f:\jenkins\jenkins-slave\workspace\x_maven-war-plugin_MWAR-371-A2TGFFIOP6EYAINTDUT6BI4C24UCDLISOPQ5LHY6YOAV7C5HBHCA@3@2
at hudson.remoting.Channel@121270d5:JNLP4-connect connection from 37.48.69.226/37.48.69.226:54213:
java.nio.file.AccessDeniedException: f:\jenkins\jenkins-slave\workspace\x_maven-war-plugin_MWAR-371-A2TGFFIOP6EYAINTDUT6BI4C24UCDLISOPQ5LHY6YOAV7C5HBHCA@3@2
-> f:\jenkins\jenkins-slave\workspace\x_maven-war-plugin_MWAR-371-A2TGFFIOP6EYAINTDUT6BI4C24UCDLISOPQ5LHY6YOAV7C5HBHCA@3@2_ws-cleanup_1545997260815
[Pipeline] [windows-jdk7-m3.5.x_build] cleanWs
[windows-jdk7-m3.5.x_build] [WS-CLEANUP] Deleting project workspace...Cannot delete workspace
:remote file operation failed: f:\jenkins\jenkins-slave\workspace\x_maven-war-plugin_MWAR-371-A2TGFFIOP6EYAINTDUT6BI4C24UCDLISOPQ5LHY6YOAV7C5HBHCA@2
at hudson.remoting.Channel@4ee2423:JNLP4-connect connection from 37.48.69.226/37.48.69.226:64887:
java.nio.file.AccessDeniedException: f:\jenkins\jenkins-slave\workspace\x_maven-war-plugin_MWAR-371-A2TGFFIOP6EYAINTDUT6BI4C24UCDLISOPQ5LHY6YOAV7C5HBHCA@2
-> f:\jenkins\jenkins-slave\workspace\x_maven-war-plugin_MWAR-371-A2TGFFIOP6EYAINTDUT6BI4C24UCDLISOPQ5LHY6YOAV7C5HBHCA@2_ws-cleanup_1545997260826
[Pipeline] [linux-jdk7-m3.3.x_build] }
[Pipeline] [linux-jdk7-m3.5.x_build] }
[Pipeline] [windows-jdk11-m3.5.x_build] cleanWs
[Pipeline] [windows-jdk8-m3.5.x_build] cleanWs
[Pipeline] [linux-jdk8-m3.5.x_build] }
[Pipeline] [linux-jdk11-m3.5.x_build] cleanWs
[Pipeline] [linux-jdk7-m3.2.x_build] // node
[Pipeline] [linux-jdk7-m3.3.x_build] // stage
[Pipeline] [linux-jdk7-m3.5.x_build] // stage
[Pipeline] [linux-jdk8-m3.5.x_build] // stage
[Pipeline] [linux-jdk7-m3.2.x_build] }
[Pipeline] [windows-jdk7-m3.2.x_build] }
[Pipeline] [windows-jdk7-m3.3.x_build] }
[Pipeline] [windows-jdk7-m3.5.x_build] }
[Pipeline] [linux-jdk7-m3.3.x_build] }
[Pipeline] [linux-jdk7-m3.5.x_build] }
[Pipeline] [linux-jdk8-m3.5.x_build] }
[Pipeline] [windows-jdk7-m3.2.x_build] // stage
[Pipeline] [windows-jdk7-m3.3.x_build] // stage
[Pipeline] [windows-jdk7-m3.5.x_build] // stage
[Pipeline] [linux-jdk7-m3.3.x_build] // ws
[Pipeline] [linux-jdk7-m3.5.x_build] // ws
[windows-jdk11-m3.5.x_build] [WS-CLEANUP] Deleting project workspace...Cannot delete workspace
:remote file operation failed: f:\jenkins\jenkins-slave\workspace\x_maven-war-plugin_MWAR-371-A2TGFFIOP6EYAINTDUT6BI4C24UCDLISOPQ5LHY6YOAV7C5HBHCA@3@2
at hudson.remoting.Channel@398d98d3:JNLP4-connect connection from ec2-34-228-168-168.compute-1.amazonaws.com/34.228.168.168:51626:
java.nio.file.AccessDeniedException: f:\jenkins\jenkins-slave\workspace\x_maven-war-plugin_MWAR-371-A2TGFFIOP6EYAINTDUT6BI4C24UCDLISOPQ5LHY6YOAV7C5HBHCA@3@2
-> f:\jenkins\jenkins-slave\workspace\x_maven-war-plugin_MWAR-371-A2TGFFIOP6EYAINTDUT6BI4C24UCDLISOPQ5LHY6YOAV7C5HBHCA@3@2_ws-cleanup_1545997261018
[windows-jdk8-m3.5.x_build] [WS-CLEANUP] Deleting project workspace...Cannot delete workspace
:remote file operation failed: f:\jenkins\jenkins-slave\workspace\x_maven-war-plugin_MWAR-371-A2TGFFIOP6EYAINTDUT6BI4C24UCDLISOPQ5LHY6YOAV7C5HBHCA@2
at hudson.remoting.Channel@398d98d3:JNLP4-connect connection from ec2-34-228-168-168.compute-1.amazonaws.com/34.228.168.168:51626:
java.nio.file.AccessDeniedException: f:\jenkins\jenkins-slave\workspace\x_maven-war-plugin_MWAR-371-A2TGFFIOP6EYAINTDUT6BI4C24UCDLISOPQ5LHY6YOAV7C5HBHCA@2
-> f:\jenkins\jenkins-slave\workspace\x_maven-war-plugin_MWAR-371-A2TGFFIOP6EYAINTDUT6BI4C24UCDLISOPQ5LHY6YOAV7C5HBHCA@2_ws-cleanup_1545997261024
[Pipeline] [linux-jdk8-m3.5.x_build] // ws
[Pipeline] [windows-jdk7-m3.2.x_build] }
[Pipeline] [windows-jdk7-m3.3.x_build] }
[Pipeline] [windows-jdk7-m3.5.x_build] }
[Pipeline] [linux-jdk7-m3.3.x_build] }
[Pipeline] [linux-jdk7-m3.5.x_build] }
[Pipeline] [linux-jdk8-m3.5.x_build] }
[Pipeline] [windows-jdk11-m3.5.x_build] }
[Pipeline] [windows-jdk8-m3.5.x_build] }
[Pipeline] [windows-jdk7-m3.2.x_build] // ws
[Pipeline] [windows-jdk7-m3.3.x_build] // ws
[Pipeline] [windows-jdk7-m3.5.x_build] // ws
[Pipeline] [linux-jdk7-m3.3.x_build] // node
[Pipeline] [linux-jdk7-m3.5.x_build] // node
[Pipeline] [linux-jdk8-m3.5.x_build] // node
[Pipeline] [linux-jdk7-m3.3.x_build] }
[Pipeline] [linux-jdk7-m3.5.x_build] }
[Pipeline] [linux-jdk8-m3.5.x_build] }
[Pipeline] [windows-jdk7-m3.2.x_build] }
[Pipeline] [windows-jdk7-m3.3.x_build] }
[Pipeline] [windows-jdk7-m3.5.x_build] }
[Pipeline] [windows-jdk11-m3.5.x_build] // stage
[Pipeline] [windows-jdk8-m3.5.x_build] // stage
[linux-jdk11-m3.5.x_build] [WS-CLEANUP] Deleting project workspace...[WS-CLEANUP] done
[Pipeline] [windows-jdk8-m3.5.x_build] }
[Pipeline] [windows-jdk11-m3.5.x_build] }
[Pipeline] [windows-jdk7-m3.2.x_build] // node
[Pipeline] [windows-jdk7-m3.3.x_build] // node
[Pipeline] [windows-jdk7-m3.5.x_build] // node
[Pipeline] [windows-jdk7-m3.2.x_build] }
[windows-jdk7-m3.2.x_build] Failed in branch windows-jdk7-m3.2.x_build
[Pipeline] [windows-jdk7-m3.3.x_build] }
[windows-jdk7-m3.3.x_build] Failed in branch windows-jdk7-m3.3.x_build
[Pipeline] [windows-jdk7-m3.5.x_build] }
[windows-jdk7-m3.5.x_build] Failed in branch windows-jdk7-m3.5.x_build
[Pipeline] [windows-jdk8-m3.5.x_build] // ws
[Pipeline] [windows-jdk11-m3.5.x_build] // ws
[Pipeline] [windows-jdk8-m3.5.x_build] }
[Pipeline] [windows-jdk11-m3.5.x_build] }
[Pipeline] [linux-jdk11-m3.5.x_build] }
[Pipeline] [windows-jdk8-m3.5.x_build] // node
[Pipeline] [windows-jdk11-m3.5.x_build] // node
[Pipeline] [linux-jdk11-m3.5.x_build] // stage
[Pipeline] [windows-jdk8-m3.5.x_build] }
[windows-jdk8-m3.5.x_build] Failed in branch windows-jdk8-m3.5.x_build
[Pipeline] [windows-jdk11-m3.5.x_build] }
[windows-jdk11-m3.5.x_build] Failed in branch windows-jdk11-m3.5.x_build
[Pipeline] [linux-jdk11-m3.5.x_build] }
[Pipeline] [linux-jdk11-m3.5.x_build] // ws
[Pipeline] [linux-jdk11-m3.5.x_build] }
[Pipeline] [linux-jdk11-m3.5.x_build] // node
[Pipeline] [linux-jdk11-m3.5.x_build] }
[Pipeline] // parallel
[Pipeline] stage
[Pipeline] { (Notifications)
[Pipeline] echo
Build result: FAILURE
[Pipeline] jiraIssueSelector
[Pipeline] emailext
Mime
  • Unnamed multipart/mixed (inline, None, 0 bytes)
View raw message